FAQ

Search Discussions

26 discussions - 215 posts

  • ===================================================================== FAILED TEST SUMMARY --------------------------------------------------------------------- function with many parameters ...
    NoreplyNoreply
    May 7, 2009 at 9:54 pm
    May 31, 2009 at 8:50 pm
  • ===================================================================== FAILED TEST SUMMARY --------------------------------------------------------------------- Bug #48058 (Year formatter goes wrong ...
    NoreplyNoreply
    May 7, 2009 at 6:38 pm
    May 31, 2009 at 6:44 pm
  • ===================================================================== FAILED TEST SUMMARY --------------------------------------------------------------------- Test DateTimeZone::getOffset() function ...
    NoreplyNoreply
    May 1, 2009 at 9:14 pm
    May 7, 2009 at 4:45 pm
  • ===================================================================== FAILED TEST SUMMARY --------------------------------------------------------------------- Test gmstrftime() function : usage ...
    NoreplyNoreply
    May 1, 2009 at 12:02 am
    May 6, 2009 at 1:19 pm
  • ===================================================================== FAILED TEST SUMMARY --------------------------------------------------------------------- Bug #22592 (cascading assignments to ...
    NoreplyNoreply
    May 28, 2009 at 8:39 am
    May 30, 2009 at 2:00 pm
  • ===================================================================== FAILED TEST SUMMARY --------------------------------------------------------------------- Bug #22592 (cascading assignments to ...
    NoreplyNoreply
    May 29, 2009 at 12:15 pm
    May 31, 2009 at 1:43 am
  • Scott NScott N
    May 8, 2009 at 2:19 pm
    May 8, 2009 at 2:30 pm
  • <<php_test_results_20090531_1044.txt
    Wenrui GuoWenrui Guo
    May 31, 2009 at 11:00 am
    May 31, 2009 at 11:00 am
  • here you have the test results as requested, best regards, Corrado
    CfboxCfbox
    May 31, 2009 at 8:45 am
    May 31, 2009 at 8:45 am
  • ____________ <<php_test_results_20090528_1441.txt Paolo Maffioli ENGINEERING.IT S.p.A. Via Orvieto, 19 - Torino e-mail: paolo.maffioli@eng.it
    Maffioli, PaoloMaffioli, Paolo
    May 29, 2009 at 7:30 am
    May 29, 2009 at 7:30 am
  • hello, this is the test report generated while compiling php on ubuntu 8.10. -- With best wishes, Anup Wattamwar
    ANUP...ANUP...
    May 28, 2009 at 8:00 am
    May 28, 2009 at 8:00 am
  • Attached are php test errors.
    Taylor RaackTaylor Raack
    May 27, 2009 at 5:30 pm
    May 27, 2009 at 5:30 pm
  • To whom it may concern: After failing to get my Fedora Core 4 implementation of PHP running successfully, I built up a new Linux node based on the gNewSense distribution. Please find attached the ...
    Dale H. ShipmanDale H. Shipman
    May 27, 2009 at 2:02 pm
    May 27, 2009 at 2:02 pm
  • php_test_results_20090524_2358
    Mario A. Valdez-RamírezMario A. Valdez-Ramírez
    May 25, 2009 at 5:07 am
    May 25, 2009 at 5:07 am
  • ===================================================================== FAILED TEST SUMMARY --------------------------------------------------------------------- unixtojd() ...
    Tobias WöllTobias Wöll
    May 24, 2009 at 3:45 pm
    May 24, 2009 at 3:45 pm
  • Ron LewisRon Lewis
    May 23, 2009 at 11:15 pm
    May 23, 2009 at 11:15 pm
  • To whom it may concern; I reinstalled PHP 5.2.9 on my Fedora (FC4) Linux box this evening to enable some new features and the attached error report was generated. Best regards, Dale
    Dale H. ShipmanDale H. Shipman
    May 20, 2009 at 3:25 am
    May 20, 2009 at 3:25 am
  • ===================================================================== FAILED TEST SUMMARY --------------------------------------------------------------------- Bug #43128 (Very long class name causes ...
    Claudio ThomasClaudio Thomas
    May 15, 2009 at 2:24 pm
    May 15, 2009 at 2:24 pm
  • Dr. Müller NorbertDr. Müller Norbert
    May 13, 2009 at 8:00 pm
    May 13, 2009 at 8:00 pm
  • The message is ready to be sent with the following file or link attachments: php_test_results_20090513_0950.txt Note: To protect against computer viruses, e-mail programs may prevent sending or ...
    Steve BekusSteve Bekus
    May 13, 2009 at 1:00 pm
    May 13, 2009 at 1:00 pm
  • --------------------------------------------------------------- Andrew Hawkins Trinity Mirror IT Software Developer (Southport) Tel : 01704 398964 Mob : 07990 562264 Email : ...
    Andrew HawkinsAndrew Hawkins
    May 11, 2009 at 10:17 am
    May 11, 2009 at 10:17 am
  • Ulrich RaitzschUlrich Raitzsch
    May 11, 2009 at 7:30 am
    May 11, 2009 at 7:30 am
  • What if we could show you a real system you can use to put $500 - $1,500 per day into your account, working from the comfort of your home? Would you be interested? Online advertising has skyrocketed ...
    Denton SullivanDenton Sullivan
    May 8, 2009 at 4:16 pm
    May 8, 2009 at 4:16 pm
  • -- Andrea Lisci Infrastructure Technology Area Specialist Akhela - Operations key fingerprint 9DEA A69C B0F6 CCFD 4FDB 77EF 3350 C680 1A79 3CDB Tel. +39 070 2466 1377 e-mail andrea.lisci@akhela.com
    Andrea LisciAndrea Lisci
    May 6, 2009 at 4:45 pm
    May 6, 2009 at 4:45 pm
  • -- Sem mais para o momento, Rodrigo Souza -------------------------------------------------------------------------------- :: Rodrigo Souza dos Santos :: Curitiba - Brasil :: ...
    Rodrigo SouzaRodrigo Souza
    May 5, 2009 at 6:41 pm
    May 5, 2009 at 6:41 pm
  • -- Sem mais para o momento, Rodrigo Souza -------------------------------------------------------------------------------- :: Rodrigo Souza dos Santos :: Curitiba - Brasil :: ...
    Rodrigo SouzaRodrigo Souza
    May 4, 2009 at 2:00 pm
    May 4, 2009 at 2:00 pm
Group Navigation
period‹ prev | May 2009 | next ›
Group Overview
groupphp-qa-reports @
categoriesphp
discussions26
posts215
users19
websiteqa.php.net
Archives