FAQ
To whom it may engage...

This is an automated request, but not an unsolicited one. For
more information please visit http://gump.apache.org/nagged.html,
and/or contact the folk at general@gump.apache.org.

Project fulcrum-yaafi-crypto has an issue affecting its community integration.
This issue affects 1 projects,
and has been outstanding for 501 runs.
The current state of this project is 'Failed', with reason 'Build Failed'.
For reference only, the following projects are affected by this:
- fulcrum-yaafi-crypto : Services Framework


Full details are available at:
http://vmgump.apache.org/gump/public/turbine-fulcrum/fulcrum-yaafi-crypto/index.html

That said, some information snippets are provided here.

The following annotations (debug/informational/warning/error messages) were provided:
-DEBUG- Sole jar output [fulcrum-yaafi-crypto-*[0-9T].jar] identifier set to project name
-DEBUG- (Apache Gump generated) Apache Maven Settings in: /srv/gump/public/workspace/turbine-fulcrum/yaafi-crypto/gump_mvn_settings.xml
-INFO- Failed with reason build failed
-DEBUG- Maven POM in: /srv/gump/public/workspace/turbine-fulcrum/yaafi-crypto/pom.xml
-DEBUG- Extracted fallback artifacts from Gump Repository



The following work was performed:
http://vmgump.apache.org/gump/public/turbine-fulcrum/fulcrum-yaafi-crypto/gump_work/build_turbine-fulcrum_fulcrum-yaafi-crypto.html
Work Name: build_turbine-fulcrum_fulcrum-yaafi-crypto (Type: Build)
Work ended in a state of : Failed
Elapsed: 2 secs
Command Line: /opt/maven2/bin/mvn --batch-mode --settings /srv/gump/public/workspace/turbine-fulcrum/yaafi-crypto/gump_mvn_settings.xml package
[Working Directory: /srv/gump/public/workspace/turbine-fulcrum/yaafi-crypto]
M2_HOME: /opt/maven2
---------------------------------------------
at org.apache.maven.cli.compat.CompatibleMain.main(CompatibleMain.java:60)
at sun.reflect.NativeMethodAccessorImpl.invoke0(Native Method)
at sun.reflect.NativeMethodAccessorImpl.invoke(NativeMethodAccessorImpl.java:57)
at sun.reflect.DelegatingMethodAccessorImpl.invoke(DelegatingMethodAccessorImpl.java:43)
at java.lang.reflect.Method.invoke(Method.java:601)
at org.codehaus.classworlds.Launcher.launchEnhanced(Launcher.java:315)
at org.codehaus.classworlds.Launcher.launch(Launcher.java:255)
at org.codehaus.classworlds.Launcher.mainWithExitCode(Launcher.java:430)
at org.codehaus.classworlds.Launcher.main(Launcher.java:375)
Caused by: org.apache.maven.project.ProjectBuildingException: Cannot find parent: org.apache.fulcrum:fulcrum-parent for project: null:fulcrum-yaafi-crypto:jar:1.0.7-SNAPSHOT for project null:fulcrum-yaafi-crypto:jar:1.0.7-SNAPSHOT
at org.apache.maven.project.DefaultMavenProjectBuilder.assembleLineage(DefaultMavenProjectBuilder.java:1396)
at org.apache.maven.project.DefaultMavenProjectBuilder.buildInternal(DefaultMavenProjectBuilder.java:823)
at org.apache.maven.project.DefaultMavenProjectBuilder.buildFromSourceFileInternal(DefaultMavenProjectBuilder.java:508)
at org.apache.maven.project.DefaultMavenProjectBuilder.build(DefaultMavenProjectBuilder.java:200)
at org.apache.maven.DefaultMaven.getProject(DefaultMaven.java:604)
at org.apache.maven.DefaultMaven.collectProjects(DefaultMaven.java:487)
at org.apache.maven.DefaultMaven.getProjects(DefaultMaven.java:391)
... 12 more
Caused by: org.apache.maven.project.ProjectBuildingException: POM 'org.apache.fulcrum:fulcrum-parent' not found in repository: Unable to download the artifact from any repository

org.apache.fulcrum:fulcrum-parent:pom:1

from the specified remote repositories:
gump-central (http://localhost:8192/maven2)

for project org.apache.fulcrum:fulcrum-parent
at org.apache.maven.project.DefaultMavenProjectBuilder.findModelFromRepository(DefaultMavenProjectBuilder.java:605)
at org.apache.maven.project.DefaultMavenProjectBuilder.assembleLineage(DefaultMavenProjectBuilder.java:1392)
... 18 more
Caused by: org.apache.maven.artifact.resolver.ArtifactNotFoundException: Unable to download the artifact from any repository

org.apache.fulcrum:fulcrum-parent:pom:1

from the specified remote repositories:
gump-central (http://localhost:8192/maven2)


at org.apache.maven.artifact.resolver.DefaultArtifactResolver.resolve(DefaultArtifactResolver.java:228)
at org.apache.maven.artifact.resolver.DefaultArtifactResolver.resolve(DefaultArtifactResolver.java:90)
at org.apache.maven.project.DefaultMavenProjectBuilder.findModelFromRepository(DefaultMavenProjectBuilder.java:558)
... 19 more
Caused by: org.apache.maven.wagon.ResourceDoesNotExistException: Unable to download the artifact from any repository
at org.apache.maven.artifact.manager.DefaultWagonManager.getArtifact(DefaultWagonManager.java:404)
at org.apache.maven.artifact.resolver.DefaultArtifactResolver.resolve(DefaultArtifactResolver.java:216)
... 21 more
[INFO] ------------------------------------------------------------------------
[INFO] Total time: 1 second
[INFO] Finished at: Sat Sep 08 01:10:55 UTC 2012
[INFO] Final Memory: 3M/15M
[INFO] ------------------------------------------------------------------------
---------------------------------------------

To subscribe to this information via syndicated feeds:
- RSS: http://vmgump.apache.org/gump/public/turbine-fulcrum/fulcrum-yaafi-crypto/rss.xml
- Atom: http://vmgump.apache.org/gump/public/turbine-fulcrum/fulcrum-yaafi-crypto/atom.xml

============================== Gump Tracking Only ===
Produced by Apache Gump(TM) version 2.3.
Gump Run 12000008092012, vmgump.apache.org:vmgump:12000008092012
Gump E-mail Identifier (unique within run) #7.

--
Apache Gump
http://gump.apache.org/ [Instance: vmgump]

---------------------------------------------------------------------
To unsubscribe, e-mail: dev-unsubscribe@turbine.apache.org
For additional commands, e-mail: dev-help@turbine.apache.org

Search Discussions

  • Anonymous at Sep 8, 2012 at 1:10 pm
    To whom it may engage...

    This is an automated request, but not an unsolicited one. For
    more information please visit http://gump.apache.org/nagged.html,
    and/or contact the folk at general@gump.apache.org.

    Project fulcrum-yaafi-crypto has an issue affecting its community integration.
    This issue affects 1 projects.
    The current state of this project is 'Failed', with reason 'Build Failed'.
    For reference only, the following projects are affected by this:
    - fulcrum-yaafi-crypto : Services Framework


    Full details are available at:
    http://vmgump.apache.org/gump/public/turbine-fulcrum/fulcrum-yaafi-crypto/index.html

    That said, some information snippets are provided here.

    The following annotations (debug/informational/warning/error messages) were provided:
    -DEBUG- Sole jar output [fulcrum-yaafi-crypto-*[0-9T].jar] identifier set to project name
    -DEBUG- (Apache Gump generated) Apache Maven Settings in: /srv/gump/public/workspace/turbine-fulcrum/yaafi-crypto/gump_mvn_settings.xml
    -INFO- Failed with reason build failed
    -DEBUG- Maven POM in: /srv/gump/public/workspace/turbine-fulcrum/yaafi-crypto/pom.xml
    -INFO- Failed to extract fallback artifacts from Gump Repository



    The following work was performed:
    http://vmgump.apache.org/gump/public/turbine-fulcrum/fulcrum-yaafi-crypto/gump_work/build_turbine-fulcrum_fulcrum-yaafi-crypto.html
    Work Name: build_turbine-fulcrum_fulcrum-yaafi-crypto (Type: Build)
    Work ended in a state of : Failed
    Elapsed: 5 secs
    Command Line: /opt/maven2/bin/mvn --batch-mode --settings /srv/gump/public/workspace/turbine-fulcrum/yaafi-crypto/gump_mvn_settings.xml package
    [Working Directory: /srv/gump/public/workspace/turbine-fulcrum/yaafi-crypto]
    M2_HOME: /opt/maven2
    ---------------------------------------------
    at org.apache.maven.cli.compat.CompatibleMain.main(CompatibleMain.java:60)
    at sun.reflect.NativeMethodAccessorImpl.invoke0(Native Method)
    at sun.reflect.NativeMethodAccessorImpl.invoke(NativeMethodAccessorImpl.java:57)
    at sun.reflect.DelegatingMethodAccessorImpl.invoke(DelegatingMethodAccessorImpl.java:43)
    at java.lang.reflect.Method.invoke(Method.java:601)
    at org.codehaus.classworlds.Launcher.launchEnhanced(Launcher.java:315)
    at org.codehaus.classworlds.Launcher.launch(Launcher.java:255)
    at org.codehaus.classworlds.Launcher.mainWithExitCode(Launcher.java:430)
    at org.codehaus.classworlds.Launcher.main(Launcher.java:375)
    Caused by: org.apache.maven.project.ProjectBuildingException: Cannot find parent: org.apache.fulcrum:fulcrum-parent for project: null:fulcrum-yaafi-crypto:jar:1.0.7-SNAPSHOT for project null:fulcrum-yaafi-crypto:jar:1.0.7-SNAPSHOT
    at org.apache.maven.project.DefaultMavenProjectBuilder.assembleLineage(DefaultMavenProjectBuilder.java:1396)
    at org.apache.maven.project.DefaultMavenProjectBuilder.buildInternal(DefaultMavenProjectBuilder.java:823)
    at org.apache.maven.project.DefaultMavenProjectBuilder.buildFromSourceFileInternal(DefaultMavenProjectBuilder.java:508)
    at org.apache.maven.project.DefaultMavenProjectBuilder.build(DefaultMavenProjectBuilder.java:200)
    at org.apache.maven.DefaultMaven.getProject(DefaultMaven.java:604)
    at org.apache.maven.DefaultMaven.collectProjects(DefaultMaven.java:487)
    at org.apache.maven.DefaultMaven.getProjects(DefaultMaven.java:391)
    ... 12 more
    Caused by: org.apache.maven.project.ProjectBuildingException: POM 'org.apache.fulcrum:fulcrum-parent' not found in repository: Unable to download the artifact from any repository

    org.apache.fulcrum:fulcrum-parent:pom:1

    from the specified remote repositories:
    gump-central (http://localhost:8192/maven2)

    for project org.apache.fulcrum:fulcrum-parent
    at org.apache.maven.project.DefaultMavenProjectBuilder.findModelFromRepository(DefaultMavenProjectBuilder.java:605)
    at org.apache.maven.project.DefaultMavenProjectBuilder.assembleLineage(DefaultMavenProjectBuilder.java:1392)
    ... 18 more
    Caused by: org.apache.maven.artifact.resolver.ArtifactNotFoundException: Unable to download the artifact from any repository

    org.apache.fulcrum:fulcrum-parent:pom:1

    from the specified remote repositories:
    gump-central (http://localhost:8192/maven2)


    at org.apache.maven.artifact.resolver.DefaultArtifactResolver.resolve(DefaultArtifactResolver.java:228)
    at org.apache.maven.artifact.resolver.DefaultArtifactResolver.resolve(DefaultArtifactResolver.java:90)
    at org.apache.maven.project.DefaultMavenProjectBuilder.findModelFromRepository(DefaultMavenProjectBuilder.java:558)
    ... 19 more
    Caused by: org.apache.maven.wagon.ResourceDoesNotExistException: Unable to download the artifact from any repository
    at org.apache.maven.artifact.manager.DefaultWagonManager.getArtifact(DefaultWagonManager.java:404)
    at org.apache.maven.artifact.resolver.DefaultArtifactResolver.resolve(DefaultArtifactResolver.java:216)
    ... 21 more
    [INFO] ------------------------------------------------------------------------
    [INFO] Total time: 4 seconds
    [INFO] Finished at: Sat Sep 08 13:10:03 UTC 2012
    [INFO] Final Memory: 3M/15M
    [INFO] ------------------------------------------------------------------------
    ---------------------------------------------

    To subscribe to this information via syndicated feeds:
    - RSS: http://vmgump.apache.org/gump/public/turbine-fulcrum/fulcrum-yaafi-crypto/rss.xml
    - Atom: http://vmgump.apache.org/gump/public/turbine-fulcrum/fulcrum-yaafi-crypto/atom.xml

    ============================== Gump Tracking Only ===
    Produced by Apache Gump(TM) version 2.3.
    Gump Run 06001208092012, vmgump.apache.org:vmgump:06001208092012
    Gump E-mail Identifier (unique within run) #1.

    --
    Apache Gump
    http://gump.apache.org/ [Instance: vmgump]

    ---------------------------------------------------------------------
    To unsubscribe, e-mail: dev-unsubscribe@turbine.apache.org
    For additional commands, e-mail: dev-help@turbine.apache.org
  • Anonymous at Sep 9, 2012 at 1:07 am
    To whom it may engage...

    This is an automated request, but not an unsolicited one. For
    more information please visit http://gump.apache.org/nagged.html,
    and/or contact the folk at general@gump.apache.org.

    Project fulcrum-yaafi-crypto has an issue affecting its community integration.
    This issue affects 1 projects,
    and has been outstanding for 2 runs.
    The current state of this project is 'Failed', with reason 'Build Failed'.
    For reference only, the following projects are affected by this:
    - fulcrum-yaafi-crypto : Services Framework


    Full details are available at:
    http://vmgump.apache.org/gump/public/turbine-fulcrum/fulcrum-yaafi-crypto/index.html

    That said, some information snippets are provided here.

    The following annotations (debug/informational/warning/error messages) were provided:
    -DEBUG- Sole jar output [fulcrum-yaafi-crypto-*[0-9T].jar] identifier set to project name
    -DEBUG- (Apache Gump generated) Apache Maven Settings in: /srv/gump/public/workspace/turbine-fulcrum/yaafi-crypto/gump_mvn_settings.xml
    -INFO- Failed with reason build failed
    -DEBUG- Maven POM in: /srv/gump/public/workspace/turbine-fulcrum/yaafi-crypto/pom.xml
    -INFO- Failed to extract fallback artifacts from Gump Repository



    The following work was performed:
    http://vmgump.apache.org/gump/public/turbine-fulcrum/fulcrum-yaafi-crypto/gump_work/build_turbine-fulcrum_fulcrum-yaafi-crypto.html
    Work Name: build_turbine-fulcrum_fulcrum-yaafi-crypto (Type: Build)
    Work ended in a state of : Failed
    Elapsed: 2 secs
    Command Line: /opt/maven2/bin/mvn --batch-mode --settings /srv/gump/public/workspace/turbine-fulcrum/yaafi-crypto/gump_mvn_settings.xml package
    [Working Directory: /srv/gump/public/workspace/turbine-fulcrum/yaafi-crypto]
    M2_HOME: /opt/maven2
    ---------------------------------------------
    at org.apache.maven.cli.compat.CompatibleMain.main(CompatibleMain.java:60)
    at sun.reflect.NativeMethodAccessorImpl.invoke0(Native Method)
    at sun.reflect.NativeMethodAccessorImpl.invoke(NativeMethodAccessorImpl.java:57)
    at sun.reflect.DelegatingMethodAccessorImpl.invoke(DelegatingMethodAccessorImpl.java:43)
    at java.lang.reflect.Method.invoke(Method.java:601)
    at org.codehaus.classworlds.Launcher.launchEnhanced(Launcher.java:315)
    at org.codehaus.classworlds.Launcher.launch(Launcher.java:255)
    at org.codehaus.classworlds.Launcher.mainWithExitCode(Launcher.java:430)
    at org.codehaus.classworlds.Launcher.main(Launcher.java:375)
    Caused by: org.apache.maven.project.ProjectBuildingException: Cannot find parent: org.apache.fulcrum:fulcrum-parent for project: null:fulcrum-yaafi-crypto:jar:1.0.7-SNAPSHOT for project null:fulcrum-yaafi-crypto:jar:1.0.7-SNAPSHOT
    at org.apache.maven.project.DefaultMavenProjectBuilder.assembleLineage(DefaultMavenProjectBuilder.java:1396)
    at org.apache.maven.project.DefaultMavenProjectBuilder.buildInternal(DefaultMavenProjectBuilder.java:823)
    at org.apache.maven.project.DefaultMavenProjectBuilder.buildFromSourceFileInternal(DefaultMavenProjectBuilder.java:508)
    at org.apache.maven.project.DefaultMavenProjectBuilder.build(DefaultMavenProjectBuilder.java:200)
    at org.apache.maven.DefaultMaven.getProject(DefaultMaven.java:604)
    at org.apache.maven.DefaultMaven.collectProjects(DefaultMaven.java:487)
    at org.apache.maven.DefaultMaven.getProjects(DefaultMaven.java:391)
    ... 12 more
    Caused by: org.apache.maven.project.ProjectBuildingException: POM 'org.apache.fulcrum:fulcrum-parent' not found in repository: Unable to download the artifact from any repository

    org.apache.fulcrum:fulcrum-parent:pom:1

    from the specified remote repositories:
    gump-central (http://localhost:8192/maven2)

    for project org.apache.fulcrum:fulcrum-parent
    at org.apache.maven.project.DefaultMavenProjectBuilder.findModelFromRepository(DefaultMavenProjectBuilder.java:605)
    at org.apache.maven.project.DefaultMavenProjectBuilder.assembleLineage(DefaultMavenProjectBuilder.java:1392)
    ... 18 more
    Caused by: org.apache.maven.artifact.resolver.ArtifactNotFoundException: Unable to download the artifact from any repository

    org.apache.fulcrum:fulcrum-parent:pom:1

    from the specified remote repositories:
    gump-central (http://localhost:8192/maven2)


    at org.apache.maven.artifact.resolver.DefaultArtifactResolver.resolve(DefaultArtifactResolver.java:228)
    at org.apache.maven.artifact.resolver.DefaultArtifactResolver.resolve(DefaultArtifactResolver.java:90)
    at org.apache.maven.project.DefaultMavenProjectBuilder.findModelFromRepository(DefaultMavenProjectBuilder.java:558)
    ... 19 more
    Caused by: org.apache.maven.wagon.ResourceDoesNotExistException: Unable to download the artifact from any repository
    at org.apache.maven.artifact.manager.DefaultWagonManager.getArtifact(DefaultWagonManager.java:404)
    at org.apache.maven.artifact.resolver.DefaultArtifactResolver.resolve(DefaultArtifactResolver.java:216)
    ... 21 more
    [INFO] ------------------------------------------------------------------------
    [INFO] Total time: 1 second
    [INFO] Finished at: Sun Sep 09 01:07:19 UTC 2012
    [INFO] Final Memory: 3M/15M
    [INFO] ------------------------------------------------------------------------
    ---------------------------------------------

    To subscribe to this information via syndicated feeds:
    - RSS: http://vmgump.apache.org/gump/public/turbine-fulcrum/fulcrum-yaafi-crypto/rss.xml
    - Atom: http://vmgump.apache.org/gump/public/turbine-fulcrum/fulcrum-yaafi-crypto/atom.xml

    ============================== Gump Tracking Only ===
    Produced by Apache Gump(TM) version 2.3.
    Gump Run 12000009092012, vmgump.apache.org:vmgump:12000009092012
    Gump E-mail Identifier (unique within run) #9.

    --
    Apache Gump
    http://gump.apache.org/ [Instance: vmgump]

    ---------------------------------------------------------------------
    To unsubscribe, e-mail: dev-unsubscribe@turbine.apache.org
    For additional commands, e-mail: dev-help@turbine.apache.org
  • Anonymous at Sep 10, 2012 at 1:10 am
    To whom it may engage...

    This is an automated request, but not an unsolicited one. For
    more information please visit http://gump.apache.org/nagged.html,
    and/or contact the folk at general@gump.apache.org.

    Project fulcrum-yaafi-crypto has an issue affecting its community integration.
    This issue affects 1 projects,
    and has been outstanding for 4 runs.
    The current state of this project is 'Failed', with reason 'Build Failed'.
    For reference only, the following projects are affected by this:
    - fulcrum-yaafi-crypto : Services Framework


    Full details are available at:
    http://vmgump.apache.org/gump/public/turbine-fulcrum/fulcrum-yaafi-crypto/index.html

    That said, some information snippets are provided here.

    The following annotations (debug/informational/warning/error messages) were provided:
    -DEBUG- Sole jar output [fulcrum-yaafi-crypto-*[0-9T].jar] identifier set to project name
    -DEBUG- (Apache Gump generated) Apache Maven Settings in: /srv/gump/public/workspace/turbine-fulcrum/yaafi-crypto/gump_mvn_settings.xml
    -INFO- Failed with reason build failed
    -DEBUG- Maven POM in: /srv/gump/public/workspace/turbine-fulcrum/yaafi-crypto/pom.xml
    -INFO- Failed to extract fallback artifacts from Gump Repository



    The following work was performed:
    http://vmgump.apache.org/gump/public/turbine-fulcrum/fulcrum-yaafi-crypto/gump_work/build_turbine-fulcrum_fulcrum-yaafi-crypto.html
    Work Name: build_turbine-fulcrum_fulcrum-yaafi-crypto (Type: Build)
    Work ended in a state of : Failed
    Elapsed: 2 secs
    Command Line: /opt/maven2/bin/mvn --batch-mode --settings /srv/gump/public/workspace/turbine-fulcrum/yaafi-crypto/gump_mvn_settings.xml package
    [Working Directory: /srv/gump/public/workspace/turbine-fulcrum/yaafi-crypto]
    M2_HOME: /opt/maven2
    ---------------------------------------------
    at org.apache.maven.cli.compat.CompatibleMain.main(CompatibleMain.java:60)
    at sun.reflect.NativeMethodAccessorImpl.invoke0(Native Method)
    at sun.reflect.NativeMethodAccessorImpl.invoke(NativeMethodAccessorImpl.java:57)
    at sun.reflect.DelegatingMethodAccessorImpl.invoke(DelegatingMethodAccessorImpl.java:43)
    at java.lang.reflect.Method.invoke(Method.java:601)
    at org.codehaus.classworlds.Launcher.launchEnhanced(Launcher.java:315)
    at org.codehaus.classworlds.Launcher.launch(Launcher.java:255)
    at org.codehaus.classworlds.Launcher.mainWithExitCode(Launcher.java:430)
    at org.codehaus.classworlds.Launcher.main(Launcher.java:375)
    Caused by: org.apache.maven.project.ProjectBuildingException: Cannot find parent: org.apache.fulcrum:fulcrum-parent for project: null:fulcrum-yaafi-crypto:jar:1.0.7-SNAPSHOT for project null:fulcrum-yaafi-crypto:jar:1.0.7-SNAPSHOT
    at org.apache.maven.project.DefaultMavenProjectBuilder.assembleLineage(DefaultMavenProjectBuilder.java:1396)
    at org.apache.maven.project.DefaultMavenProjectBuilder.buildInternal(DefaultMavenProjectBuilder.java:823)
    at org.apache.maven.project.DefaultMavenProjectBuilder.buildFromSourceFileInternal(DefaultMavenProjectBuilder.java:508)
    at org.apache.maven.project.DefaultMavenProjectBuilder.build(DefaultMavenProjectBuilder.java:200)
    at org.apache.maven.DefaultMaven.getProject(DefaultMaven.java:604)
    at org.apache.maven.DefaultMaven.collectProjects(DefaultMaven.java:487)
    at org.apache.maven.DefaultMaven.getProjects(DefaultMaven.java:391)
    ... 12 more
    Caused by: org.apache.maven.project.ProjectBuildingException: POM 'org.apache.fulcrum:fulcrum-parent' not found in repository: Unable to download the artifact from any repository

    org.apache.fulcrum:fulcrum-parent:pom:1

    from the specified remote repositories:
    gump-central (http://localhost:8192/maven2)

    for project org.apache.fulcrum:fulcrum-parent
    at org.apache.maven.project.DefaultMavenProjectBuilder.findModelFromRepository(DefaultMavenProjectBuilder.java:605)
    at org.apache.maven.project.DefaultMavenProjectBuilder.assembleLineage(DefaultMavenProjectBuilder.java:1392)
    ... 18 more
    Caused by: org.apache.maven.artifact.resolver.ArtifactNotFoundException: Unable to download the artifact from any repository

    org.apache.fulcrum:fulcrum-parent:pom:1

    from the specified remote repositories:
    gump-central (http://localhost:8192/maven2)


    at org.apache.maven.artifact.resolver.DefaultArtifactResolver.resolve(DefaultArtifactResolver.java:228)
    at org.apache.maven.artifact.resolver.DefaultArtifactResolver.resolve(DefaultArtifactResolver.java:90)
    at org.apache.maven.project.DefaultMavenProjectBuilder.findModelFromRepository(DefaultMavenProjectBuilder.java:558)
    ... 19 more
    Caused by: org.apache.maven.wagon.ResourceDoesNotExistException: Unable to download the artifact from any repository
    at org.apache.maven.artifact.manager.DefaultWagonManager.getArtifact(DefaultWagonManager.java:404)
    at org.apache.maven.artifact.resolver.DefaultArtifactResolver.resolve(DefaultArtifactResolver.java:216)
    ... 21 more
    [INFO] ------------------------------------------------------------------------
    [INFO] Total time: 1 second
    [INFO] Finished at: Mon Sep 10 01:10:05 UTC 2012
    [INFO] Final Memory: 3M/15M
    [INFO] ------------------------------------------------------------------------
    ---------------------------------------------

    To subscribe to this information via syndicated feeds:
    - RSS: http://vmgump.apache.org/gump/public/turbine-fulcrum/fulcrum-yaafi-crypto/rss.xml
    - Atom: http://vmgump.apache.org/gump/public/turbine-fulcrum/fulcrum-yaafi-crypto/atom.xml

    ============================== Gump Tracking Only ===
    Produced by Apache Gump(TM) version 2.3.
    Gump Run 14000010092012, vmgump.apache.org:vmgump:14000010092012
    Gump E-mail Identifier (unique within run) #7.

    --
    Apache Gump
    http://gump.apache.org/ [Instance: vmgump]

    ---------------------------------------------------------------------
    To unsubscribe, e-mail: dev-unsubscribe@turbine.apache.org
    For additional commands, e-mail: dev-help@turbine.apache.org

Related Discussions

Discussion Navigation
viewthread | post
Discussion Overview
groupdev @
categoriesturbine
postedSep 8, '12 at 1:11a
activeSep 10, '12 at 1:10a
posts4
users1
websiteturbine.apache.org

1 user in discussion

Anonymous: 4 posts

People

Translate

site design / logo © 2018 Grokbase