FAQ
To whom it may engage...

This is an automated request, but not an unsolicited one. For
more information please visit http://gump.apache.org/nagged.html,
and/or contact the folk at general@gump.apache.org.

Project fulcrum-yaafi has an issue affecting its community integration.
This issue affects 7 projects,
and has been outstanding for 501 runs.
The current state of this project is 'Failed', with reason 'Build Failed'.
For reference only, the following projects are affected by this:
- fulcrum-bsf : Services Framework
- fulcrum-dvsl : Services Framework
- fulcrum-hsqldb : Services Framework
- fulcrum-naming : Services Framework
- fulcrum-osworkflow : Services Framework
- fulcrum-yaafi : Services Framework
- fulcrum_fulcrum-yaafi : Services Framework


Full details are available at:
http://vmgump.apache.org/gump/public/turbine-fulcrum/fulcrum-yaafi/index.html

That said, some information snippets are provided here.

The following annotations (debug/informational/warning/error messages) were provided:
-DEBUG- Sole jar output [fulcrum-yaafi-*[0-9T].jar] identifier set to project name
-INFO- Optional dependency fulcrum-yaafi-crypto failed with reason build failed
-DEBUG- (Apache Gump generated) Apache Maven Settings in: /srv/gump/public/workspace/turbine-fulcrum/yaafi/gump_mvn_settings.xml
-INFO- Failed with reason build failed
-DEBUG- Maven POM in: /srv/gump/public/workspace/turbine-fulcrum/yaafi/pom.xml
-DEBUG- Extracted fallback artifacts from Gump Repository



The following work was performed:
http://vmgump.apache.org/gump/public/turbine-fulcrum/fulcrum-yaafi/gump_work/build_turbine-fulcrum_fulcrum-yaafi.html
Work Name: build_turbine-fulcrum_fulcrum-yaafi (Type: Build)
Work ended in a state of : Failed
Elapsed: 2 secs
Command Line: /opt/maven2/bin/mvn --batch-mode --settings /srv/gump/public/workspace/turbine-fulcrum/yaafi/gump_mvn_settings.xml package
[Working Directory: /srv/gump/public/workspace/turbine-fulcrum/yaafi]
M2_HOME: /opt/maven2
---------------------------------------------
at org.apache.maven.cli.compat.CompatibleMain.main(CompatibleMain.java:60)
at sun.reflect.NativeMethodAccessorImpl.invoke0(Native Method)
at sun.reflect.NativeMethodAccessorImpl.invoke(NativeMethodAccessorImpl.java:57)
at sun.reflect.DelegatingMethodAccessorImpl.invoke(DelegatingMethodAccessorImpl.java:43)
at java.lang.reflect.Method.invoke(Method.java:601)
at org.codehaus.classworlds.Launcher.launchEnhanced(Launcher.java:315)
at org.codehaus.classworlds.Launcher.launch(Launcher.java:255)
at org.codehaus.classworlds.Launcher.mainWithExitCode(Launcher.java:430)
at org.codehaus.classworlds.Launcher.main(Launcher.java:375)
Caused by: org.apache.maven.project.ProjectBuildingException: Cannot find parent: org.apache.fulcrum:fulcrum-parent for project: null:fulcrum-yaafi:jar:1.0.7-SNAPSHOT for project null:fulcrum-yaafi:jar:1.0.7-SNAPSHOT
at org.apache.maven.project.DefaultMavenProjectBuilder.assembleLineage(DefaultMavenProjectBuilder.java:1396)
at org.apache.maven.project.DefaultMavenProjectBuilder.buildInternal(DefaultMavenProjectBuilder.java:823)
at org.apache.maven.project.DefaultMavenProjectBuilder.buildFromSourceFileInternal(DefaultMavenProjectBuilder.java:508)
at org.apache.maven.project.DefaultMavenProjectBuilder.build(DefaultMavenProjectBuilder.java:200)
at org.apache.maven.DefaultMaven.getProject(DefaultMaven.java:604)
at org.apache.maven.DefaultMaven.collectProjects(DefaultMaven.java:487)
at org.apache.maven.DefaultMaven.getProjects(DefaultMaven.java:391)
... 12 more
Caused by: org.apache.maven.project.ProjectBuildingException: POM 'org.apache.fulcrum:fulcrum-parent' not found in repository: Unable to download the artifact from any repository

org.apache.fulcrum:fulcrum-parent:pom:1

from the specified remote repositories:
gump-central (http://localhost:8192/maven2)

for project org.apache.fulcrum:fulcrum-parent
at org.apache.maven.project.DefaultMavenProjectBuilder.findModelFromRepository(DefaultMavenProjectBuilder.java:605)
at org.apache.maven.project.DefaultMavenProjectBuilder.assembleLineage(DefaultMavenProjectBuilder.java:1392)
... 18 more
Caused by: org.apache.maven.artifact.resolver.ArtifactNotFoundException: Unable to download the artifact from any repository

org.apache.fulcrum:fulcrum-parent:pom:1

from the specified remote repositories:
gump-central (http://localhost:8192/maven2)


at org.apache.maven.artifact.resolver.DefaultArtifactResolver.resolve(DefaultArtifactResolver.java:228)
at org.apache.maven.artifact.resolver.DefaultArtifactResolver.resolve(DefaultArtifactResolver.java:90)
at org.apache.maven.project.DefaultMavenProjectBuilder.findModelFromRepository(DefaultMavenProjectBuilder.java:558)
... 19 more
Caused by: org.apache.maven.wagon.ResourceDoesNotExistException: Unable to download the artifact from any repository
at org.apache.maven.artifact.manager.DefaultWagonManager.getArtifact(DefaultWagonManager.java:404)
at org.apache.maven.artifact.resolver.DefaultArtifactResolver.resolve(DefaultArtifactResolver.java:216)
... 21 more
[INFO] ------------------------------------------------------------------------
[INFO] Total time: 1 second
[INFO] Finished at: Sat Sep 08 01:24:19 UTC 2012
[INFO] Final Memory: 3M/15M
[INFO] ------------------------------------------------------------------------
---------------------------------------------

To subscribe to this information via syndicated feeds:
- RSS: http://vmgump.apache.org/gump/public/turbine-fulcrum/fulcrum-yaafi/rss.xml
- Atom: http://vmgump.apache.org/gump/public/turbine-fulcrum/fulcrum-yaafi/atom.xml

============================== Gump Tracking Only ===
Produced by Apache Gump(TM) version 2.3.
Gump Run 12000008092012, vmgump.apache.org:vmgump:12000008092012
Gump E-mail Identifier (unique within run) #14.

--
Apache Gump
http://gump.apache.org/ [Instance: vmgump]

---------------------------------------------------------------------
To unsubscribe, e-mail: dev-unsubscribe@turbine.apache.org
For additional commands, e-mail: dev-help@turbine.apache.org

Search Discussions

  • Anonymous at Sep 8, 2012 at 1:24 pm
    To whom it may engage...

    This is an automated request, but not an unsolicited one. For
    more information please visit http://gump.apache.org/nagged.html,
    and/or contact the folk at general@gump.apache.org.

    Project fulcrum-yaafi has an issue affecting its community integration.
    This issue affects 7 projects.
    The current state of this project is 'Failed', with reason 'Build Failed'.
    For reference only, the following projects are affected by this:
    - fulcrum-bsf : Services Framework
    - fulcrum-dvsl : Services Framework
    - fulcrum-hsqldb : Services Framework
    - fulcrum-naming : Services Framework
    - fulcrum-osworkflow : Services Framework
    - fulcrum-yaafi : Services Framework
    - fulcrum_fulcrum-yaafi : Services Framework


    Full details are available at:
    http://vmgump.apache.org/gump/public/turbine-fulcrum/fulcrum-yaafi/index.html

    That said, some information snippets are provided here.

    The following annotations (debug/informational/warning/error messages) were provided:
    -DEBUG- Sole jar output [fulcrum-yaafi-*[0-9T].jar] identifier set to project name
    -INFO- Optional dependency fulcrum-yaafi-crypto failed with reason build failed
    -DEBUG- (Apache Gump generated) Apache Maven Settings in: /srv/gump/public/workspace/turbine-fulcrum/yaafi/gump_mvn_settings.xml
    -INFO- Failed with reason build failed
    -DEBUG- Maven POM in: /srv/gump/public/workspace/turbine-fulcrum/yaafi/pom.xml
    -INFO- Failed to extract fallback artifacts from Gump Repository



    The following work was performed:
    http://vmgump.apache.org/gump/public/turbine-fulcrum/fulcrum-yaafi/gump_work/build_turbine-fulcrum_fulcrum-yaafi.html
    Work Name: build_turbine-fulcrum_fulcrum-yaafi (Type: Build)
    Work ended in a state of : Failed
    Elapsed: 2 secs
    Command Line: /opt/maven2/bin/mvn --batch-mode --settings /srv/gump/public/workspace/turbine-fulcrum/yaafi/gump_mvn_settings.xml package
    [Working Directory: /srv/gump/public/workspace/turbine-fulcrum/yaafi]
    M2_HOME: /opt/maven2
    ---------------------------------------------
    at org.apache.maven.cli.compat.CompatibleMain.main(CompatibleMain.java:60)
    at sun.reflect.NativeMethodAccessorImpl.invoke0(Native Method)
    at sun.reflect.NativeMethodAccessorImpl.invoke(NativeMethodAccessorImpl.java:57)
    at sun.reflect.DelegatingMethodAccessorImpl.invoke(DelegatingMethodAccessorImpl.java:43)
    at java.lang.reflect.Method.invoke(Method.java:601)
    at org.codehaus.classworlds.Launcher.launchEnhanced(Launcher.java:315)
    at org.codehaus.classworlds.Launcher.launch(Launcher.java:255)
    at org.codehaus.classworlds.Launcher.mainWithExitCode(Launcher.java:430)
    at org.codehaus.classworlds.Launcher.main(Launcher.java:375)
    Caused by: org.apache.maven.project.ProjectBuildingException: Cannot find parent: org.apache.fulcrum:fulcrum-parent for project: null:fulcrum-yaafi:jar:1.0.7-SNAPSHOT for project null:fulcrum-yaafi:jar:1.0.7-SNAPSHOT
    at org.apache.maven.project.DefaultMavenProjectBuilder.assembleLineage(DefaultMavenProjectBuilder.java:1396)
    at org.apache.maven.project.DefaultMavenProjectBuilder.buildInternal(DefaultMavenProjectBuilder.java:823)
    at org.apache.maven.project.DefaultMavenProjectBuilder.buildFromSourceFileInternal(DefaultMavenProjectBuilder.java:508)
    at org.apache.maven.project.DefaultMavenProjectBuilder.build(DefaultMavenProjectBuilder.java:200)
    at org.apache.maven.DefaultMaven.getProject(DefaultMaven.java:604)
    at org.apache.maven.DefaultMaven.collectProjects(DefaultMaven.java:487)
    at org.apache.maven.DefaultMaven.getProjects(DefaultMaven.java:391)
    ... 12 more
    Caused by: org.apache.maven.project.ProjectBuildingException: POM 'org.apache.fulcrum:fulcrum-parent' not found in repository: Unable to download the artifact from any repository

    org.apache.fulcrum:fulcrum-parent:pom:1

    from the specified remote repositories:
    gump-central (http://localhost:8192/maven2)

    for project org.apache.fulcrum:fulcrum-parent
    at org.apache.maven.project.DefaultMavenProjectBuilder.findModelFromRepository(DefaultMavenProjectBuilder.java:605)
    at org.apache.maven.project.DefaultMavenProjectBuilder.assembleLineage(DefaultMavenProjectBuilder.java:1392)
    ... 18 more
    Caused by: org.apache.maven.artifact.resolver.ArtifactNotFoundException: Unable to download the artifact from any repository

    org.apache.fulcrum:fulcrum-parent:pom:1

    from the specified remote repositories:
    gump-central (http://localhost:8192/maven2)


    at org.apache.maven.artifact.resolver.DefaultArtifactResolver.resolve(DefaultArtifactResolver.java:228)
    at org.apache.maven.artifact.resolver.DefaultArtifactResolver.resolve(DefaultArtifactResolver.java:90)
    at org.apache.maven.project.DefaultMavenProjectBuilder.findModelFromRepository(DefaultMavenProjectBuilder.java:558)
    ... 19 more
    Caused by: org.apache.maven.wagon.ResourceDoesNotExistException: Unable to download the artifact from any repository
    at org.apache.maven.artifact.manager.DefaultWagonManager.getArtifact(DefaultWagonManager.java:404)
    at org.apache.maven.artifact.resolver.DefaultArtifactResolver.resolve(DefaultArtifactResolver.java:216)
    ... 21 more
    [INFO] ------------------------------------------------------------------------
    [INFO] Total time: 1 second
    [INFO] Finished at: Sat Sep 08 13:24:04 UTC 2012
    [INFO] Final Memory: 3M/15M
    [INFO] ------------------------------------------------------------------------
    ---------------------------------------------

    To subscribe to this information via syndicated feeds:
    - RSS: http://vmgump.apache.org/gump/public/turbine-fulcrum/fulcrum-yaafi/rss.xml
    - Atom: http://vmgump.apache.org/gump/public/turbine-fulcrum/fulcrum-yaafi/atom.xml

    ============================== Gump Tracking Only ===
    Produced by Apache Gump(TM) version 2.3.
    Gump Run 06001208092012, vmgump.apache.org:vmgump:06001208092012
    Gump E-mail Identifier (unique within run) #2.

    --
    Apache Gump
    http://gump.apache.org/ [Instance: vmgump]

    ---------------------------------------------------------------------
    To unsubscribe, e-mail: dev-unsubscribe@turbine.apache.org
    For additional commands, e-mail: dev-help@turbine.apache.org
  • Anonymous at Sep 9, 2012 at 1:20 am
    To whom it may engage...

    This is an automated request, but not an unsolicited one. For
    more information please visit http://gump.apache.org/nagged.html,
    and/or contact the folk at general@gump.apache.org.

    Project fulcrum-yaafi has an issue affecting its community integration.
    This issue affects 4 projects,
    and has been outstanding for 2 runs.
    The current state of this project is 'Failed', with reason 'Build Failed'.
    For reference only, the following projects are affected by this:
    - fulcrum-bsf : Services Framework
    - fulcrum-hsqldb : Services Framework
    - fulcrum-yaafi : Services Framework
    - fulcrum_fulcrum-yaafi : Services Framework


    Full details are available at:
    http://vmgump.apache.org/gump/public/turbine-fulcrum/fulcrum-yaafi/index.html

    That said, some information snippets are provided here.

    The following annotations (debug/informational/warning/error messages) were provided:
    -DEBUG- Sole jar output [fulcrum-yaafi-*[0-9T].jar] identifier set to project name
    -INFO- Optional dependency fulcrum-yaafi-crypto failed with reason build failed
    -DEBUG- (Apache Gump generated) Apache Maven Settings in: /srv/gump/public/workspace/turbine-fulcrum/yaafi/gump_mvn_settings.xml
    -INFO- Failed with reason build failed
    -DEBUG- Maven POM in: /srv/gump/public/workspace/turbine-fulcrum/yaafi/pom.xml
    -INFO- Failed to extract fallback artifacts from Gump Repository



    The following work was performed:
    http://vmgump.apache.org/gump/public/turbine-fulcrum/fulcrum-yaafi/gump_work/build_turbine-fulcrum_fulcrum-yaafi.html
    Work Name: build_turbine-fulcrum_fulcrum-yaafi (Type: Build)
    Work ended in a state of : Failed
    Elapsed: 2 secs
    Command Line: /opt/maven2/bin/mvn --batch-mode --settings /srv/gump/public/workspace/turbine-fulcrum/yaafi/gump_mvn_settings.xml package
    [Working Directory: /srv/gump/public/workspace/turbine-fulcrum/yaafi]
    M2_HOME: /opt/maven2
    ---------------------------------------------
    at org.apache.maven.cli.compat.CompatibleMain.main(CompatibleMain.java:60)
    at sun.reflect.NativeMethodAccessorImpl.invoke0(Native Method)
    at sun.reflect.NativeMethodAccessorImpl.invoke(NativeMethodAccessorImpl.java:57)
    at sun.reflect.DelegatingMethodAccessorImpl.invoke(DelegatingMethodAccessorImpl.java:43)
    at java.lang.reflect.Method.invoke(Method.java:601)
    at org.codehaus.classworlds.Launcher.launchEnhanced(Launcher.java:315)
    at org.codehaus.classworlds.Launcher.launch(Launcher.java:255)
    at org.codehaus.classworlds.Launcher.mainWithExitCode(Launcher.java:430)
    at org.codehaus.classworlds.Launcher.main(Launcher.java:375)
    Caused by: org.apache.maven.project.ProjectBuildingException: Cannot find parent: org.apache.fulcrum:fulcrum-parent for project: null:fulcrum-yaafi:jar:1.0.7-SNAPSHOT for project null:fulcrum-yaafi:jar:1.0.7-SNAPSHOT
    at org.apache.maven.project.DefaultMavenProjectBuilder.assembleLineage(DefaultMavenProjectBuilder.java:1396)
    at org.apache.maven.project.DefaultMavenProjectBuilder.buildInternal(DefaultMavenProjectBuilder.java:823)
    at org.apache.maven.project.DefaultMavenProjectBuilder.buildFromSourceFileInternal(DefaultMavenProjectBuilder.java:508)
    at org.apache.maven.project.DefaultMavenProjectBuilder.build(DefaultMavenProjectBuilder.java:200)
    at org.apache.maven.DefaultMaven.getProject(DefaultMaven.java:604)
    at org.apache.maven.DefaultMaven.collectProjects(DefaultMaven.java:487)
    at org.apache.maven.DefaultMaven.getProjects(DefaultMaven.java:391)
    ... 12 more
    Caused by: org.apache.maven.project.ProjectBuildingException: POM 'org.apache.fulcrum:fulcrum-parent' not found in repository: Unable to download the artifact from any repository

    org.apache.fulcrum:fulcrum-parent:pom:1

    from the specified remote repositories:
    gump-central (http://localhost:8192/maven2)

    for project org.apache.fulcrum:fulcrum-parent
    at org.apache.maven.project.DefaultMavenProjectBuilder.findModelFromRepository(DefaultMavenProjectBuilder.java:605)
    at org.apache.maven.project.DefaultMavenProjectBuilder.assembleLineage(DefaultMavenProjectBuilder.java:1392)
    ... 18 more
    Caused by: org.apache.maven.artifact.resolver.ArtifactNotFoundException: Unable to download the artifact from any repository

    org.apache.fulcrum:fulcrum-parent:pom:1

    from the specified remote repositories:
    gump-central (http://localhost:8192/maven2)


    at org.apache.maven.artifact.resolver.DefaultArtifactResolver.resolve(DefaultArtifactResolver.java:228)
    at org.apache.maven.artifact.resolver.DefaultArtifactResolver.resolve(DefaultArtifactResolver.java:90)
    at org.apache.maven.project.DefaultMavenProjectBuilder.findModelFromRepository(DefaultMavenProjectBuilder.java:558)
    ... 19 more
    Caused by: org.apache.maven.wagon.ResourceDoesNotExistException: Unable to download the artifact from any repository
    at org.apache.maven.artifact.manager.DefaultWagonManager.getArtifact(DefaultWagonManager.java:404)
    at org.apache.maven.artifact.resolver.DefaultArtifactResolver.resolve(DefaultArtifactResolver.java:216)
    ... 21 more
    [INFO] ------------------------------------------------------------------------
    [INFO] Total time: 1 second
    [INFO] Finished at: Sun Sep 09 01:19:48 UTC 2012
    [INFO] Final Memory: 3M/15M
    [INFO] ------------------------------------------------------------------------
    ---------------------------------------------

    To subscribe to this information via syndicated feeds:
    - RSS: http://vmgump.apache.org/gump/public/turbine-fulcrum/fulcrum-yaafi/rss.xml
    - Atom: http://vmgump.apache.org/gump/public/turbine-fulcrum/fulcrum-yaafi/atom.xml

    ============================== Gump Tracking Only ===
    Produced by Apache Gump(TM) version 2.3.
    Gump Run 12000009092012, vmgump.apache.org:vmgump:12000009092012
    Gump E-mail Identifier (unique within run) #14.

    --
    Apache Gump
    http://gump.apache.org/ [Instance: vmgump]

    ---------------------------------------------------------------------
    To unsubscribe, e-mail: dev-unsubscribe@turbine.apache.org
    For additional commands, e-mail: dev-help@turbine.apache.org
  • Anonymous at Sep 10, 2012 at 1:23 am
    To whom it may engage...

    This is an automated request, but not an unsolicited one. For
    more information please visit http://gump.apache.org/nagged.html,
    and/or contact the folk at general@gump.apache.org.

    Project fulcrum-yaafi has an issue affecting its community integration.
    This issue affects 7 projects,
    and has been outstanding for 4 runs.
    The current state of this project is 'Failed', with reason 'Build Failed'.
    For reference only, the following projects are affected by this:
    - fulcrum-bsf : Services Framework
    - fulcrum-dvsl : Services Framework
    - fulcrum-hsqldb : Services Framework
    - fulcrum-naming : Services Framework
    - fulcrum-osworkflow : Services Framework
    - fulcrum-yaafi : Services Framework
    - fulcrum_fulcrum-yaafi : Services Framework


    Full details are available at:
    http://vmgump.apache.org/gump/public/turbine-fulcrum/fulcrum-yaafi/index.html

    That said, some information snippets are provided here.

    The following annotations (debug/informational/warning/error messages) were provided:
    -DEBUG- Sole jar output [fulcrum-yaafi-*[0-9T].jar] identifier set to project name
    -INFO- Optional dependency fulcrum-yaafi-crypto failed with reason build failed
    -DEBUG- (Apache Gump generated) Apache Maven Settings in: /srv/gump/public/workspace/turbine-fulcrum/yaafi/gump_mvn_settings.xml
    -INFO- Failed with reason build failed
    -DEBUG- Maven POM in: /srv/gump/public/workspace/turbine-fulcrum/yaafi/pom.xml
    -INFO- Failed to extract fallback artifacts from Gump Repository



    The following work was performed:
    http://vmgump.apache.org/gump/public/turbine-fulcrum/fulcrum-yaafi/gump_work/build_turbine-fulcrum_fulcrum-yaafi.html
    Work Name: build_turbine-fulcrum_fulcrum-yaafi (Type: Build)
    Work ended in a state of : Failed
    Elapsed: 2 secs
    Command Line: /opt/maven2/bin/mvn --batch-mode --settings /srv/gump/public/workspace/turbine-fulcrum/yaafi/gump_mvn_settings.xml package
    [Working Directory: /srv/gump/public/workspace/turbine-fulcrum/yaafi]
    M2_HOME: /opt/maven2
    ---------------------------------------------
    at org.apache.maven.cli.compat.CompatibleMain.main(CompatibleMain.java:60)
    at sun.reflect.NativeMethodAccessorImpl.invoke0(Native Method)
    at sun.reflect.NativeMethodAccessorImpl.invoke(NativeMethodAccessorImpl.java:57)
    at sun.reflect.DelegatingMethodAccessorImpl.invoke(DelegatingMethodAccessorImpl.java:43)
    at java.lang.reflect.Method.invoke(Method.java:601)
    at org.codehaus.classworlds.Launcher.launchEnhanced(Launcher.java:315)
    at org.codehaus.classworlds.Launcher.launch(Launcher.java:255)
    at org.codehaus.classworlds.Launcher.mainWithExitCode(Launcher.java:430)
    at org.codehaus.classworlds.Launcher.main(Launcher.java:375)
    Caused by: org.apache.maven.project.ProjectBuildingException: Cannot find parent: org.apache.fulcrum:fulcrum-parent for project: null:fulcrum-yaafi:jar:1.0.7-SNAPSHOT for project null:fulcrum-yaafi:jar:1.0.7-SNAPSHOT
    at org.apache.maven.project.DefaultMavenProjectBuilder.assembleLineage(DefaultMavenProjectBuilder.java:1396)
    at org.apache.maven.project.DefaultMavenProjectBuilder.buildInternal(DefaultMavenProjectBuilder.java:823)
    at org.apache.maven.project.DefaultMavenProjectBuilder.buildFromSourceFileInternal(DefaultMavenProjectBuilder.java:508)
    at org.apache.maven.project.DefaultMavenProjectBuilder.build(DefaultMavenProjectBuilder.java:200)
    at org.apache.maven.DefaultMaven.getProject(DefaultMaven.java:604)
    at org.apache.maven.DefaultMaven.collectProjects(DefaultMaven.java:487)
    at org.apache.maven.DefaultMaven.getProjects(DefaultMaven.java:391)
    ... 12 more
    Caused by: org.apache.maven.project.ProjectBuildingException: POM 'org.apache.fulcrum:fulcrum-parent' not found in repository: Unable to download the artifact from any repository

    org.apache.fulcrum:fulcrum-parent:pom:1

    from the specified remote repositories:
    gump-central (http://localhost:8192/maven2)

    for project org.apache.fulcrum:fulcrum-parent
    at org.apache.maven.project.DefaultMavenProjectBuilder.findModelFromRepository(DefaultMavenProjectBuilder.java:605)
    at org.apache.maven.project.DefaultMavenProjectBuilder.assembleLineage(DefaultMavenProjectBuilder.java:1392)
    ... 18 more
    Caused by: org.apache.maven.artifact.resolver.ArtifactNotFoundException: Unable to download the artifact from any repository

    org.apache.fulcrum:fulcrum-parent:pom:1

    from the specified remote repositories:
    gump-central (http://localhost:8192/maven2)


    at org.apache.maven.artifact.resolver.DefaultArtifactResolver.resolve(DefaultArtifactResolver.java:228)
    at org.apache.maven.artifact.resolver.DefaultArtifactResolver.resolve(DefaultArtifactResolver.java:90)
    at org.apache.maven.project.DefaultMavenProjectBuilder.findModelFromRepository(DefaultMavenProjectBuilder.java:558)
    ... 19 more
    Caused by: org.apache.maven.wagon.ResourceDoesNotExistException: Unable to download the artifact from any repository
    at org.apache.maven.artifact.manager.DefaultWagonManager.getArtifact(DefaultWagonManager.java:404)
    at org.apache.maven.artifact.resolver.DefaultArtifactResolver.resolve(DefaultArtifactResolver.java:216)
    ... 21 more
    [INFO] ------------------------------------------------------------------------
    [INFO] Total time: 1 second
    [INFO] Finished at: Mon Sep 10 01:23:07 UTC 2012
    [INFO] Final Memory: 3M/15M
    [INFO] ------------------------------------------------------------------------
    ---------------------------------------------

    To subscribe to this information via syndicated feeds:
    - RSS: http://vmgump.apache.org/gump/public/turbine-fulcrum/fulcrum-yaafi/rss.xml
    - Atom: http://vmgump.apache.org/gump/public/turbine-fulcrum/fulcrum-yaafi/atom.xml

    ============================== Gump Tracking Only ===
    Produced by Apache Gump(TM) version 2.3.
    Gump Run 14000010092012, vmgump.apache.org:vmgump:14000010092012
    Gump E-mail Identifier (unique within run) #14.

    --
    Apache Gump
    http://gump.apache.org/ [Instance: vmgump]

    ---------------------------------------------------------------------
    To unsubscribe, e-mail: dev-unsubscribe@turbine.apache.org
    For additional commands, e-mail: dev-help@turbine.apache.org

Related Discussions

Discussion Navigation
viewthread | post
Discussion Overview
groupdev @
categoriesturbine
postedSep 8, '12 at 1:24a
activeSep 10, '12 at 1:23a
posts4
users1
websiteturbine.apache.org

1 user in discussion

Anonymous: 4 posts

People

Translate

site design / logo © 2018 Grokbase