FAQ
To whom it may engage...

This is an automated request, but not an unsolicited one. For
more information please visit http://gump.apache.org/nagged.html,
and/or contact the folk at general@gump.apache.org.

Project fulcrum-parser has an issue affecting its community integration.
This issue affects 1 projects,
and has been outstanding for 444 runs.
The current state of this project is 'Failed', with reason 'Build Failed'.
For reference only, the following projects are affected by this:
- fulcrum-parser : Services Framework


Full details are available at:
http://vmgump.apache.org/gump/public/turbine-fulcrum/fulcrum-parser/index.html

That said, some information snippets are provided here.

The following annotations (debug/informational/warning/error messages) were provided:
-DEBUG- Sole jar output [fulcrum-parser-*[0-9T].jar] identifier set to project name
-DEBUG- (Apache Gump generated) Apache Maven Settings in: /srv/gump/public/workspace/turbine-fulcrum/parser/gump_mvn_settings.xml
-INFO- Failed with reason build failed
-DEBUG- Maven POM in: /srv/gump/public/workspace/turbine-fulcrum/parser/pom.xml
-INFO- Failed to extract fallback artifacts from Gump Repository



The following work was performed:
http://vmgump.apache.org/gump/public/turbine-fulcrum/fulcrum-parser/gump_work/build_turbine-fulcrum_fulcrum-parser.html
Work Name: build_turbine-fulcrum_fulcrum-parser (Type: Build)
Work ended in a state of : Failed
Elapsed: 9 secs
Command Line: /opt/maven2/bin/mvn --batch-mode --settings /srv/gump/public/workspace/turbine-fulcrum/parser/gump_mvn_settings.xml package
[Working Directory: /srv/gump/public/workspace/turbine-fulcrum/parser]
M2_HOME: /opt/maven2
---------------------------------------------
return uploadService.getItemIterator(request);
^

class file for org.apache.commons.fileupload.FileItemIterator not found
/srv/gump/public/workspace/turbine-fulcrum/parser/src/java/org/apache/fulcrum/parser/DefaultParameterParser.java:[160,21] error: cannot find symbol

could not parse error message: symbol: class FileItem
location: class DefaultParameterParser
/srv/gump/public/workspace/turbine-fulcrum/parser/src/java/org/apache/fulcrum/parser/DefaultParameterParser.java:164: error: cannot find symbol
for (FileItem fi : fileItems)
^

could not parse error message: symbol: class FileItem
location: class DefaultParameterParser
/srv/gump/public/workspace/turbine-fulcrum/parser/src/java/org/apache/fulcrum/parser/DefaultParameterParser.java:304: error: cannot find symbol
FileItem[] items = this.getFileItems(name);
^

could not parse error message: symbol: class FileItem
location: class DefaultParameterParser
/srv/gump/public/workspace/turbine-fulcrum/parser/src/java/org/apache/fulcrum/parser/DefaultParameterParser.java:305: error: cannot find symbol
items = (FileItem []) ArrayUtils.add(items, value);
^

could not parse error message: symbol: class FileItem
location: class DefaultParameterParser
/srv/gump/public/workspace/turbine-fulcrum/parser/src/java/org/apache/fulcrum/parser/DefaultParameterParser.java:321: error: cannot find symbol
FileItem value = null;
^

could not parse error message: symbol: class FileItem
location: class DefaultParameterParser
/srv/gump/public/workspace/turbine-fulcrum/parser/src/java/org/apache/fulcrum/parser/DefaultParameterParser.java:324: error: cannot find symbol
value = ((FileItem[])object)[0];
^

could not parse error message: symbol: class FileItem
location: class DefaultParameterParser
/srv/gump/public/workspace/turbine-fulcrum/parser/src/java/org/apache/fulcrum/parser/DefaultParameterParser.java:345: error: cannot find symbol
return (FileItem[])parameters.get(convert(name));
^


[INFO] ------------------------------------------------------------------------
[INFO] For more information, run Maven with the -e switch
[INFO] ------------------------------------------------------------------------
[INFO] Total time: 8 seconds
[INFO] Finished at: Fri Aug 10 08:44:59 UTC 2012
[INFO] Final Memory: 18M/43M
[INFO] ------------------------------------------------------------------------
---------------------------------------------

To subscribe to this information via syndicated feeds:
- RSS: http://vmgump.apache.org/gump/public/turbine-fulcrum/fulcrum-parser/rss.xml
- Atom: http://vmgump.apache.org/gump/public/turbine-fulcrum/fulcrum-parser/atom.xml

============================== Gump Tracking Only ===
Produced by Apache Gump(TM) version 2.3.
Gump Run 06000610082012, vmgump.apache.org:vmgump:06000610082012
Gump E-mail Identifier (unique within run) #30.

--
Apache Gump
http://gump.apache.org/ [Instance: vmgump]

---------------------------------------------------------------------
To unsubscribe, e-mail: dev-unsubscribe@turbine.apache.org
For additional commands, e-mail: dev-help@turbine.apache.org

Search Discussions

  • Anonymous at Aug 10, 2012 at 8:31 pm
    To whom it may engage...

    This is an automated request, but not an unsolicited one. For
    more information please visit http://gump.apache.org/nagged.html,
    and/or contact the folk at general@gump.apache.org.

    Project fulcrum-parser has an issue affecting its community integration.
    This issue affects 1 projects.
    The current state of this project is 'Failed', with reason 'Build Failed'.
    For reference only, the following projects are affected by this:
    - fulcrum-parser : Services Framework


    Full details are available at:
    http://vmgump.apache.org/gump/public/turbine-fulcrum/fulcrum-parser/index.html

    That said, some information snippets are provided here.

    The following annotations (debug/informational/warning/error messages) were provided:
    -DEBUG- Sole jar output [fulcrum-parser-*[0-9T].jar] identifier set to project name
    -DEBUG- (Apache Gump generated) Apache Maven Settings in: /srv/gump/public/workspace/turbine-fulcrum/parser/gump_mvn_settings.xml
    -INFO- Failed with reason build failed
    -DEBUG- Maven POM in: /srv/gump/public/workspace/turbine-fulcrum/parser/pom.xml
    -INFO- Failed to extract fallback artifacts from Gump Repository



    The following work was performed:
    http://vmgump.apache.org/gump/public/turbine-fulcrum/fulcrum-parser/gump_work/build_turbine-fulcrum_fulcrum-parser.html
    Work Name: build_turbine-fulcrum_fulcrum-parser (Type: Build)
    Work ended in a state of : Failed
    Elapsed: 9 secs
    Command Line: /opt/maven2/bin/mvn --batch-mode --settings /srv/gump/public/workspace/turbine-fulcrum/parser/gump_mvn_settings.xml package
    [Working Directory: /srv/gump/public/workspace/turbine-fulcrum/parser]
    M2_HOME: /opt/maven2
    ---------------------------------------------
    return uploadService.getItemIterator(request);
    ^

    class file for org.apache.commons.fileupload.FileItemIterator not found
    /srv/gump/public/workspace/turbine-fulcrum/parser/src/java/org/apache/fulcrum/parser/DefaultParameterParser.java:[160,21] error: cannot find symbol

    could not parse error message: symbol: class FileItem
    location: class DefaultParameterParser
    /srv/gump/public/workspace/turbine-fulcrum/parser/src/java/org/apache/fulcrum/parser/DefaultParameterParser.java:164: error: cannot find symbol
    for (FileItem fi : fileItems)
    ^

    could not parse error message: symbol: class FileItem
    location: class DefaultParameterParser
    /srv/gump/public/workspace/turbine-fulcrum/parser/src/java/org/apache/fulcrum/parser/DefaultParameterParser.java:304: error: cannot find symbol
    FileItem[] items = this.getFileItems(name);
    ^

    could not parse error message: symbol: class FileItem
    location: class DefaultParameterParser
    /srv/gump/public/workspace/turbine-fulcrum/parser/src/java/org/apache/fulcrum/parser/DefaultParameterParser.java:305: error: cannot find symbol
    items = (FileItem []) ArrayUtils.add(items, value);
    ^

    could not parse error message: symbol: class FileItem
    location: class DefaultParameterParser
    /srv/gump/public/workspace/turbine-fulcrum/parser/src/java/org/apache/fulcrum/parser/DefaultParameterParser.java:321: error: cannot find symbol
    FileItem value = null;
    ^

    could not parse error message: symbol: class FileItem
    location: class DefaultParameterParser
    /srv/gump/public/workspace/turbine-fulcrum/parser/src/java/org/apache/fulcrum/parser/DefaultParameterParser.java:324: error: cannot find symbol
    value = ((FileItem[])object)[0];
    ^

    could not parse error message: symbol: class FileItem
    location: class DefaultParameterParser
    /srv/gump/public/workspace/turbine-fulcrum/parser/src/java/org/apache/fulcrum/parser/DefaultParameterParser.java:345: error: cannot find symbol
    return (FileItem[])parameters.get(convert(name));
    ^


    [INFO] ------------------------------------------------------------------------
    [INFO] For more information, run Maven with the -e switch
    [INFO] ------------------------------------------------------------------------
    [INFO] Total time: 8 seconds
    [INFO] Finished at: Fri Aug 10 20:31:30 UTC 2012
    [INFO] Final Memory: 18M/43M
    [INFO] ------------------------------------------------------------------------
    ---------------------------------------------

    To subscribe to this information via syndicated feeds:
    - RSS: http://vmgump.apache.org/gump/public/turbine-fulcrum/fulcrum-parser/rss.xml
    - Atom: http://vmgump.apache.org/gump/public/turbine-fulcrum/fulcrum-parser/atom.xml

    ============================== Gump Tracking Only ===
    Produced by Apache Gump(TM) version 2.3.
    Gump Run 05001810082012, vmgump.apache.org:vmgump:05001810082012
    Gump E-mail Identifier (unique within run) #2.

    --
    Apache Gump
    http://gump.apache.org/ [Instance: vmgump]

    ---------------------------------------------------------------------
    To unsubscribe, e-mail: dev-unsubscribe@turbine.apache.org
    For additional commands, e-mail: dev-help@turbine.apache.org
  • Anonymous at Aug 11, 2012 at 8:38 am
    To whom it may engage...

    This is an automated request, but not an unsolicited one. For
    more information please visit http://gump.apache.org/nagged.html,
    and/or contact the folk at general@gump.apache.org.

    Project fulcrum-parser has an issue affecting its community integration.
    This issue affects 1 projects,
    and has been outstanding for 2 runs.
    The current state of this project is 'Failed', with reason 'Build Failed'.
    For reference only, the following projects are affected by this:
    - fulcrum-parser : Services Framework


    Full details are available at:
    http://vmgump.apache.org/gump/public/turbine-fulcrum/fulcrum-parser/index.html

    That said, some information snippets are provided here.

    The following annotations (debug/informational/warning/error messages) were provided:
    -DEBUG- Sole jar output [fulcrum-parser-*[0-9T].jar] identifier set to project name
    -DEBUG- (Apache Gump generated) Apache Maven Settings in: /srv/gump/public/workspace/turbine-fulcrum/parser/gump_mvn_settings.xml
    -INFO- Failed with reason build failed
    -DEBUG- Maven POM in: /srv/gump/public/workspace/turbine-fulcrum/parser/pom.xml
    -INFO- Failed to extract fallback artifacts from Gump Repository



    The following work was performed:
    http://vmgump.apache.org/gump/public/turbine-fulcrum/fulcrum-parser/gump_work/build_turbine-fulcrum_fulcrum-parser.html
    Work Name: build_turbine-fulcrum_fulcrum-parser (Type: Build)
    Work ended in a state of : Failed
    Elapsed: 10 secs
    Command Line: /opt/maven2/bin/mvn --batch-mode --settings /srv/gump/public/workspace/turbine-fulcrum/parser/gump_mvn_settings.xml package
    [Working Directory: /srv/gump/public/workspace/turbine-fulcrum/parser]
    M2_HOME: /opt/maven2
    ---------------------------------------------
    return uploadService.getItemIterator(request);
    ^

    class file for org.apache.commons.fileupload.FileItemIterator not found
    /srv/gump/public/workspace/turbine-fulcrum/parser/src/java/org/apache/fulcrum/parser/DefaultParameterParser.java:[160,21] error: cannot find symbol

    could not parse error message: symbol: class FileItem
    location: class DefaultParameterParser
    /srv/gump/public/workspace/turbine-fulcrum/parser/src/java/org/apache/fulcrum/parser/DefaultParameterParser.java:164: error: cannot find symbol
    for (FileItem fi : fileItems)
    ^

    could not parse error message: symbol: class FileItem
    location: class DefaultParameterParser
    /srv/gump/public/workspace/turbine-fulcrum/parser/src/java/org/apache/fulcrum/parser/DefaultParameterParser.java:304: error: cannot find symbol
    FileItem[] items = this.getFileItems(name);
    ^

    could not parse error message: symbol: class FileItem
    location: class DefaultParameterParser
    /srv/gump/public/workspace/turbine-fulcrum/parser/src/java/org/apache/fulcrum/parser/DefaultParameterParser.java:305: error: cannot find symbol
    items = (FileItem []) ArrayUtils.add(items, value);
    ^

    could not parse error message: symbol: class FileItem
    location: class DefaultParameterParser
    /srv/gump/public/workspace/turbine-fulcrum/parser/src/java/org/apache/fulcrum/parser/DefaultParameterParser.java:321: error: cannot find symbol
    FileItem value = null;
    ^

    could not parse error message: symbol: class FileItem
    location: class DefaultParameterParser
    /srv/gump/public/workspace/turbine-fulcrum/parser/src/java/org/apache/fulcrum/parser/DefaultParameterParser.java:324: error: cannot find symbol
    value = ((FileItem[])object)[0];
    ^

    could not parse error message: symbol: class FileItem
    location: class DefaultParameterParser
    /srv/gump/public/workspace/turbine-fulcrum/parser/src/java/org/apache/fulcrum/parser/DefaultParameterParser.java:345: error: cannot find symbol
    return (FileItem[])parameters.get(convert(name));
    ^


    [INFO] ------------------------------------------------------------------------
    [INFO] For more information, run Maven with the -e switch
    [INFO] ------------------------------------------------------------------------
    [INFO] Total time: 8 seconds
    [INFO] Finished at: Sat Aug 11 08:37:53 UTC 2012
    [INFO] Final Memory: 18M/43M
    [INFO] ------------------------------------------------------------------------
    ---------------------------------------------

    To subscribe to this information via syndicated feeds:
    - RSS: http://vmgump.apache.org/gump/public/turbine-fulcrum/fulcrum-parser/rss.xml
    - Atom: http://vmgump.apache.org/gump/public/turbine-fulcrum/fulcrum-parser/atom.xml

    ============================== Gump Tracking Only ===
    Produced by Apache Gump(TM) version 2.3.
    Gump Run 05000611082012, vmgump.apache.org:vmgump:05000611082012
    Gump E-mail Identifier (unique within run) #29.

    --
    Apache Gump
    http://gump.apache.org/ [Instance: vmgump]

    ---------------------------------------------------------------------
    To unsubscribe, e-mail: dev-unsubscribe@turbine.apache.org
    For additional commands, e-mail: dev-help@turbine.apache.org
  • Anonymous at Aug 12, 2012 at 10:10 am
    To whom it may engage...

    This is an automated request, but not an unsolicited one. For
    more information please visit http://gump.apache.org/nagged.html,
    and/or contact the folk at general@gump.apache.org.

    Project fulcrum-parser has an issue affecting its community integration.
    This issue affects 1 projects,
    and has been outstanding for 4 runs.
    The current state of this project is 'Failed', with reason 'Build Failed'.
    For reference only, the following projects are affected by this:
    - fulcrum-parser : Services Framework


    Full details are available at:
    http://vmgump.apache.org/gump/public/turbine-fulcrum/fulcrum-parser/index.html

    That said, some information snippets are provided here.

    The following annotations (debug/informational/warning/error messages) were provided:
    -DEBUG- Sole jar output [fulcrum-parser-*[0-9T].jar] identifier set to project name
    -DEBUG- (Apache Gump generated) Apache Maven Settings in: /srv/gump/public/workspace/turbine-fulcrum/parser/gump_mvn_settings.xml
    -INFO- Failed with reason build failed
    -DEBUG- Maven POM in: /srv/gump/public/workspace/turbine-fulcrum/parser/pom.xml
    -INFO- Failed to extract fallback artifacts from Gump Repository



    The following work was performed:
    http://vmgump.apache.org/gump/public/turbine-fulcrum/fulcrum-parser/gump_work/build_turbine-fulcrum_fulcrum-parser.html
    Work Name: build_turbine-fulcrum_fulcrum-parser (Type: Build)
    Work ended in a state of : Failed
    Elapsed: 9 secs
    Command Line: /opt/maven2/bin/mvn --batch-mode --settings /srv/gump/public/workspace/turbine-fulcrum/parser/gump_mvn_settings.xml package
    [Working Directory: /srv/gump/public/workspace/turbine-fulcrum/parser]
    M2_HOME: /opt/maven2
    ---------------------------------------------
    return uploadService.getItemIterator(request);
    ^

    class file for org.apache.commons.fileupload.FileItemIterator not found
    /srv/gump/public/workspace/turbine-fulcrum/parser/src/java/org/apache/fulcrum/parser/DefaultParameterParser.java:[160,21] error: cannot find symbol

    could not parse error message: symbol: class FileItem
    location: class DefaultParameterParser
    /srv/gump/public/workspace/turbine-fulcrum/parser/src/java/org/apache/fulcrum/parser/DefaultParameterParser.java:164: error: cannot find symbol
    for (FileItem fi : fileItems)
    ^

    could not parse error message: symbol: class FileItem
    location: class DefaultParameterParser
    /srv/gump/public/workspace/turbine-fulcrum/parser/src/java/org/apache/fulcrum/parser/DefaultParameterParser.java:304: error: cannot find symbol
    FileItem[] items = this.getFileItems(name);
    ^

    could not parse error message: symbol: class FileItem
    location: class DefaultParameterParser
    /srv/gump/public/workspace/turbine-fulcrum/parser/src/java/org/apache/fulcrum/parser/DefaultParameterParser.java:305: error: cannot find symbol
    items = (FileItem []) ArrayUtils.add(items, value);
    ^

    could not parse error message: symbol: class FileItem
    location: class DefaultParameterParser
    /srv/gump/public/workspace/turbine-fulcrum/parser/src/java/org/apache/fulcrum/parser/DefaultParameterParser.java:321: error: cannot find symbol
    FileItem value = null;
    ^

    could not parse error message: symbol: class FileItem
    location: class DefaultParameterParser
    /srv/gump/public/workspace/turbine-fulcrum/parser/src/java/org/apache/fulcrum/parser/DefaultParameterParser.java:324: error: cannot find symbol
    value = ((FileItem[])object)[0];
    ^

    could not parse error message: symbol: class FileItem
    location: class DefaultParameterParser
    /srv/gump/public/workspace/turbine-fulcrum/parser/src/java/org/apache/fulcrum/parser/DefaultParameterParser.java:345: error: cannot find symbol
    return (FileItem[])parameters.get(convert(name));
    ^


    [INFO] ------------------------------------------------------------------------
    [INFO] For more information, run Maven with the -e switch
    [INFO] ------------------------------------------------------------------------
    [INFO] Total time: 8 seconds
    [INFO] Finished at: Sun Aug 12 10:09:30 UTC 2012
    [INFO] Final Memory: 18M/43M
    [INFO] ------------------------------------------------------------------------
    ---------------------------------------------

    To subscribe to this information via syndicated feeds:
    - RSS: http://vmgump.apache.org/gump/public/turbine-fulcrum/fulcrum-parser/rss.xml
    - Atom: http://vmgump.apache.org/gump/public/turbine-fulcrum/fulcrum-parser/atom.xml

    ============================== Gump Tracking Only ===
    Produced by Apache Gump(TM) version 2.3.
    Gump Run 06000612082012, vmgump.apache.org:vmgump:06000612082012
    Gump E-mail Identifier (unique within run) #35.

    --
    Apache Gump
    http://gump.apache.org/ [Instance: vmgump]

    ---------------------------------------------------------------------
    To unsubscribe, e-mail: dev-unsubscribe@turbine.apache.org
    For additional commands, e-mail: dev-help@turbine.apache.org
  • Anonymous at Aug 13, 2012 at 10:03 am
    To whom it may engage...

    This is an automated request, but not an unsolicited one. For
    more information please visit http://gump.apache.org/nagged.html,
    and/or contact the folk at general@gump.apache.org.

    Project fulcrum-parser has an issue affecting its community integration.
    This issue affects 1 projects,
    and has been outstanding for 6 runs.
    The current state of this project is 'Failed', with reason 'Build Failed'.
    For reference only, the following projects are affected by this:
    - fulcrum-parser : Services Framework


    Full details are available at:
    http://vmgump.apache.org/gump/public/turbine-fulcrum/fulcrum-parser/index.html

    That said, some information snippets are provided here.

    The following annotations (debug/informational/warning/error messages) were provided:
    -DEBUG- Sole jar output [fulcrum-parser-*[0-9T].jar] identifier set to project name
    -DEBUG- (Apache Gump generated) Apache Maven Settings in: /srv/gump/public/workspace/turbine-fulcrum/parser/gump_mvn_settings.xml
    -INFO- Failed with reason build failed
    -DEBUG- Maven POM in: /srv/gump/public/workspace/turbine-fulcrum/parser/pom.xml
    -INFO- Failed to extract fallback artifacts from Gump Repository



    The following work was performed:
    http://vmgump.apache.org/gump/public/turbine-fulcrum/fulcrum-parser/gump_work/build_turbine-fulcrum_fulcrum-parser.html
    Work Name: build_turbine-fulcrum_fulcrum-parser (Type: Build)
    Work ended in a state of : Failed
    Elapsed: 9 secs
    Command Line: /opt/maven2/bin/mvn --batch-mode --settings /srv/gump/public/workspace/turbine-fulcrum/parser/gump_mvn_settings.xml package
    [Working Directory: /srv/gump/public/workspace/turbine-fulcrum/parser]
    M2_HOME: /opt/maven2
    ---------------------------------------------
    return uploadService.getItemIterator(request);
    ^

    class file for org.apache.commons.fileupload.FileItemIterator not found
    /srv/gump/public/workspace/turbine-fulcrum/parser/src/java/org/apache/fulcrum/parser/DefaultParameterParser.java:[160,21] error: cannot find symbol

    could not parse error message: symbol: class FileItem
    location: class DefaultParameterParser
    /srv/gump/public/workspace/turbine-fulcrum/parser/src/java/org/apache/fulcrum/parser/DefaultParameterParser.java:164: error: cannot find symbol
    for (FileItem fi : fileItems)
    ^

    could not parse error message: symbol: class FileItem
    location: class DefaultParameterParser
    /srv/gump/public/workspace/turbine-fulcrum/parser/src/java/org/apache/fulcrum/parser/DefaultParameterParser.java:304: error: cannot find symbol
    FileItem[] items = this.getFileItems(name);
    ^

    could not parse error message: symbol: class FileItem
    location: class DefaultParameterParser
    /srv/gump/public/workspace/turbine-fulcrum/parser/src/java/org/apache/fulcrum/parser/DefaultParameterParser.java:305: error: cannot find symbol
    items = (FileItem []) ArrayUtils.add(items, value);
    ^

    could not parse error message: symbol: class FileItem
    location: class DefaultParameterParser
    /srv/gump/public/workspace/turbine-fulcrum/parser/src/java/org/apache/fulcrum/parser/DefaultParameterParser.java:321: error: cannot find symbol
    FileItem value = null;
    ^

    could not parse error message: symbol: class FileItem
    location: class DefaultParameterParser
    /srv/gump/public/workspace/turbine-fulcrum/parser/src/java/org/apache/fulcrum/parser/DefaultParameterParser.java:324: error: cannot find symbol
    value = ((FileItem[])object)[0];
    ^

    could not parse error message: symbol: class FileItem
    location: class DefaultParameterParser
    /srv/gump/public/workspace/turbine-fulcrum/parser/src/java/org/apache/fulcrum/parser/DefaultParameterParser.java:345: error: cannot find symbol
    return (FileItem[])parameters.get(convert(name));
    ^


    [INFO] ------------------------------------------------------------------------
    [INFO] For more information, run Maven with the -e switch
    [INFO] ------------------------------------------------------------------------
    [INFO] Total time: 8 seconds
    [INFO] Finished at: Mon Aug 13 10:02:55 UTC 2012
    [INFO] Final Memory: 18M/43M
    [INFO] ------------------------------------------------------------------------
    ---------------------------------------------

    To subscribe to this information via syndicated feeds:
    - RSS: http://vmgump.apache.org/gump/public/turbine-fulcrum/fulcrum-parser/rss.xml
    - Atom: http://vmgump.apache.org/gump/public/turbine-fulcrum/fulcrum-parser/atom.xml

    ============================== Gump Tracking Only ===
    Produced by Apache Gump(TM) version 2.3.
    Gump Run 05000613082012, vmgump.apache.org:vmgump:05000613082012
    Gump E-mail Identifier (unique within run) #35.

    --
    Apache Gump
    http://gump.apache.org/ [Instance: vmgump]

    ---------------------------------------------------------------------
    To unsubscribe, e-mail: dev-unsubscribe@turbine.apache.org
    For additional commands, e-mail: dev-help@turbine.apache.org
  • Anonymous at Aug 14, 2012 at 10:16 am
    To whom it may engage...

    This is an automated request, but not an unsolicited one. For
    more information please visit http://gump.apache.org/nagged.html,
    and/or contact the folk at general@gump.apache.org.

    Project fulcrum-parser has an issue affecting its community integration.
    This issue affects 1 projects,
    and has been outstanding for 8 runs.
    The current state of this project is 'Failed', with reason 'Build Failed'.
    For reference only, the following projects are affected by this:
    - fulcrum-parser : Services Framework


    Full details are available at:
    http://vmgump.apache.org/gump/public/turbine-fulcrum/fulcrum-parser/index.html

    That said, some information snippets are provided here.

    The following annotations (debug/informational/warning/error messages) were provided:
    -DEBUG- Sole jar output [fulcrum-parser-*[0-9T].jar] identifier set to project name
    -DEBUG- (Apache Gump generated) Apache Maven Settings in: /srv/gump/public/workspace/turbine-fulcrum/parser/gump_mvn_settings.xml
    -INFO- Failed with reason build failed
    -DEBUG- Maven POM in: /srv/gump/public/workspace/turbine-fulcrum/parser/pom.xml
    -INFO- Failed to extract fallback artifacts from Gump Repository



    The following work was performed:
    http://vmgump.apache.org/gump/public/turbine-fulcrum/fulcrum-parser/gump_work/build_turbine-fulcrum_fulcrum-parser.html
    Work Name: build_turbine-fulcrum_fulcrum-parser (Type: Build)
    Work ended in a state of : Failed
    Elapsed: 9 secs
    Command Line: /opt/maven2/bin/mvn --batch-mode --settings /srv/gump/public/workspace/turbine-fulcrum/parser/gump_mvn_settings.xml package
    [Working Directory: /srv/gump/public/workspace/turbine-fulcrum/parser]
    M2_HOME: /opt/maven2
    ---------------------------------------------
    return uploadService.getItemIterator(request);
    ^

    class file for org.apache.commons.fileupload.FileItemIterator not found
    /srv/gump/public/workspace/turbine-fulcrum/parser/src/java/org/apache/fulcrum/parser/DefaultParameterParser.java:[160,21] error: cannot find symbol

    could not parse error message: symbol: class FileItem
    location: class DefaultParameterParser
    /srv/gump/public/workspace/turbine-fulcrum/parser/src/java/org/apache/fulcrum/parser/DefaultParameterParser.java:164: error: cannot find symbol
    for (FileItem fi : fileItems)
    ^

    could not parse error message: symbol: class FileItem
    location: class DefaultParameterParser
    /srv/gump/public/workspace/turbine-fulcrum/parser/src/java/org/apache/fulcrum/parser/DefaultParameterParser.java:304: error: cannot find symbol
    FileItem[] items = this.getFileItems(name);
    ^

    could not parse error message: symbol: class FileItem
    location: class DefaultParameterParser
    /srv/gump/public/workspace/turbine-fulcrum/parser/src/java/org/apache/fulcrum/parser/DefaultParameterParser.java:305: error: cannot find symbol
    items = (FileItem []) ArrayUtils.add(items, value);
    ^

    could not parse error message: symbol: class FileItem
    location: class DefaultParameterParser
    /srv/gump/public/workspace/turbine-fulcrum/parser/src/java/org/apache/fulcrum/parser/DefaultParameterParser.java:321: error: cannot find symbol
    FileItem value = null;
    ^

    could not parse error message: symbol: class FileItem
    location: class DefaultParameterParser
    /srv/gump/public/workspace/turbine-fulcrum/parser/src/java/org/apache/fulcrum/parser/DefaultParameterParser.java:324: error: cannot find symbol
    value = ((FileItem[])object)[0];
    ^

    could not parse error message: symbol: class FileItem
    location: class DefaultParameterParser
    /srv/gump/public/workspace/turbine-fulcrum/parser/src/java/org/apache/fulcrum/parser/DefaultParameterParser.java:345: error: cannot find symbol
    return (FileItem[])parameters.get(convert(name));
    ^


    [INFO] ------------------------------------------------------------------------
    [INFO] For more information, run Maven with the -e switch
    [INFO] ------------------------------------------------------------------------
    [INFO] Total time: 8 seconds
    [INFO] Finished at: Tue Aug 14 10:15:34 UTC 2012
    [INFO] Final Memory: 18M/43M
    [INFO] ------------------------------------------------------------------------
    ---------------------------------------------

    To subscribe to this information via syndicated feeds:
    - RSS: http://vmgump.apache.org/gump/public/turbine-fulcrum/fulcrum-parser/rss.xml
    - Atom: http://vmgump.apache.org/gump/public/turbine-fulcrum/fulcrum-parser/atom.xml

    ============================== Gump Tracking Only ===
    Produced by Apache Gump(TM) version 2.3.
    Gump Run 06000614082012, vmgump.apache.org:vmgump:06000614082012
    Gump E-mail Identifier (unique within run) #35.

    --
    Apache Gump
    http://gump.apache.org/ [Instance: vmgump]

    ---------------------------------------------------------------------
    To unsubscribe, e-mail: dev-unsubscribe@turbine.apache.org
    For additional commands, e-mail: dev-help@turbine.apache.org
  • Anonymous at Aug 15, 2012 at 10:10 am
    To whom it may engage...

    This is an automated request, but not an unsolicited one. For
    more information please visit http://gump.apache.org/nagged.html,
    and/or contact the folk at general@gump.apache.org.

    Project fulcrum-parser has an issue affecting its community integration.
    This issue affects 1 projects,
    and has been outstanding for 10 runs.
    The current state of this project is 'Failed', with reason 'Build Failed'.
    For reference only, the following projects are affected by this:
    - fulcrum-parser : Services Framework


    Full details are available at:
    http://vmgump.apache.org/gump/public/turbine-fulcrum/fulcrum-parser/index.html

    That said, some information snippets are provided here.

    The following annotations (debug/informational/warning/error messages) were provided:
    -DEBUG- Sole jar output [fulcrum-parser-*[0-9T].jar] identifier set to project name
    -DEBUG- (Apache Gump generated) Apache Maven Settings in: /srv/gump/public/workspace/turbine-fulcrum/parser/gump_mvn_settings.xml
    -INFO- Failed with reason build failed
    -DEBUG- Maven POM in: /srv/gump/public/workspace/turbine-fulcrum/parser/pom.xml
    -INFO- Failed to extract fallback artifacts from Gump Repository



    The following work was performed:
    http://vmgump.apache.org/gump/public/turbine-fulcrum/fulcrum-parser/gump_work/build_turbine-fulcrum_fulcrum-parser.html
    Work Name: build_turbine-fulcrum_fulcrum-parser (Type: Build)
    Work ended in a state of : Failed
    Elapsed: 9 secs
    Command Line: /opt/maven2/bin/mvn --batch-mode --settings /srv/gump/public/workspace/turbine-fulcrum/parser/gump_mvn_settings.xml package
    [Working Directory: /srv/gump/public/workspace/turbine-fulcrum/parser]
    M2_HOME: /opt/maven2
    ---------------------------------------------
    return uploadService.getItemIterator(request);
    ^

    class file for org.apache.commons.fileupload.FileItemIterator not found
    /srv/gump/public/workspace/turbine-fulcrum/parser/src/java/org/apache/fulcrum/parser/DefaultParameterParser.java:[160,21] error: cannot find symbol

    could not parse error message: symbol: class FileItem
    location: class DefaultParameterParser
    /srv/gump/public/workspace/turbine-fulcrum/parser/src/java/org/apache/fulcrum/parser/DefaultParameterParser.java:164: error: cannot find symbol
    for (FileItem fi : fileItems)
    ^

    could not parse error message: symbol: class FileItem
    location: class DefaultParameterParser
    /srv/gump/public/workspace/turbine-fulcrum/parser/src/java/org/apache/fulcrum/parser/DefaultParameterParser.java:304: error: cannot find symbol
    FileItem[] items = this.getFileItems(name);
    ^

    could not parse error message: symbol: class FileItem
    location: class DefaultParameterParser
    /srv/gump/public/workspace/turbine-fulcrum/parser/src/java/org/apache/fulcrum/parser/DefaultParameterParser.java:305: error: cannot find symbol
    items = (FileItem []) ArrayUtils.add(items, value);
    ^

    could not parse error message: symbol: class FileItem
    location: class DefaultParameterParser
    /srv/gump/public/workspace/turbine-fulcrum/parser/src/java/org/apache/fulcrum/parser/DefaultParameterParser.java:321: error: cannot find symbol
    FileItem value = null;
    ^

    could not parse error message: symbol: class FileItem
    location: class DefaultParameterParser
    /srv/gump/public/workspace/turbine-fulcrum/parser/src/java/org/apache/fulcrum/parser/DefaultParameterParser.java:324: error: cannot find symbol
    value = ((FileItem[])object)[0];
    ^

    could not parse error message: symbol: class FileItem
    location: class DefaultParameterParser
    /srv/gump/public/workspace/turbine-fulcrum/parser/src/java/org/apache/fulcrum/parser/DefaultParameterParser.java:345: error: cannot find symbol
    return (FileItem[])parameters.get(convert(name));
    ^


    [INFO] ------------------------------------------------------------------------
    [INFO] For more information, run Maven with the -e switch
    [INFO] ------------------------------------------------------------------------
    [INFO] Total time: 8 seconds
    [INFO] Finished at: Wed Aug 15 10:10:01 UTC 2012
    [INFO] Final Memory: 18M/43M
    [INFO] ------------------------------------------------------------------------
    ---------------------------------------------

    To subscribe to this information via syndicated feeds:
    - RSS: http://vmgump.apache.org/gump/public/turbine-fulcrum/fulcrum-parser/rss.xml
    - Atom: http://vmgump.apache.org/gump/public/turbine-fulcrum/fulcrum-parser/atom.xml

    ============================== Gump Tracking Only ===
    Produced by Apache Gump(TM) version 2.3.
    Gump Run 05000615082012, vmgump.apache.org:vmgump:05000615082012
    Gump E-mail Identifier (unique within run) #34.

    --
    Apache Gump
    http://gump.apache.org/ [Instance: vmgump]

    ---------------------------------------------------------------------
    To unsubscribe, e-mail: dev-unsubscribe@turbine.apache.org
    For additional commands, e-mail: dev-help@turbine.apache.org
  • Anonymous at Aug 16, 2012 at 10:12 am
    To whom it may engage...

    This is an automated request, but not an unsolicited one. For
    more information please visit http://gump.apache.org/nagged.html,
    and/or contact the folk at general@gump.apache.org.

    Project fulcrum-parser has an issue affecting its community integration.
    This issue affects 1 projects,
    and has been outstanding for 12 runs.
    The current state of this project is 'Failed', with reason 'Build Failed'.
    For reference only, the following projects are affected by this:
    - fulcrum-parser : Services Framework


    Full details are available at:
    http://vmgump.apache.org/gump/public/turbine-fulcrum/fulcrum-parser/index.html

    That said, some information snippets are provided here.

    The following annotations (debug/informational/warning/error messages) were provided:
    -DEBUG- Sole jar output [fulcrum-parser-*[0-9T].jar] identifier set to project name
    -DEBUG- (Apache Gump generated) Apache Maven Settings in: /srv/gump/public/workspace/turbine-fulcrum/parser/gump_mvn_settings.xml
    -INFO- Failed with reason build failed
    -DEBUG- Maven POM in: /srv/gump/public/workspace/turbine-fulcrum/parser/pom.xml
    -INFO- Failed to extract fallback artifacts from Gump Repository



    The following work was performed:
    http://vmgump.apache.org/gump/public/turbine-fulcrum/fulcrum-parser/gump_work/build_turbine-fulcrum_fulcrum-parser.html
    Work Name: build_turbine-fulcrum_fulcrum-parser (Type: Build)
    Work ended in a state of : Failed
    Elapsed: 10 secs
    Command Line: /opt/maven2/bin/mvn --batch-mode --settings /srv/gump/public/workspace/turbine-fulcrum/parser/gump_mvn_settings.xml package
    [Working Directory: /srv/gump/public/workspace/turbine-fulcrum/parser]
    M2_HOME: /opt/maven2
    ---------------------------------------------
    return uploadService.getItemIterator(request);
    ^

    class file for org.apache.commons.fileupload.FileItemIterator not found
    /srv/gump/public/workspace/turbine-fulcrum/parser/src/java/org/apache/fulcrum/parser/DefaultParameterParser.java:[160,21] error: cannot find symbol

    could not parse error message: symbol: class FileItem
    location: class DefaultParameterParser
    /srv/gump/public/workspace/turbine-fulcrum/parser/src/java/org/apache/fulcrum/parser/DefaultParameterParser.java:164: error: cannot find symbol
    for (FileItem fi : fileItems)
    ^

    could not parse error message: symbol: class FileItem
    location: class DefaultParameterParser
    /srv/gump/public/workspace/turbine-fulcrum/parser/src/java/org/apache/fulcrum/parser/DefaultParameterParser.java:304: error: cannot find symbol
    FileItem[] items = this.getFileItems(name);
    ^

    could not parse error message: symbol: class FileItem
    location: class DefaultParameterParser
    /srv/gump/public/workspace/turbine-fulcrum/parser/src/java/org/apache/fulcrum/parser/DefaultParameterParser.java:305: error: cannot find symbol
    items = (FileItem []) ArrayUtils.add(items, value);
    ^

    could not parse error message: symbol: class FileItem
    location: class DefaultParameterParser
    /srv/gump/public/workspace/turbine-fulcrum/parser/src/java/org/apache/fulcrum/parser/DefaultParameterParser.java:321: error: cannot find symbol
    FileItem value = null;
    ^

    could not parse error message: symbol: class FileItem
    location: class DefaultParameterParser
    /srv/gump/public/workspace/turbine-fulcrum/parser/src/java/org/apache/fulcrum/parser/DefaultParameterParser.java:324: error: cannot find symbol
    value = ((FileItem[])object)[0];
    ^

    could not parse error message: symbol: class FileItem
    location: class DefaultParameterParser
    /srv/gump/public/workspace/turbine-fulcrum/parser/src/java/org/apache/fulcrum/parser/DefaultParameterParser.java:345: error: cannot find symbol
    return (FileItem[])parameters.get(convert(name));
    ^


    [INFO] ------------------------------------------------------------------------
    [INFO] For more information, run Maven with the -e switch
    [INFO] ------------------------------------------------------------------------
    [INFO] Total time: 9 seconds
    [INFO] Finished at: Thu Aug 16 10:11:45 UTC 2012
    [INFO] Final Memory: 18M/43M
    [INFO] ------------------------------------------------------------------------
    ---------------------------------------------

    To subscribe to this information via syndicated feeds:
    - RSS: http://vmgump.apache.org/gump/public/turbine-fulcrum/fulcrum-parser/rss.xml
    - Atom: http://vmgump.apache.org/gump/public/turbine-fulcrum/fulcrum-parser/atom.xml

    ============================== Gump Tracking Only ===
    Produced by Apache Gump(TM) version 2.3.
    Gump Run 21000616082012, vmgump.apache.org:vmgump:21000616082012
    Gump E-mail Identifier (unique within run) #35.

    --
    Apache Gump
    http://gump.apache.org/ [Instance: vmgump]

    ---------------------------------------------------------------------
    To unsubscribe, e-mail: dev-unsubscribe@turbine.apache.org
    For additional commands, e-mail: dev-help@turbine.apache.org
  • Anonymous at Aug 17, 2012 at 10:15 am
    To whom it may engage...

    This is an automated request, but not an unsolicited one. For
    more information please visit http://gump.apache.org/nagged.html,
    and/or contact the folk at general@gump.apache.org.

    Project fulcrum-parser has an issue affecting its community integration.
    This issue affects 1 projects,
    and has been outstanding for 14 runs.
    The current state of this project is 'Failed', with reason 'Build Failed'.
    For reference only, the following projects are affected by this:
    - fulcrum-parser : Services Framework


    Full details are available at:
    http://vmgump.apache.org/gump/public/turbine-fulcrum/fulcrum-parser/index.html

    That said, some information snippets are provided here.

    The following annotations (debug/informational/warning/error messages) were provided:
    -DEBUG- Sole jar output [fulcrum-parser-*[0-9T].jar] identifier set to project name
    -DEBUG- (Apache Gump generated) Apache Maven Settings in: /srv/gump/public/workspace/turbine-fulcrum/parser/gump_mvn_settings.xml
    -INFO- Failed with reason build failed
    -DEBUG- Maven POM in: /srv/gump/public/workspace/turbine-fulcrum/parser/pom.xml
    -INFO- Failed to extract fallback artifacts from Gump Repository



    The following work was performed:
    http://vmgump.apache.org/gump/public/turbine-fulcrum/fulcrum-parser/gump_work/build_turbine-fulcrum_fulcrum-parser.html
    Work Name: build_turbine-fulcrum_fulcrum-parser (Type: Build)
    Work ended in a state of : Failed
    Elapsed: 10 secs
    Command Line: /opt/maven2/bin/mvn --batch-mode --settings /srv/gump/public/workspace/turbine-fulcrum/parser/gump_mvn_settings.xml package
    [Working Directory: /srv/gump/public/workspace/turbine-fulcrum/parser]
    M2_HOME: /opt/maven2
    ---------------------------------------------
    return uploadService.getItemIterator(request);
    ^

    class file for org.apache.commons.fileupload.FileItemIterator not found
    /srv/gump/public/workspace/turbine-fulcrum/parser/src/java/org/apache/fulcrum/parser/DefaultParameterParser.java:[160,21] error: cannot find symbol

    could not parse error message: symbol: class FileItem
    location: class DefaultParameterParser
    /srv/gump/public/workspace/turbine-fulcrum/parser/src/java/org/apache/fulcrum/parser/DefaultParameterParser.java:164: error: cannot find symbol
    for (FileItem fi : fileItems)
    ^

    could not parse error message: symbol: class FileItem
    location: class DefaultParameterParser
    /srv/gump/public/workspace/turbine-fulcrum/parser/src/java/org/apache/fulcrum/parser/DefaultParameterParser.java:304: error: cannot find symbol
    FileItem[] items = this.getFileItems(name);
    ^

    could not parse error message: symbol: class FileItem
    location: class DefaultParameterParser
    /srv/gump/public/workspace/turbine-fulcrum/parser/src/java/org/apache/fulcrum/parser/DefaultParameterParser.java:305: error: cannot find symbol
    items = (FileItem []) ArrayUtils.add(items, value);
    ^

    could not parse error message: symbol: class FileItem
    location: class DefaultParameterParser
    /srv/gump/public/workspace/turbine-fulcrum/parser/src/java/org/apache/fulcrum/parser/DefaultParameterParser.java:321: error: cannot find symbol
    FileItem value = null;
    ^

    could not parse error message: symbol: class FileItem
    location: class DefaultParameterParser
    /srv/gump/public/workspace/turbine-fulcrum/parser/src/java/org/apache/fulcrum/parser/DefaultParameterParser.java:324: error: cannot find symbol
    value = ((FileItem[])object)[0];
    ^

    could not parse error message: symbol: class FileItem
    location: class DefaultParameterParser
    /srv/gump/public/workspace/turbine-fulcrum/parser/src/java/org/apache/fulcrum/parser/DefaultParameterParser.java:345: error: cannot find symbol
    return (FileItem[])parameters.get(convert(name));
    ^


    [INFO] ------------------------------------------------------------------------
    [INFO] For more information, run Maven with the -e switch
    [INFO] ------------------------------------------------------------------------
    [INFO] Total time: 9 seconds
    [INFO] Finished at: Fri Aug 17 10:14:27 UTC 2012
    [INFO] Final Memory: 18M/43M
    [INFO] ------------------------------------------------------------------------
    ---------------------------------------------

    To subscribe to this information via syndicated feeds:
    - RSS: http://vmgump.apache.org/gump/public/turbine-fulcrum/fulcrum-parser/rss.xml
    - Atom: http://vmgump.apache.org/gump/public/turbine-fulcrum/fulcrum-parser/atom.xml

    ============================== Gump Tracking Only ===
    Produced by Apache Gump(TM) version 2.3.
    Gump Run 07000617082012, vmgump.apache.org:vmgump:07000617082012
    Gump E-mail Identifier (unique within run) #35.

    --
    Apache Gump
    http://gump.apache.org/ [Instance: vmgump]

    ---------------------------------------------------------------------
    To unsubscribe, e-mail: dev-unsubscribe@turbine.apache.org
    For additional commands, e-mail: dev-help@turbine.apache.org
  • Anonymous at Aug 18, 2012 at 10:07 am
    To whom it may engage...

    This is an automated request, but not an unsolicited one. For
    more information please visit http://gump.apache.org/nagged.html,
    and/or contact the folk at general@gump.apache.org.

    Project fulcrum-parser has an issue affecting its community integration.
    This issue affects 1 projects,
    and has been outstanding for 16 runs.
    The current state of this project is 'Failed', with reason 'Build Failed'.
    For reference only, the following projects are affected by this:
    - fulcrum-parser : Services Framework


    Full details are available at:
    http://vmgump.apache.org/gump/public/turbine-fulcrum/fulcrum-parser/index.html

    That said, some information snippets are provided here.

    The following annotations (debug/informational/warning/error messages) were provided:
    -DEBUG- Sole jar output [fulcrum-parser-*[0-9T].jar] identifier set to project name
    -DEBUG- (Apache Gump generated) Apache Maven Settings in: /srv/gump/public/workspace/turbine-fulcrum/parser/gump_mvn_settings.xml
    -INFO- Failed with reason build failed
    -DEBUG- Maven POM in: /srv/gump/public/workspace/turbine-fulcrum/parser/pom.xml
    -INFO- Failed to extract fallback artifacts from Gump Repository



    The following work was performed:
    http://vmgump.apache.org/gump/public/turbine-fulcrum/fulcrum-parser/gump_work/build_turbine-fulcrum_fulcrum-parser.html
    Work Name: build_turbine-fulcrum_fulcrum-parser (Type: Build)
    Work ended in a state of : Failed
    Elapsed: 10 secs
    Command Line: /opt/maven2/bin/mvn --batch-mode --settings /srv/gump/public/workspace/turbine-fulcrum/parser/gump_mvn_settings.xml package
    [Working Directory: /srv/gump/public/workspace/turbine-fulcrum/parser]
    M2_HOME: /opt/maven2
    ---------------------------------------------
    return uploadService.getItemIterator(request);
    ^

    class file for org.apache.commons.fileupload.FileItemIterator not found
    /srv/gump/public/workspace/turbine-fulcrum/parser/src/java/org/apache/fulcrum/parser/DefaultParameterParser.java:[160,21] error: cannot find symbol

    could not parse error message: symbol: class FileItem
    location: class DefaultParameterParser
    /srv/gump/public/workspace/turbine-fulcrum/parser/src/java/org/apache/fulcrum/parser/DefaultParameterParser.java:164: error: cannot find symbol
    for (FileItem fi : fileItems)
    ^

    could not parse error message: symbol: class FileItem
    location: class DefaultParameterParser
    /srv/gump/public/workspace/turbine-fulcrum/parser/src/java/org/apache/fulcrum/parser/DefaultParameterParser.java:304: error: cannot find symbol
    FileItem[] items = this.getFileItems(name);
    ^

    could not parse error message: symbol: class FileItem
    location: class DefaultParameterParser
    /srv/gump/public/workspace/turbine-fulcrum/parser/src/java/org/apache/fulcrum/parser/DefaultParameterParser.java:305: error: cannot find symbol
    items = (FileItem []) ArrayUtils.add(items, value);
    ^

    could not parse error message: symbol: class FileItem
    location: class DefaultParameterParser
    /srv/gump/public/workspace/turbine-fulcrum/parser/src/java/org/apache/fulcrum/parser/DefaultParameterParser.java:321: error: cannot find symbol
    FileItem value = null;
    ^

    could not parse error message: symbol: class FileItem
    location: class DefaultParameterParser
    /srv/gump/public/workspace/turbine-fulcrum/parser/src/java/org/apache/fulcrum/parser/DefaultParameterParser.java:324: error: cannot find symbol
    value = ((FileItem[])object)[0];
    ^

    could not parse error message: symbol: class FileItem
    location: class DefaultParameterParser
    /srv/gump/public/workspace/turbine-fulcrum/parser/src/java/org/apache/fulcrum/parser/DefaultParameterParser.java:345: error: cannot find symbol
    return (FileItem[])parameters.get(convert(name));
    ^


    [INFO] ------------------------------------------------------------------------
    [INFO] For more information, run Maven with the -e switch
    [INFO] ------------------------------------------------------------------------
    [INFO] Total time: 9 seconds
    [INFO] Finished at: Sat Aug 18 10:07:16 UTC 2012
    [INFO] Final Memory: 18M/43M
    [INFO] ------------------------------------------------------------------------
    ---------------------------------------------

    To subscribe to this information via syndicated feeds:
    - RSS: http://vmgump.apache.org/gump/public/turbine-fulcrum/fulcrum-parser/rss.xml
    - Atom: http://vmgump.apache.org/gump/public/turbine-fulcrum/fulcrum-parser/atom.xml

    ============================== Gump Tracking Only ===
    Produced by Apache Gump(TM) version 2.3.
    Gump Run 06000618082012, vmgump.apache.org:vmgump:06000618082012
    Gump E-mail Identifier (unique within run) #35.

    --
    Apache Gump
    http://gump.apache.org/ [Instance: vmgump]

    ---------------------------------------------------------------------
    To unsubscribe, e-mail: dev-unsubscribe@turbine.apache.org
    For additional commands, e-mail: dev-help@turbine.apache.org
  • Anonymous at Aug 19, 2012 at 10:11 am
    To whom it may engage...

    This is an automated request, but not an unsolicited one. For
    more information please visit http://gump.apache.org/nagged.html,
    and/or contact the folk at general@gump.apache.org.

    Project fulcrum-parser has an issue affecting its community integration.
    This issue affects 1 projects,
    and has been outstanding for 18 runs.
    The current state of this project is 'Failed', with reason 'Build Failed'.
    For reference only, the following projects are affected by this:
    - fulcrum-parser : Services Framework


    Full details are available at:
    http://vmgump.apache.org/gump/public/turbine-fulcrum/fulcrum-parser/index.html

    That said, some information snippets are provided here.

    The following annotations (debug/informational/warning/error messages) were provided:
    -DEBUG- Sole jar output [fulcrum-parser-*[0-9T].jar] identifier set to project name
    -DEBUG- (Apache Gump generated) Apache Maven Settings in: /srv/gump/public/workspace/turbine-fulcrum/parser/gump_mvn_settings.xml
    -INFO- Failed with reason build failed
    -DEBUG- Maven POM in: /srv/gump/public/workspace/turbine-fulcrum/parser/pom.xml
    -INFO- Failed to extract fallback artifacts from Gump Repository



    The following work was performed:
    http://vmgump.apache.org/gump/public/turbine-fulcrum/fulcrum-parser/gump_work/build_turbine-fulcrum_fulcrum-parser.html
    Work Name: build_turbine-fulcrum_fulcrum-parser (Type: Build)
    Work ended in a state of : Failed
    Elapsed: 10 secs
    Command Line: /opt/maven2/bin/mvn --batch-mode --settings /srv/gump/public/workspace/turbine-fulcrum/parser/gump_mvn_settings.xml package
    [Working Directory: /srv/gump/public/workspace/turbine-fulcrum/parser]
    M2_HOME: /opt/maven2
    ---------------------------------------------
    return uploadService.getItemIterator(request);
    ^

    class file for org.apache.commons.fileupload.FileItemIterator not found
    /srv/gump/public/workspace/turbine-fulcrum/parser/src/java/org/apache/fulcrum/parser/DefaultParameterParser.java:[160,21] error: cannot find symbol

    could not parse error message: symbol: class FileItem
    location: class DefaultParameterParser
    /srv/gump/public/workspace/turbine-fulcrum/parser/src/java/org/apache/fulcrum/parser/DefaultParameterParser.java:164: error: cannot find symbol
    for (FileItem fi : fileItems)
    ^

    could not parse error message: symbol: class FileItem
    location: class DefaultParameterParser
    /srv/gump/public/workspace/turbine-fulcrum/parser/src/java/org/apache/fulcrum/parser/DefaultParameterParser.java:304: error: cannot find symbol
    FileItem[] items = this.getFileItems(name);
    ^

    could not parse error message: symbol: class FileItem
    location: class DefaultParameterParser
    /srv/gump/public/workspace/turbine-fulcrum/parser/src/java/org/apache/fulcrum/parser/DefaultParameterParser.java:305: error: cannot find symbol
    items = (FileItem []) ArrayUtils.add(items, value);
    ^

    could not parse error message: symbol: class FileItem
    location: class DefaultParameterParser
    /srv/gump/public/workspace/turbine-fulcrum/parser/src/java/org/apache/fulcrum/parser/DefaultParameterParser.java:321: error: cannot find symbol
    FileItem value = null;
    ^

    could not parse error message: symbol: class FileItem
    location: class DefaultParameterParser
    /srv/gump/public/workspace/turbine-fulcrum/parser/src/java/org/apache/fulcrum/parser/DefaultParameterParser.java:324: error: cannot find symbol
    value = ((FileItem[])object)[0];
    ^

    could not parse error message: symbol: class FileItem
    location: class DefaultParameterParser
    /srv/gump/public/workspace/turbine-fulcrum/parser/src/java/org/apache/fulcrum/parser/DefaultParameterParser.java:345: error: cannot find symbol
    return (FileItem[])parameters.get(convert(name));
    ^


    [INFO] ------------------------------------------------------------------------
    [INFO] For more information, run Maven with the -e switch
    [INFO] ------------------------------------------------------------------------
    [INFO] Total time: 9 seconds
    [INFO] Finished at: Sun Aug 19 10:11:01 UTC 2012
    [INFO] Final Memory: 18M/43M
    [INFO] ------------------------------------------------------------------------
    ---------------------------------------------

    To subscribe to this information via syndicated feeds:
    - RSS: http://vmgump.apache.org/gump/public/turbine-fulcrum/fulcrum-parser/rss.xml
    - Atom: http://vmgump.apache.org/gump/public/turbine-fulcrum/fulcrum-parser/atom.xml

    ============================== Gump Tracking Only ===
    Produced by Apache Gump(TM) version 2.3.
    Gump Run 06000619082012, vmgump.apache.org:vmgump:06000619082012
    Gump E-mail Identifier (unique within run) #36.

    --
    Apache Gump
    http://gump.apache.org/ [Instance: vmgump]

    ---------------------------------------------------------------------
    To unsubscribe, e-mail: dev-unsubscribe@turbine.apache.org
    For additional commands, e-mail: dev-help@turbine.apache.org
  • Anonymous at Aug 20, 2012 at 10:07 am
    To whom it may engage...

    This is an automated request, but not an unsolicited one. For
    more information please visit http://gump.apache.org/nagged.html,
    and/or contact the folk at general@gump.apache.org.

    Project fulcrum-parser has an issue affecting its community integration.
    This issue affects 1 projects,
    and has been outstanding for 20 runs.
    The current state of this project is 'Failed', with reason 'Build Failed'.
    For reference only, the following projects are affected by this:
    - fulcrum-parser : Services Framework


    Full details are available at:
    http://vmgump.apache.org/gump/public/turbine-fulcrum/fulcrum-parser/index.html

    That said, some information snippets are provided here.

    The following annotations (debug/informational/warning/error messages) were provided:
    -DEBUG- Sole jar output [fulcrum-parser-*[0-9T].jar] identifier set to project name
    -DEBUG- (Apache Gump generated) Apache Maven Settings in: /srv/gump/public/workspace/turbine-fulcrum/parser/gump_mvn_settings.xml
    -INFO- Failed with reason build failed
    -DEBUG- Maven POM in: /srv/gump/public/workspace/turbine-fulcrum/parser/pom.xml
    -INFO- Failed to extract fallback artifacts from Gump Repository



    The following work was performed:
    http://vmgump.apache.org/gump/public/turbine-fulcrum/fulcrum-parser/gump_work/build_turbine-fulcrum_fulcrum-parser.html
    Work Name: build_turbine-fulcrum_fulcrum-parser (Type: Build)
    Work ended in a state of : Failed
    Elapsed: 11 secs
    Command Line: /opt/maven2/bin/mvn --batch-mode --settings /srv/gump/public/workspace/turbine-fulcrum/parser/gump_mvn_settings.xml package
    [Working Directory: /srv/gump/public/workspace/turbine-fulcrum/parser]
    M2_HOME: /opt/maven2
    ---------------------------------------------
    return uploadService.getItemIterator(request);
    ^

    class file for org.apache.commons.fileupload.FileItemIterator not found
    /srv/gump/public/workspace/turbine-fulcrum/parser/src/java/org/apache/fulcrum/parser/DefaultParameterParser.java:[160,21] error: cannot find symbol

    could not parse error message: symbol: class FileItem
    location: class DefaultParameterParser
    /srv/gump/public/workspace/turbine-fulcrum/parser/src/java/org/apache/fulcrum/parser/DefaultParameterParser.java:164: error: cannot find symbol
    for (FileItem fi : fileItems)
    ^

    could not parse error message: symbol: class FileItem
    location: class DefaultParameterParser
    /srv/gump/public/workspace/turbine-fulcrum/parser/src/java/org/apache/fulcrum/parser/DefaultParameterParser.java:304: error: cannot find symbol
    FileItem[] items = this.getFileItems(name);
    ^

    could not parse error message: symbol: class FileItem
    location: class DefaultParameterParser
    /srv/gump/public/workspace/turbine-fulcrum/parser/src/java/org/apache/fulcrum/parser/DefaultParameterParser.java:305: error: cannot find symbol
    items = (FileItem []) ArrayUtils.add(items, value);
    ^

    could not parse error message: symbol: class FileItem
    location: class DefaultParameterParser
    /srv/gump/public/workspace/turbine-fulcrum/parser/src/java/org/apache/fulcrum/parser/DefaultParameterParser.java:321: error: cannot find symbol
    FileItem value = null;
    ^

    could not parse error message: symbol: class FileItem
    location: class DefaultParameterParser
    /srv/gump/public/workspace/turbine-fulcrum/parser/src/java/org/apache/fulcrum/parser/DefaultParameterParser.java:324: error: cannot find symbol
    value = ((FileItem[])object)[0];
    ^

    could not parse error message: symbol: class FileItem
    location: class DefaultParameterParser
    /srv/gump/public/workspace/turbine-fulcrum/parser/src/java/org/apache/fulcrum/parser/DefaultParameterParser.java:345: error: cannot find symbol
    return (FileItem[])parameters.get(convert(name));
    ^


    [INFO] ------------------------------------------------------------------------
    [INFO] For more information, run Maven with the -e switch
    [INFO] ------------------------------------------------------------------------
    [INFO] Total time: 10 seconds
    [INFO] Finished at: Mon Aug 20 10:07:14 UTC 2012
    [INFO] Final Memory: 18M/43M
    [INFO] ------------------------------------------------------------------------
    ---------------------------------------------

    To subscribe to this information via syndicated feeds:
    - RSS: http://vmgump.apache.org/gump/public/turbine-fulcrum/fulcrum-parser/rss.xml
    - Atom: http://vmgump.apache.org/gump/public/turbine-fulcrum/fulcrum-parser/atom.xml

    ============================== Gump Tracking Only ===
    Produced by Apache Gump(TM) version 2.3.
    Gump Run 06000620082012, vmgump.apache.org:vmgump:06000620082012
    Gump E-mail Identifier (unique within run) #34.

    --
    Apache Gump
    http://gump.apache.org/ [Instance: vmgump]

    ---------------------------------------------------------------------
    To unsubscribe, e-mail: dev-unsubscribe@turbine.apache.org
    For additional commands, e-mail: dev-help@turbine.apache.org
  • Anonymous at Aug 21, 2012 at 10:06 am
    To whom it may engage...

    This is an automated request, but not an unsolicited one. For
    more information please visit http://gump.apache.org/nagged.html,
    and/or contact the folk at general@gump.apache.org.

    Project fulcrum-parser has an issue affecting its community integration.
    This issue affects 1 projects,
    and has been outstanding for 22 runs.
    The current state of this project is 'Failed', with reason 'Build Failed'.
    For reference only, the following projects are affected by this:
    - fulcrum-parser : Services Framework


    Full details are available at:
    http://vmgump.apache.org/gump/public/turbine-fulcrum/fulcrum-parser/index.html

    That said, some information snippets are provided here.

    The following annotations (debug/informational/warning/error messages) were provided:
    -DEBUG- Sole jar output [fulcrum-parser-*[0-9T].jar] identifier set to project name
    -DEBUG- (Apache Gump generated) Apache Maven Settings in: /srv/gump/public/workspace/turbine-fulcrum/parser/gump_mvn_settings.xml
    -INFO- Failed with reason build failed
    -DEBUG- Maven POM in: /srv/gump/public/workspace/turbine-fulcrum/parser/pom.xml
    -INFO- Failed to extract fallback artifacts from Gump Repository



    The following work was performed:
    http://vmgump.apache.org/gump/public/turbine-fulcrum/fulcrum-parser/gump_work/build_turbine-fulcrum_fulcrum-parser.html
    Work Name: build_turbine-fulcrum_fulcrum-parser (Type: Build)
    Work ended in a state of : Failed
    Elapsed: 10 secs
    Command Line: /opt/maven2/bin/mvn --batch-mode --settings /srv/gump/public/workspace/turbine-fulcrum/parser/gump_mvn_settings.xml package
    [Working Directory: /srv/gump/public/workspace/turbine-fulcrum/parser]
    M2_HOME: /opt/maven2
    ---------------------------------------------
    return uploadService.getItemIterator(request);
    ^

    class file for org.apache.commons.fileupload.FileItemIterator not found
    /srv/gump/public/workspace/turbine-fulcrum/parser/src/java/org/apache/fulcrum/parser/DefaultParameterParser.java:[160,21] error: cannot find symbol

    could not parse error message: symbol: class FileItem
    location: class DefaultParameterParser
    /srv/gump/public/workspace/turbine-fulcrum/parser/src/java/org/apache/fulcrum/parser/DefaultParameterParser.java:164: error: cannot find symbol
    for (FileItem fi : fileItems)
    ^

    could not parse error message: symbol: class FileItem
    location: class DefaultParameterParser
    /srv/gump/public/workspace/turbine-fulcrum/parser/src/java/org/apache/fulcrum/parser/DefaultParameterParser.java:304: error: cannot find symbol
    FileItem[] items = this.getFileItems(name);
    ^

    could not parse error message: symbol: class FileItem
    location: class DefaultParameterParser
    /srv/gump/public/workspace/turbine-fulcrum/parser/src/java/org/apache/fulcrum/parser/DefaultParameterParser.java:305: error: cannot find symbol
    items = (FileItem []) ArrayUtils.add(items, value);
    ^

    could not parse error message: symbol: class FileItem
    location: class DefaultParameterParser
    /srv/gump/public/workspace/turbine-fulcrum/parser/src/java/org/apache/fulcrum/parser/DefaultParameterParser.java:321: error: cannot find symbol
    FileItem value = null;
    ^

    could not parse error message: symbol: class FileItem
    location: class DefaultParameterParser
    /srv/gump/public/workspace/turbine-fulcrum/parser/src/java/org/apache/fulcrum/parser/DefaultParameterParser.java:324: error: cannot find symbol
    value = ((FileItem[])object)[0];
    ^

    could not parse error message: symbol: class FileItem
    location: class DefaultParameterParser
    /srv/gump/public/workspace/turbine-fulcrum/parser/src/java/org/apache/fulcrum/parser/DefaultParameterParser.java:345: error: cannot find symbol
    return (FileItem[])parameters.get(convert(name));
    ^


    [INFO] ------------------------------------------------------------------------
    [INFO] For more information, run Maven with the -e switch
    [INFO] ------------------------------------------------------------------------
    [INFO] Total time: 9 seconds
    [INFO] Finished at: Tue Aug 21 10:05:34 UTC 2012
    [INFO] Final Memory: 18M/43M
    [INFO] ------------------------------------------------------------------------
    ---------------------------------------------

    To subscribe to this information via syndicated feeds:
    - RSS: http://vmgump.apache.org/gump/public/turbine-fulcrum/fulcrum-parser/rss.xml
    - Atom: http://vmgump.apache.org/gump/public/turbine-fulcrum/fulcrum-parser/atom.xml

    ============================== Gump Tracking Only ===
    Produced by Apache Gump(TM) version 2.3.
    Gump Run 06000621082012, vmgump.apache.org:vmgump:06000621082012
    Gump E-mail Identifier (unique within run) #32.

    --
    Apache Gump
    http://gump.apache.org/ [Instance: vmgump]

    ---------------------------------------------------------------------
    To unsubscribe, e-mail: dev-unsubscribe@turbine.apache.org
    For additional commands, e-mail: dev-help@turbine.apache.org
  • Anonymous at Aug 22, 2012 at 10:10 am
    To whom it may engage...

    This is an automated request, but not an unsolicited one. For
    more information please visit http://gump.apache.org/nagged.html,
    and/or contact the folk at general@gump.apache.org.

    Project fulcrum-parser has an issue affecting its community integration.
    This issue affects 1 projects,
    and has been outstanding for 24 runs.
    The current state of this project is 'Failed', with reason 'Build Failed'.
    For reference only, the following projects are affected by this:
    - fulcrum-parser : Services Framework


    Full details are available at:
    http://vmgump.apache.org/gump/public/turbine-fulcrum/fulcrum-parser/index.html

    That said, some information snippets are provided here.

    The following annotations (debug/informational/warning/error messages) were provided:
    -DEBUG- Sole jar output [fulcrum-parser-*[0-9T].jar] identifier set to project name
    -DEBUG- (Apache Gump generated) Apache Maven Settings in: /srv/gump/public/workspace/turbine-fulcrum/parser/gump_mvn_settings.xml
    -INFO- Failed with reason build failed
    -DEBUG- Maven POM in: /srv/gump/public/workspace/turbine-fulcrum/parser/pom.xml
    -INFO- Failed to extract fallback artifacts from Gump Repository



    The following work was performed:
    http://vmgump.apache.org/gump/public/turbine-fulcrum/fulcrum-parser/gump_work/build_turbine-fulcrum_fulcrum-parser.html
    Work Name: build_turbine-fulcrum_fulcrum-parser (Type: Build)
    Work ended in a state of : Failed
    Elapsed: 16 secs
    Command Line: /opt/maven2/bin/mvn --batch-mode --settings /srv/gump/public/workspace/turbine-fulcrum/parser/gump_mvn_settings.xml package
    [Working Directory: /srv/gump/public/workspace/turbine-fulcrum/parser]
    M2_HOME: /opt/maven2
    ---------------------------------------------
    [DEBUG] Instantiating the implementation class for parser
    [DEBUG] Incarnating the service parser
    [DEBUG] LogEnabled.enableLogging() for parser
    [DEBUG] Serviceable.service() for parser
    [DEBUG] Located the service 'org.apache.fulcrum.upload.UploadService' in the local container
    [DEBUG] Located the service 'org.apache.fulcrum.pool.PoolService' in the local container
    [DEBUG] Configurable.configure() for parser
    [DEBUG] Setting folding from none
    [DEBUG] YAAFI Avalon Service Container is up and running
    [INFO] YaffiContainer ready.
    [DEBUG] Located the service 'org.apache.fulcrum.parser.ParserService' in the local container
    [DEBUG] Disposing of container...
    [DEBUG] Disposing all services
    [DEBUG] Decommision the service parser
    [DEBUG] Decommisioning the service parser
    [DEBUG] Decommision the service parser
    [DEBUG] Decommisioning the service parser
    [DEBUG] Decommision the service parser
    [DEBUG] Decommisioning the service parser
    [DEBUG] Disposable.dispose() for parser
    [DEBUG] Decommision the service upload
    [DEBUG] Decommisioning the service upload
    [DEBUG] Disposing the service parser
    [DEBUG] Disposing the service parser
    [DEBUG] Disposing the service parser
    [DEBUG] Disposing the service upload
    [DEBUG] All services are disposed
    [INFO] YaffiContainer has been disposed.
    Tests run: 5, Failures: 0, Errors: 1, Skipped: 0, Time elapsed: 0.23 sec <<< FAILURE!

    Results :

    Tests in error:
    testAddPathInfo(org.apache.fulcrum.parser.ParameterParserTest)

    Tests run: 59, Failures: 0, Errors: 1, Skipped: 0

    [INFO] ------------------------------------------------------------------------
    [ERROR] BUILD FAILURE
    [INFO] ------------------------------------------------------------------------
    [INFO] There are test failures.

    Please refer to /srv/gump/public/workspace/turbine-fulcrum/parser/target/surefire-reports for the individual test results.
    [INFO] ------------------------------------------------------------------------
    [INFO] For more information, run Maven with the -e switch
    [INFO] ------------------------------------------------------------------------
    [INFO] Total time: 15 seconds
    [INFO] Finished at: Wed Aug 22 10:09:52 UTC 2012
    [INFO] Final Memory: 24M/57M
    [INFO] ------------------------------------------------------------------------
    ---------------------------------------------

    To subscribe to this information via syndicated feeds:
    - RSS: http://vmgump.apache.org/gump/public/turbine-fulcrum/fulcrum-parser/rss.xml
    - Atom: http://vmgump.apache.org/gump/public/turbine-fulcrum/fulcrum-parser/atom.xml

    ============================== Gump Tracking Only ===
    Produced by Apache Gump(TM) version 2.3.
    Gump Run 06000622082012, vmgump.apache.org:vmgump:06000622082012
    Gump E-mail Identifier (unique within run) #32.

    --
    Apache Gump
    http://gump.apache.org/ [Instance: vmgump]

    ---------------------------------------------------------------------
    To unsubscribe, e-mail: dev-unsubscribe@turbine.apache.org
    For additional commands, e-mail: dev-help@turbine.apache.org
  • Anonymous at Aug 23, 2012 at 4:01 am
    To whom it may engage...

    This is an automated request, but not an unsolicited one. For
    more information please visit http://gump.apache.org/nagged.html,
    and/or contact the folk at general@gump.apache.org.

    Project fulcrum-parser has an issue affecting its community integration.
    This issue affects 1 projects,
    and has been outstanding for 25 runs.
    The current state of this project is 'Failed', with reason 'Build Failed'.
    For reference only, the following projects are affected by this:
    - fulcrum-parser : Services Framework


    Full details are available at:
    http://vmgump.apache.org/gump/public/turbine-fulcrum/fulcrum-parser/index.html

    That said, some information snippets are provided here.

    The following annotations (debug/informational/warning/error messages) were provided:
    -DEBUG- Sole jar output [fulcrum-parser-*[0-9T].jar] identifier set to project name
    -DEBUG- (Apache Gump generated) Apache Maven Settings in: /srv/gump/public/workspace/turbine-fulcrum/parser/gump_mvn_settings.xml
    -INFO- Failed with reason build failed
    -DEBUG- Maven POM in: /srv/gump/public/workspace/turbine-fulcrum/parser/pom.xml
    -INFO- Failed to extract fallback artifacts from Gump Repository



    The following work was performed:
    http://vmgump.apache.org/gump/public/turbine-fulcrum/fulcrum-parser/gump_work/build_turbine-fulcrum_fulcrum-parser.html
    Work Name: build_turbine-fulcrum_fulcrum-parser (Type: Build)
    Work ended in a state of : Failed
    Elapsed: 15 secs
    Command Line: /opt/maven2/bin/mvn --batch-mode --settings /srv/gump/public/workspace/turbine-fulcrum/parser/gump_mvn_settings.xml package
    [Working Directory: /srv/gump/public/workspace/turbine-fulcrum/parser]
    M2_HOME: /opt/maven2
    ---------------------------------------------
    [DEBUG] Instantiating the implementation class for parser
    [DEBUG] Incarnating the service parser
    [DEBUG] LogEnabled.enableLogging() for parser
    [DEBUG] Serviceable.service() for parser
    [DEBUG] Located the service 'org.apache.fulcrum.upload.UploadService' in the local container
    [DEBUG] Located the service 'org.apache.fulcrum.pool.PoolService' in the local container
    [DEBUG] Configurable.configure() for parser
    [DEBUG] Setting folding from none
    [DEBUG] YAAFI Avalon Service Container is up and running
    [INFO] YaffiContainer ready.
    [DEBUG] Located the service 'org.apache.fulcrum.parser.ParserService' in the local container
    [DEBUG] Disposing of container...
    [DEBUG] Disposing all services
    [DEBUG] Decommision the service parser
    [DEBUG] Decommisioning the service parser
    [DEBUG] Decommision the service parser
    [DEBUG] Decommisioning the service parser
    [DEBUG] Decommision the service parser
    [DEBUG] Decommisioning the service parser
    [DEBUG] Disposable.dispose() for parser
    [DEBUG] Decommision the service upload
    [DEBUG] Decommisioning the service upload
    [DEBUG] Disposing the service parser
    [DEBUG] Disposing the service parser
    [DEBUG] Disposing the service parser
    [DEBUG] Disposing the service upload
    [DEBUG] All services are disposed
    [INFO] YaffiContainer has been disposed.
    Tests run: 5, Failures: 0, Errors: 1, Skipped: 0, Time elapsed: 0.223 sec <<< FAILURE!

    Results :

    Tests in error:
    testAddPathInfo(org.apache.fulcrum.parser.ParameterParserTest)

    Tests run: 59, Failures: 0, Errors: 1, Skipped: 0

    [INFO] ------------------------------------------------------------------------
    [ERROR] BUILD FAILURE
    [INFO] ------------------------------------------------------------------------
    [INFO] There are test failures.

    Please refer to /srv/gump/public/workspace/turbine-fulcrum/parser/target/surefire-reports for the individual test results.
    [INFO] ------------------------------------------------------------------------
    [INFO] For more information, run Maven with the -e switch
    [INFO] ------------------------------------------------------------------------
    [INFO] Total time: 14 seconds
    [INFO] Finished at: Thu Aug 23 04:00:56 UTC 2012
    [INFO] Final Memory: 24M/57M
    [INFO] ------------------------------------------------------------------------
    ---------------------------------------------

    To subscribe to this information via syndicated feeds:
    - RSS: http://vmgump.apache.org/gump/public/turbine-fulcrum/fulcrum-parser/rss.xml
    - Atom: http://vmgump.apache.org/gump/public/turbine-fulcrum/fulcrum-parser/atom.xml

    ============================== Gump Tracking Only ===
    Produced by Apache Gump(TM) version 2.3.
    Gump Run 09000023082012, vmgump.apache.org:vmgump:09000023082012
    Gump E-mail Identifier (unique within run) #32.

    --
    Apache Gump
    http://gump.apache.org/ [Instance: vmgump]

    ---------------------------------------------------------------------
    To unsubscribe, e-mail: dev-unsubscribe@turbine.apache.org
    For additional commands, e-mail: dev-help@turbine.apache.org
  • Thomas Vandahl at Aug 26, 2012 at 7:02 pm
    Hi General Gump,
    On 23.08.12 04:00, fulcrum-parser development wrote:
    Tests run: 5, Failures: 0, Errors: 1, Skipped: 0, Time elapsed: 0.223 sec <<< FAILURE!

    Results :

    Tests in error:
    testAddPathInfo(org.apache.fulcrum.parser.ParameterParserTest)

    Tests run: 59, Failures: 0, Errors: 1, Skipped: 0
    Any chance to get access to the target directory of the build? No idea
    why the test fails.

    Bye, Thomas.



    ---------------------------------------------------------------------
    To unsubscribe, e-mail: dev-unsubscribe@turbine.apache.org
    For additional commands, e-mail: dev-help@turbine.apache.org
  • Ludwig Magnusson at Aug 27, 2012 at 11:20 am
    Hello.
    I found a ClassNotFoundException for class
    org.apache.commons.io.output.DeferredFileOutputStream. It was located in
    commons-io so I added it as a runtime dependency.
    The tests pass now.
    /Ludwig

    -----Ursprungligt meddelande-----
    From: Thomas Vandahl
    Sent: Sunday, August 26, 2012 9:01 PM
    To: Gump code and data
    Cc: Turbine Developers List
    Subject: Re: [GUMP@vmgump]: Project fulcrum-parser (in module
    turbine-fulcrum) failed

    Hi General Gump,
    On 23.08.12 04:00, fulcrum-parser development wrote:
    Tests run: 5, Failures: 0, Errors: 1, Skipped: 0, Time elapsed: 0.223 sec
    <<< FAILURE!

    Results :

    Tests in error:
    testAddPathInfo(org.apache.fulcrum.parser.ParameterParserTest)

    Tests run: 59, Failures: 0, Errors: 1, Skipped: 0
    Any chance to get access to the target directory of the build? No idea
    why the test fails.

    Bye, Thomas.



    ---------------------------------------------------------------------
    To unsubscribe, e-mail: dev-unsubscribe@turbine.apache.org
    For additional commands, e-mail: dev-help@turbine.apache.org


    ---------------------------------------------------------------------
    To unsubscribe, e-mail: dev-unsubscribe@turbine.apache.org
    For additional commands, e-mail: dev-help@turbine.apache.org
  • Georg Kallidis at Sep 27, 2012 at 10:52 am
    Hello Turbine developers,

    as I recently was asked by Thomas Vandahl to become a committer to the
    Turbine project I accepted.

    The case for me is, that I´m developing a OS project (ODC
    http://opendc.distributed-campus.org/), which is still based on Jetspeed
    1.6, http://portals.apache.org/jetspeed-1/). Jetspeed 1.6 is for many
    parts just a thin layer on the turbine-framework and I was able to
    upgrade with the help of some hints on the turbine website from turbine
    version 2.2 to 2.3.3 and even to turbine-4 (patched 4.0-M2-SNAPSHOT).
    The last step resulted in some issues, which are desccribed here:
    https://issues.apache.org/jira/browse/TRB-85. The reason is: Jetspeed
    1.6 depends on the caching mechanism of Turbine Rundata, that is the
    deprecated methods org.apache.turbine.util.RunData.getOut() et al. So, I
    would favour keeping this backward-compatible.

    - I would support releasing the fulcrum-parser component (1.3-SNAPSHOT),
    cft. https://issues.apache.org/jira/browse/TRB-91.

    Suggestion for future development: I find myself using more and more the
    JSON data channel (btw. com.metaparadigm became org.jabsorb with new
    host http://code.google.com/p/jabsorb/). To think about less data
    exposure, filtering methods seems to be good idea, which is supported by
    e.g. Jackson http://wiki.fasterxml.com/JacksonFeatureJsonFilter.

    FYI: I´ll attend this years ApacheCon Europe.

    Best regards, Georg






    ---------------------------------------------------------------------
    To unsubscribe, e-mail: dev-unsubscribe@turbine.apache.org
    For additional commands, e-mail: dev-help@turbine.apache.org
  • Anonymous at Aug 24, 2012 at 4:05 am
    To whom it may engage...

    This is an automated request, but not an unsolicited one. For
    more information please visit http://gump.apache.org/nagged.html,
    and/or contact the folk at general@gump.apache.org.

    Project fulcrum-parser has an issue affecting its community integration.
    This issue affects 1 projects,
    and has been outstanding for 27 runs.
    The current state of this project is 'Failed', with reason 'Build Failed'.
    For reference only, the following projects are affected by this:
    - fulcrum-parser : Services Framework


    Full details are available at:
    http://vmgump.apache.org/gump/public/turbine-fulcrum/fulcrum-parser/index.html

    That said, some information snippets are provided here.

    The following annotations (debug/informational/warning/error messages) were provided:
    -DEBUG- Sole jar output [fulcrum-parser-*[0-9T].jar] identifier set to project name
    -DEBUG- (Apache Gump generated) Apache Maven Settings in: /srv/gump/public/workspace/turbine-fulcrum/parser/gump_mvn_settings.xml
    -INFO- Failed with reason build failed
    -DEBUG- Maven POM in: /srv/gump/public/workspace/turbine-fulcrum/parser/pom.xml
    -INFO- Failed to extract fallback artifacts from Gump Repository



    The following work was performed:
    http://vmgump.apache.org/gump/public/turbine-fulcrum/fulcrum-parser/gump_work/build_turbine-fulcrum_fulcrum-parser.html
    Work Name: build_turbine-fulcrum_fulcrum-parser (Type: Build)
    Work ended in a state of : Failed
    Elapsed: 15 secs
    Command Line: /opt/maven2/bin/mvn --batch-mode --settings /srv/gump/public/workspace/turbine-fulcrum/parser/gump_mvn_settings.xml package
    [Working Directory: /srv/gump/public/workspace/turbine-fulcrum/parser]
    M2_HOME: /opt/maven2
    ---------------------------------------------
    [DEBUG] Instantiating the implementation class for parser
    [DEBUG] Incarnating the service parser
    [DEBUG] LogEnabled.enableLogging() for parser
    [DEBUG] Serviceable.service() for parser
    [DEBUG] Located the service 'org.apache.fulcrum.upload.UploadService' in the local container
    [DEBUG] Located the service 'org.apache.fulcrum.pool.PoolService' in the local container
    [DEBUG] Configurable.configure() for parser
    [DEBUG] Setting folding from none
    [DEBUG] YAAFI Avalon Service Container is up and running
    [INFO] YaffiContainer ready.
    [DEBUG] Located the service 'org.apache.fulcrum.parser.ParserService' in the local container
    [DEBUG] Disposing of container...
    [DEBUG] Disposing all services
    [DEBUG] Decommision the service parser
    [DEBUG] Decommisioning the service parser
    [DEBUG] Decommision the service parser
    [DEBUG] Decommisioning the service parser
    [DEBUG] Decommision the service parser
    [DEBUG] Decommisioning the service parser
    [DEBUG] Disposable.dispose() for parser
    [DEBUG] Decommision the service upload
    [DEBUG] Decommisioning the service upload
    [DEBUG] Disposing the service parser
    [DEBUG] Disposing the service parser
    [DEBUG] Disposing the service parser
    [DEBUG] Disposing the service upload
    [DEBUG] All services are disposed
    [INFO] YaffiContainer has been disposed.
    Tests run: 5, Failures: 0, Errors: 1, Skipped: 0, Time elapsed: 0.258 sec <<< FAILURE!

    Results :

    Tests in error:
    testAddPathInfo(org.apache.fulcrum.parser.ParameterParserTest)

    Tests run: 59, Failures: 0, Errors: 1, Skipped: 0

    [INFO] ------------------------------------------------------------------------
    [ERROR] BUILD FAILURE
    [INFO] ------------------------------------------------------------------------
    [INFO] There are test failures.

    Please refer to /srv/gump/public/workspace/turbine-fulcrum/parser/target/surefire-reports for the individual test results.
    [INFO] ------------------------------------------------------------------------
    [INFO] For more information, run Maven with the -e switch
    [INFO] ------------------------------------------------------------------------
    [INFO] Total time: 14 seconds
    [INFO] Finished at: Fri Aug 24 04:05:11 UTC 2012
    [INFO] Final Memory: 24M/57M
    [INFO] ------------------------------------------------------------------------
    ---------------------------------------------

    To subscribe to this information via syndicated feeds:
    - RSS: http://vmgump.apache.org/gump/public/turbine-fulcrum/fulcrum-parser/rss.xml
    - Atom: http://vmgump.apache.org/gump/public/turbine-fulcrum/fulcrum-parser/atom.xml

    ============================== Gump Tracking Only ===
    Produced by Apache Gump(TM) version 2.3.
    Gump Run 10000024082012, vmgump.apache.org:vmgump:10000024082012
    Gump E-mail Identifier (unique within run) #32.

    --
    Apache Gump
    http://gump.apache.org/ [Instance: vmgump]

    ---------------------------------------------------------------------
    To unsubscribe, e-mail: dev-unsubscribe@turbine.apache.org
    For additional commands, e-mail: dev-help@turbine.apache.org
  • Anonymous at Aug 25, 2012 at 4:05 am
    To whom it may engage...

    This is an automated request, but not an unsolicited one. For
    more information please visit http://gump.apache.org/nagged.html,
    and/or contact the folk at general@gump.apache.org.

    Project fulcrum-parser has an issue affecting its community integration.
    This issue affects 1 projects,
    and has been outstanding for 29 runs.
    The current state of this project is 'Failed', with reason 'Build Failed'.
    For reference only, the following projects are affected by this:
    - fulcrum-parser : Services Framework


    Full details are available at:
    http://vmgump.apache.org/gump/public/turbine-fulcrum/fulcrum-parser/index.html

    That said, some information snippets are provided here.

    The following annotations (debug/informational/warning/error messages) were provided:
    -DEBUG- Sole jar output [fulcrum-parser-*[0-9T].jar] identifier set to project name
    -DEBUG- (Apache Gump generated) Apache Maven Settings in: /srv/gump/public/workspace/turbine-fulcrum/parser/gump_mvn_settings.xml
    -INFO- Failed with reason build failed
    -DEBUG- Maven POM in: /srv/gump/public/workspace/turbine-fulcrum/parser/pom.xml
    -INFO- Failed to extract fallback artifacts from Gump Repository



    The following work was performed:
    http://vmgump.apache.org/gump/public/turbine-fulcrum/fulcrum-parser/gump_work/build_turbine-fulcrum_fulcrum-parser.html
    Work Name: build_turbine-fulcrum_fulcrum-parser (Type: Build)
    Work ended in a state of : Failed
    Elapsed: 15 secs
    Command Line: /opt/maven2/bin/mvn --batch-mode --settings /srv/gump/public/workspace/turbine-fulcrum/parser/gump_mvn_settings.xml package
    [Working Directory: /srv/gump/public/workspace/turbine-fulcrum/parser]
    M2_HOME: /opt/maven2
    ---------------------------------------------
    [DEBUG] Instantiating the implementation class for parser
    [DEBUG] Incarnating the service parser
    [DEBUG] LogEnabled.enableLogging() for parser
    [DEBUG] Serviceable.service() for parser
    [DEBUG] Located the service 'org.apache.fulcrum.upload.UploadService' in the local container
    [DEBUG] Located the service 'org.apache.fulcrum.pool.PoolService' in the local container
    [DEBUG] Configurable.configure() for parser
    [DEBUG] Setting folding from none
    [DEBUG] YAAFI Avalon Service Container is up and running
    [INFO] YaffiContainer ready.
    [DEBUG] Located the service 'org.apache.fulcrum.parser.ParserService' in the local container
    [DEBUG] Disposing of container...
    [DEBUG] Disposing all services
    [DEBUG] Decommision the service parser
    [DEBUG] Decommisioning the service parser
    [DEBUG] Decommision the service parser
    [DEBUG] Decommisioning the service parser
    [DEBUG] Decommision the service parser
    [DEBUG] Decommisioning the service parser
    [DEBUG] Disposable.dispose() for parser
    [DEBUG] Decommision the service upload
    [DEBUG] Decommisioning the service upload
    [DEBUG] Disposing the service parser
    [DEBUG] Disposing the service parser
    [DEBUG] Disposing the service parser
    [DEBUG] Disposing the service upload
    [DEBUG] All services are disposed
    [INFO] YaffiContainer has been disposed.
    Tests run: 5, Failures: 0, Errors: 1, Skipped: 0, Time elapsed: 0.248 sec <<< FAILURE!

    Results :

    Tests in error:
    testAddPathInfo(org.apache.fulcrum.parser.ParameterParserTest)

    Tests run: 59, Failures: 0, Errors: 1, Skipped: 0

    [INFO] ------------------------------------------------------------------------
    [ERROR] BUILD FAILURE
    [INFO] ------------------------------------------------------------------------
    [INFO] There are test failures.

    Please refer to /srv/gump/public/workspace/turbine-fulcrum/parser/target/surefire-reports for the individual test results.
    [INFO] ------------------------------------------------------------------------
    [INFO] For more information, run Maven with the -e switch
    [INFO] ------------------------------------------------------------------------
    [INFO] Total time: 14 seconds
    [INFO] Finished at: Sat Aug 25 04:05:21 UTC 2012
    [INFO] Final Memory: 23M/57M
    [INFO] ------------------------------------------------------------------------
    ---------------------------------------------

    To subscribe to this information via syndicated feeds:
    - RSS: http://vmgump.apache.org/gump/public/turbine-fulcrum/fulcrum-parser/rss.xml
    - Atom: http://vmgump.apache.org/gump/public/turbine-fulcrum/fulcrum-parser/atom.xml

    ============================== Gump Tracking Only ===
    Produced by Apache Gump(TM) version 2.3.
    Gump Run 12000025082012, vmgump.apache.org:vmgump:12000025082012
    Gump E-mail Identifier (unique within run) #32.

    --
    Apache Gump
    http://gump.apache.org/ [Instance: vmgump]

    ---------------------------------------------------------------------
    To unsubscribe, e-mail: dev-unsubscribe@turbine.apache.org
    For additional commands, e-mail: dev-help@turbine.apache.org
  • Anonymous at Aug 26, 2012 at 4:04 am
    To whom it may engage...

    This is an automated request, but not an unsolicited one. For
    more information please visit http://gump.apache.org/nagged.html,
    and/or contact the folk at general@gump.apache.org.

    Project fulcrum-parser has an issue affecting its community integration.
    This issue affects 1 projects,
    and has been outstanding for 31 runs.
    The current state of this project is 'Failed', with reason 'Build Failed'.
    For reference only, the following projects are affected by this:
    - fulcrum-parser : Services Framework


    Full details are available at:
    http://vmgump.apache.org/gump/public/turbine-fulcrum/fulcrum-parser/index.html

    That said, some information snippets are provided here.

    The following annotations (debug/informational/warning/error messages) were provided:
    -DEBUG- Sole jar output [fulcrum-parser-*[0-9T].jar] identifier set to project name
    -DEBUG- (Apache Gump generated) Apache Maven Settings in: /srv/gump/public/workspace/turbine-fulcrum/parser/gump_mvn_settings.xml
    -INFO- Failed with reason build failed
    -DEBUG- Maven POM in: /srv/gump/public/workspace/turbine-fulcrum/parser/pom.xml
    -INFO- Failed to extract fallback artifacts from Gump Repository



    The following work was performed:
    http://vmgump.apache.org/gump/public/turbine-fulcrum/fulcrum-parser/gump_work/build_turbine-fulcrum_fulcrum-parser.html
    Work Name: build_turbine-fulcrum_fulcrum-parser (Type: Build)
    Work ended in a state of : Failed
    Elapsed: 15 secs
    Command Line: /opt/maven2/bin/mvn --batch-mode --settings /srv/gump/public/workspace/turbine-fulcrum/parser/gump_mvn_settings.xml package
    [Working Directory: /srv/gump/public/workspace/turbine-fulcrum/parser]
    M2_HOME: /opt/maven2
    ---------------------------------------------
    [DEBUG] Instantiating the implementation class for parser
    [DEBUG] Incarnating the service parser
    [DEBUG] LogEnabled.enableLogging() for parser
    [DEBUG] Serviceable.service() for parser
    [DEBUG] Located the service 'org.apache.fulcrum.upload.UploadService' in the local container
    [DEBUG] Located the service 'org.apache.fulcrum.pool.PoolService' in the local container
    [DEBUG] Configurable.configure() for parser
    [DEBUG] Setting folding from none
    [DEBUG] YAAFI Avalon Service Container is up and running
    [INFO] YaffiContainer ready.
    [DEBUG] Located the service 'org.apache.fulcrum.parser.ParserService' in the local container
    [DEBUG] Disposing of container...
    [DEBUG] Disposing all services
    [DEBUG] Decommision the service parser
    [DEBUG] Decommisioning the service parser
    [DEBUG] Decommision the service parser
    [DEBUG] Decommisioning the service parser
    [DEBUG] Decommision the service parser
    [DEBUG] Decommisioning the service parser
    [DEBUG] Disposable.dispose() for parser
    [DEBUG] Decommision the service upload
    [DEBUG] Decommisioning the service upload
    [DEBUG] Disposing the service parser
    [DEBUG] Disposing the service parser
    [DEBUG] Disposing the service parser
    [DEBUG] Disposing the service upload
    [DEBUG] All services are disposed
    [INFO] YaffiContainer has been disposed.
    Tests run: 5, Failures: 0, Errors: 1, Skipped: 0, Time elapsed: 0.223 sec <<< FAILURE!

    Results :

    Tests in error:
    testAddPathInfo(org.apache.fulcrum.parser.ParameterParserTest)

    Tests run: 59, Failures: 0, Errors: 1, Skipped: 0

    [INFO] ------------------------------------------------------------------------
    [ERROR] BUILD FAILURE
    [INFO] ------------------------------------------------------------------------
    [INFO] There are test failures.

    Please refer to /srv/gump/public/workspace/turbine-fulcrum/parser/target/surefire-reports for the individual test results.
    [INFO] ------------------------------------------------------------------------
    [INFO] For more information, run Maven with the -e switch
    [INFO] ------------------------------------------------------------------------
    [INFO] Total time: 14 seconds
    [INFO] Finished at: Sun Aug 26 04:03:28 UTC 2012
    [INFO] Final Memory: 24M/57M
    [INFO] ------------------------------------------------------------------------
    ---------------------------------------------

    To subscribe to this information via syndicated feeds:
    - RSS: http://vmgump.apache.org/gump/public/turbine-fulcrum/fulcrum-parser/rss.xml
    - Atom: http://vmgump.apache.org/gump/public/turbine-fulcrum/fulcrum-parser/atom.xml

    ============================== Gump Tracking Only ===
    Produced by Apache Gump(TM) version 2.3.
    Gump Run 10000026082012, vmgump.apache.org:vmgump:10000026082012
    Gump E-mail Identifier (unique within run) #32.

    --
    Apache Gump
    http://gump.apache.org/ [Instance: vmgump]

    ---------------------------------------------------------------------
    To unsubscribe, e-mail: dev-unsubscribe@turbine.apache.org
    For additional commands, e-mail: dev-help@turbine.apache.org
  • Anonymous at Aug 27, 2012 at 4:05 am
    To whom it may engage...

    This is an automated request, but not an unsolicited one. For
    more information please visit http://gump.apache.org/nagged.html,
    and/or contact the folk at general@gump.apache.org.

    Project fulcrum-parser has an issue affecting its community integration.
    This issue affects 1 projects,
    and has been outstanding for 33 runs.
    The current state of this project is 'Failed', with reason 'Build Failed'.
    For reference only, the following projects are affected by this:
    - fulcrum-parser : Services Framework


    Full details are available at:
    http://vmgump.apache.org/gump/public/turbine-fulcrum/fulcrum-parser/index.html

    That said, some information snippets are provided here.

    The following annotations (debug/informational/warning/error messages) were provided:
    -DEBUG- Sole jar output [fulcrum-parser-*[0-9T].jar] identifier set to project name
    -DEBUG- (Apache Gump generated) Apache Maven Settings in: /srv/gump/public/workspace/turbine-fulcrum/parser/gump_mvn_settings.xml
    -INFO- Failed with reason build failed
    -DEBUG- Maven POM in: /srv/gump/public/workspace/turbine-fulcrum/parser/pom.xml
    -INFO- Failed to extract fallback artifacts from Gump Repository



    The following work was performed:
    http://vmgump.apache.org/gump/public/turbine-fulcrum/fulcrum-parser/gump_work/build_turbine-fulcrum_fulcrum-parser.html
    Work Name: build_turbine-fulcrum_fulcrum-parser (Type: Build)
    Work ended in a state of : Failed
    Elapsed: 15 secs
    Command Line: /opt/maven2/bin/mvn --batch-mode --settings /srv/gump/public/workspace/turbine-fulcrum/parser/gump_mvn_settings.xml package
    [Working Directory: /srv/gump/public/workspace/turbine-fulcrum/parser]
    M2_HOME: /opt/maven2
    ---------------------------------------------
    [DEBUG] Instantiating the implementation class for parser
    [DEBUG] Incarnating the service parser
    [DEBUG] LogEnabled.enableLogging() for parser
    [DEBUG] Serviceable.service() for parser
    [DEBUG] Located the service 'org.apache.fulcrum.upload.UploadService' in the local container
    [DEBUG] Located the service 'org.apache.fulcrum.pool.PoolService' in the local container
    [DEBUG] Configurable.configure() for parser
    [DEBUG] Setting folding from none
    [DEBUG] YAAFI Avalon Service Container is up and running
    [INFO] YaffiContainer ready.
    [DEBUG] Located the service 'org.apache.fulcrum.parser.ParserService' in the local container
    [DEBUG] Disposing of container...
    [DEBUG] Disposing all services
    [DEBUG] Decommision the service parser
    [DEBUG] Decommisioning the service parser
    [DEBUG] Decommision the service parser
    [DEBUG] Decommisioning the service parser
    [DEBUG] Decommision the service parser
    [DEBUG] Decommisioning the service parser
    [DEBUG] Disposable.dispose() for parser
    [DEBUG] Decommision the service upload
    [DEBUG] Decommisioning the service upload
    [DEBUG] Disposing the service parser
    [DEBUG] Disposing the service parser
    [DEBUG] Disposing the service parser
    [DEBUG] Disposing the service upload
    [DEBUG] All services are disposed
    [INFO] YaffiContainer has been disposed.
    Tests run: 5, Failures: 0, Errors: 1, Skipped: 0, Time elapsed: 0.222 sec <<< FAILURE!

    Results :

    Tests in error:
    testAddPathInfo(org.apache.fulcrum.parser.ParameterParserTest)

    Tests run: 59, Failures: 0, Errors: 1, Skipped: 0

    [INFO] ------------------------------------------------------------------------
    [ERROR] BUILD FAILURE
    [INFO] ------------------------------------------------------------------------
    [INFO] There are test failures.

    Please refer to /srv/gump/public/workspace/turbine-fulcrum/parser/target/surefire-reports for the individual test results.
    [INFO] ------------------------------------------------------------------------
    [INFO] For more information, run Maven with the -e switch
    [INFO] ------------------------------------------------------------------------
    [INFO] Total time: 14 seconds
    [INFO] Finished at: Mon Aug 27 04:04:32 UTC 2012
    [INFO] Final Memory: 24M/57M
    [INFO] ------------------------------------------------------------------------
    ---------------------------------------------

    To subscribe to this information via syndicated feeds:
    - RSS: http://vmgump.apache.org/gump/public/turbine-fulcrum/fulcrum-parser/rss.xml
    - Atom: http://vmgump.apache.org/gump/public/turbine-fulcrum/fulcrum-parser/atom.xml

    ============================== Gump Tracking Only ===
    Produced by Apache Gump(TM) version 2.3.
    Gump Run 12000027082012, vmgump.apache.org:vmgump:12000027082012
    Gump E-mail Identifier (unique within run) #32.

    --
    Apache Gump
    http://gump.apache.org/ [Instance: vmgump]

    ---------------------------------------------------------------------
    To unsubscribe, e-mail: dev-unsubscribe@turbine.apache.org
    For additional commands, e-mail: dev-help@turbine.apache.org

Related Discussions

Discussion Navigation
viewthread | post
Discussion Overview
groupdev @
categoriesturbine
postedAug 10, '12 at 8:45a
activeSep 27, '12 at 10:52a
posts22
users4
websiteturbine.apache.org

People

Translate

site design / logo © 2018 Grokbase