FAQ
To whom it may engage...

This is an automated request, but not an unsolicited one. For
more information please visit http://gump.apache.org/nagged.html,
and/or contact the folk at general@gump.apache.org.

Project fulcrum-security-memory has an issue affecting its community integration.
This issue affects 2 projects.
The current state of this project is 'Failed', with reason 'Build Failed'.
For reference only, the following projects are affected by this:
- fulcrum-security-memory : Services Framework
- fulcrum_fulcrum-security-memory : Services Framework


Full details are available at:
http://vmgump.apache.org/gump/public/turbine-fulcrum/fulcrum-security-memory/index.html

That said, some information snippets are provided here.

The following annotations (debug/informational/warning/error messages) were provided:
-DEBUG- Sole jar output [fulcrum-security-memory-*[0-9T].jar] identifier set to project name
-INFO- Optional dependency fulcrum-security-api failed with reason build failed
-DEBUG- (Apache Gump generated) Apache Maven Settings in: /srv/gump/public/workspace/turbine-fulcrum/security/memory/gump_mvn_settings.xml
-INFO- Failed with reason build failed
-DEBUG- Maven POM in: /srv/gump/public/workspace/turbine-fulcrum/security/memory/pom.xml
-INFO- Failed to extract fallback artifacts from Gump Repository



The following work was performed:
http://vmgump.apache.org/gump/public/turbine-fulcrum/fulcrum-security-memory/gump_work/build_turbine-fulcrum_fulcrum-security-memory.html
Work Name: build_turbine-fulcrum_fulcrum-security-memory (Type: Build)
Work ended in a state of : Failed
Elapsed: 4 secs
Command Line: /opt/maven2/bin/mvn --batch-mode --settings /srv/gump/public/workspace/turbine-fulcrum/security/memory/gump_mvn_settings.xml package
[Working Directory: /srv/gump/public/workspace/turbine-fulcrum/security/memory]
M2_HOME: /opt/maven2
---------------------------------------------

Missing:
----------
1) org.apache.fulcrum:fulcrum-security-api:jar:1.1.0-SNAPSHOT

Try downloading the file manually from the project website.

Then, install it using the command:
mvn install:install-file -DgroupId=org.apache.fulcrum -DartifactId=fulcrum-security-api -Dversion=1.1.0-SNAPSHOT -Dpackaging=jar -Dfile=/path/to/file

Alternatively, if you host your own repository you can deploy the file there:
mvn deploy:deploy-file -DgroupId=org.apache.fulcrum -DartifactId=fulcrum-security-api -Dversion=1.1.0-SNAPSHOT -Dpackaging=jar -Dfile=/path/to/file -Durl=[url] -DrepositoryId=[id]

Path to dependency:
1) org.apache.fulcrum:fulcrum-security-memory:jar:1.1.0-SNAPSHOT
2) org.apache.fulcrum:fulcrum-security-api:jar:1.1.0-SNAPSHOT

2) org.apache.fulcrum:fulcrum-security-api:test-jar:tests:1.1.0-SNAPSHOT

Try downloading the file manually from the project website.

Then, install it using the command:
mvn install:install-file -DgroupId=org.apache.fulcrum -DartifactId=fulcrum-security-api -Dversion=1.1.0-SNAPSHOT -Dclassifier=tests -Dpackaging=test-jar -Dfile=/path/to/file

Alternatively, if you host your own repository you can deploy the file there:
mvn deploy:deploy-file -DgroupId=org.apache.fulcrum -DartifactId=fulcrum-security-api -Dversion=1.1.0-SNAPSHOT -Dclassifier=tests -Dpackaging=test-jar -Dfile=/path/to/file -Durl=[url] -DrepositoryId=[id]

Path to dependency:
1) org.apache.fulcrum:fulcrum-security-memory:jar:1.1.0-SNAPSHOT
2) org.apache.fulcrum:fulcrum-security-api:test-jar:tests:1.1.0-SNAPSHOT

----------
2 required artifacts are missing.

for artifact:
org.apache.fulcrum:fulcrum-security-memory:jar:1.1.0-SNAPSHOT

from the specified remote repositories:
gump-central (http://localhost:8192/maven2),
gump-apache.snapshots (http://localhost:8192/repo/m2-snapshot-repository)



[INFO] ------------------------------------------------------------------------
[INFO] For more information, run Maven with the -e switch
[INFO] ------------------------------------------------------------------------
[INFO] Total time: 3 seconds
[INFO] Finished at: Thu Aug 09 08:19:07 UTC 2012
[INFO] Final Memory: 10M/24M
[INFO] ------------------------------------------------------------------------
---------------------------------------------

To subscribe to this information via syndicated feeds:
- RSS: http://vmgump.apache.org/gump/public/turbine-fulcrum/fulcrum-security-memory/rss.xml
- Atom: http://vmgump.apache.org/gump/public/turbine-fulcrum/fulcrum-security-memory/atom.xml

============================== Gump Tracking Only ===
Produced by Apache Gump(TM) version 2.3.
Gump Run 07000609082012, vmgump.apache.org:vmgump:07000609082012
Gump E-mail Identifier (unique within run) #20.

--
Apache Gump
http://gump.apache.org/ [Instance: vmgump]

---------------------------------------------------------------------
To unsubscribe, e-mail: dev-unsubscribe@turbine.apache.org
For additional commands, e-mail: dev-help@turbine.apache.org

Search Discussions

  • Anonymous at Aug 10, 2012 at 8:02 am
    To whom it may engage...

    This is an automated request, but not an unsolicited one. For
    more information please visit http://gump.apache.org/nagged.html,
    and/or contact the folk at general@gump.apache.org.

    Project fulcrum-security-memory has an issue affecting its community integration.
    This issue affects 2 projects,
    and has been outstanding for 3 runs.
    The current state of this project is 'Failed', with reason 'Build Failed'.
    For reference only, the following projects are affected by this:
    - fulcrum-security-memory : Services Framework
    - fulcrum_fulcrum-security-memory : Services Framework


    Full details are available at:
    http://vmgump.apache.org/gump/public/turbine-fulcrum/fulcrum-security-memory/index.html

    That said, some information snippets are provided here.

    The following annotations (debug/informational/warning/error messages) were provided:
    -DEBUG- Sole jar output [fulcrum-security-memory-*[0-9T].jar] identifier set to project name
    -INFO- Optional dependency fulcrum-security-api failed with reason build failed
    -DEBUG- (Apache Gump generated) Apache Maven Settings in: /srv/gump/public/workspace/turbine-fulcrum/security/memory/gump_mvn_settings.xml
    -INFO- Failed with reason build failed
    -DEBUG- Maven POM in: /srv/gump/public/workspace/turbine-fulcrum/security/memory/pom.xml
    -INFO- Failed to extract fallback artifacts from Gump Repository



    The following work was performed:
    http://vmgump.apache.org/gump/public/turbine-fulcrum/fulcrum-security-memory/gump_work/build_turbine-fulcrum_fulcrum-security-memory.html
    Work Name: build_turbine-fulcrum_fulcrum-security-memory (Type: Build)
    Work ended in a state of : Failed
    Elapsed: 4 secs
    Command Line: /opt/maven2/bin/mvn --batch-mode --settings /srv/gump/public/workspace/turbine-fulcrum/security/memory/gump_mvn_settings.xml package
    [Working Directory: /srv/gump/public/workspace/turbine-fulcrum/security/memory]
    M2_HOME: /opt/maven2
    ---------------------------------------------

    Missing:
    ----------
    1) org.apache.fulcrum:fulcrum-security-api:jar:1.1.0-SNAPSHOT

    Try downloading the file manually from the project website.

    Then, install it using the command:
    mvn install:install-file -DgroupId=org.apache.fulcrum -DartifactId=fulcrum-security-api -Dversion=1.1.0-SNAPSHOT -Dpackaging=jar -Dfile=/path/to/file

    Alternatively, if you host your own repository you can deploy the file there:
    mvn deploy:deploy-file -DgroupId=org.apache.fulcrum -DartifactId=fulcrum-security-api -Dversion=1.1.0-SNAPSHOT -Dpackaging=jar -Dfile=/path/to/file -Durl=[url] -DrepositoryId=[id]

    Path to dependency:
    1) org.apache.fulcrum:fulcrum-security-memory:jar:1.1.0-SNAPSHOT
    2) org.apache.fulcrum:fulcrum-security-api:jar:1.1.0-SNAPSHOT

    2) org.apache.fulcrum:fulcrum-security-api:test-jar:tests:1.1.0-SNAPSHOT

    Try downloading the file manually from the project website.

    Then, install it using the command:
    mvn install:install-file -DgroupId=org.apache.fulcrum -DartifactId=fulcrum-security-api -Dversion=1.1.0-SNAPSHOT -Dclassifier=tests -Dpackaging=test-jar -Dfile=/path/to/file

    Alternatively, if you host your own repository you can deploy the file there:
    mvn deploy:deploy-file -DgroupId=org.apache.fulcrum -DartifactId=fulcrum-security-api -Dversion=1.1.0-SNAPSHOT -Dclassifier=tests -Dpackaging=test-jar -Dfile=/path/to/file -Durl=[url] -DrepositoryId=[id]

    Path to dependency:
    1) org.apache.fulcrum:fulcrum-security-memory:jar:1.1.0-SNAPSHOT
    2) org.apache.fulcrum:fulcrum-security-api:test-jar:tests:1.1.0-SNAPSHOT

    ----------
    2 required artifacts are missing.

    for artifact:
    org.apache.fulcrum:fulcrum-security-memory:jar:1.1.0-SNAPSHOT

    from the specified remote repositories:
    gump-central (http://localhost:8192/maven2),
    gump-apache.snapshots (http://localhost:8192/repo/m2-snapshot-repository)



    [INFO] ------------------------------------------------------------------------
    [INFO] For more information, run Maven with the -e switch
    [INFO] ------------------------------------------------------------------------
    [INFO] Total time: 3 seconds
    [INFO] Finished at: Fri Aug 10 08:02:21 UTC 2012
    [INFO] Final Memory: 10M/25M
    [INFO] ------------------------------------------------------------------------
    ---------------------------------------------

    To subscribe to this information via syndicated feeds:
    - RSS: http://vmgump.apache.org/gump/public/turbine-fulcrum/fulcrum-security-memory/rss.xml
    - Atom: http://vmgump.apache.org/gump/public/turbine-fulcrum/fulcrum-security-memory/atom.xml

    ============================== Gump Tracking Only ===
    Produced by Apache Gump(TM) version 2.3.
    Gump Run 06000610082012, vmgump.apache.org:vmgump:06000610082012
    Gump E-mail Identifier (unique within run) #21.

    --
    Apache Gump
    http://gump.apache.org/ [Instance: vmgump]

    ---------------------------------------------------------------------
    To unsubscribe, e-mail: dev-unsubscribe@turbine.apache.org
    For additional commands, e-mail: dev-help@turbine.apache.org
  • Anonymous at Aug 11, 2012 at 7:57 am
    To whom it may engage...

    This is an automated request, but not an unsolicited one. For
    more information please visit http://gump.apache.org/nagged.html,
    and/or contact the folk at general@gump.apache.org.

    Project fulcrum-security-memory has an issue affecting its community integration.
    This issue affects 2 projects,
    and has been outstanding for 5 runs.
    The current state of this project is 'Failed', with reason 'Build Failed'.
    For reference only, the following projects are affected by this:
    - fulcrum-security-memory : Services Framework
    - fulcrum_fulcrum-security-memory : Services Framework


    Full details are available at:
    http://vmgump.apache.org/gump/public/turbine-fulcrum/fulcrum-security-memory/index.html

    That said, some information snippets are provided here.

    The following annotations (debug/informational/warning/error messages) were provided:
    -DEBUG- Sole jar output [fulcrum-security-memory-*[0-9T].jar] identifier set to project name
    -INFO- Optional dependency fulcrum-security-api failed with reason build failed
    -DEBUG- (Apache Gump generated) Apache Maven Settings in: /srv/gump/public/workspace/turbine-fulcrum/security/memory/gump_mvn_settings.xml
    -INFO- Failed with reason build failed
    -DEBUG- Maven POM in: /srv/gump/public/workspace/turbine-fulcrum/security/memory/pom.xml
    -INFO- Failed to extract fallback artifacts from Gump Repository



    The following work was performed:
    http://vmgump.apache.org/gump/public/turbine-fulcrum/fulcrum-security-memory/gump_work/build_turbine-fulcrum_fulcrum-security-memory.html
    Work Name: build_turbine-fulcrum_fulcrum-security-memory (Type: Build)
    Work ended in a state of : Failed
    Elapsed: 4 secs
    Command Line: /opt/maven2/bin/mvn --batch-mode --settings /srv/gump/public/workspace/turbine-fulcrum/security/memory/gump_mvn_settings.xml package
    [Working Directory: /srv/gump/public/workspace/turbine-fulcrum/security/memory]
    M2_HOME: /opt/maven2
    ---------------------------------------------

    Missing:
    ----------
    1) org.apache.fulcrum:fulcrum-security-api:jar:1.1.0-SNAPSHOT

    Try downloading the file manually from the project website.

    Then, install it using the command:
    mvn install:install-file -DgroupId=org.apache.fulcrum -DartifactId=fulcrum-security-api -Dversion=1.1.0-SNAPSHOT -Dpackaging=jar -Dfile=/path/to/file

    Alternatively, if you host your own repository you can deploy the file there:
    mvn deploy:deploy-file -DgroupId=org.apache.fulcrum -DartifactId=fulcrum-security-api -Dversion=1.1.0-SNAPSHOT -Dpackaging=jar -Dfile=/path/to/file -Durl=[url] -DrepositoryId=[id]

    Path to dependency:
    1) org.apache.fulcrum:fulcrum-security-memory:jar:1.1.0-SNAPSHOT
    2) org.apache.fulcrum:fulcrum-security-api:jar:1.1.0-SNAPSHOT

    2) org.apache.fulcrum:fulcrum-security-api:test-jar:tests:1.1.0-SNAPSHOT

    Try downloading the file manually from the project website.

    Then, install it using the command:
    mvn install:install-file -DgroupId=org.apache.fulcrum -DartifactId=fulcrum-security-api -Dversion=1.1.0-SNAPSHOT -Dclassifier=tests -Dpackaging=test-jar -Dfile=/path/to/file

    Alternatively, if you host your own repository you can deploy the file there:
    mvn deploy:deploy-file -DgroupId=org.apache.fulcrum -DartifactId=fulcrum-security-api -Dversion=1.1.0-SNAPSHOT -Dclassifier=tests -Dpackaging=test-jar -Dfile=/path/to/file -Durl=[url] -DrepositoryId=[id]

    Path to dependency:
    1) org.apache.fulcrum:fulcrum-security-memory:jar:1.1.0-SNAPSHOT
    2) org.apache.fulcrum:fulcrum-security-api:test-jar:tests:1.1.0-SNAPSHOT

    ----------
    2 required artifacts are missing.

    for artifact:
    org.apache.fulcrum:fulcrum-security-memory:jar:1.1.0-SNAPSHOT

    from the specified remote repositories:
    gump-central (http://localhost:8192/maven2),
    gump-apache.snapshots (http://localhost:8192/repo/m2-snapshot-repository)



    [INFO] ------------------------------------------------------------------------
    [INFO] For more information, run Maven with the -e switch
    [INFO] ------------------------------------------------------------------------
    [INFO] Total time: 3 seconds
    [INFO] Finished at: Sat Aug 11 07:57:03 UTC 2012
    [INFO] Final Memory: 10M/24M
    [INFO] ------------------------------------------------------------------------
    ---------------------------------------------

    To subscribe to this information via syndicated feeds:
    - RSS: http://vmgump.apache.org/gump/public/turbine-fulcrum/fulcrum-security-memory/rss.xml
    - Atom: http://vmgump.apache.org/gump/public/turbine-fulcrum/fulcrum-security-memory/atom.xml

    ============================== Gump Tracking Only ===
    Produced by Apache Gump(TM) version 2.3.
    Gump Run 05000611082012, vmgump.apache.org:vmgump:05000611082012
    Gump E-mail Identifier (unique within run) #20.

    --
    Apache Gump
    http://gump.apache.org/ [Instance: vmgump]

    ---------------------------------------------------------------------
    To unsubscribe, e-mail: dev-unsubscribe@turbine.apache.org
    For additional commands, e-mail: dev-help@turbine.apache.org
  • Anonymous at Aug 12, 2012 at 8:18 am
    To whom it may engage...

    This is an automated request, but not an unsolicited one. For
    more information please visit http://gump.apache.org/nagged.html,
    and/or contact the folk at general@gump.apache.org.

    Project fulcrum-security-memory has an issue affecting its community integration.
    This issue affects 2 projects,
    and has been outstanding for 7 runs.
    The current state of this project is 'Failed', with reason 'Build Failed'.
    For reference only, the following projects are affected by this:
    - fulcrum-security-memory : Services Framework
    - fulcrum_fulcrum-security-memory : Services Framework


    Full details are available at:
    http://vmgump.apache.org/gump/public/turbine-fulcrum/fulcrum-security-memory/index.html

    That said, some information snippets are provided here.

    The following annotations (debug/informational/warning/error messages) were provided:
    -DEBUG- Sole jar output [fulcrum-security-memory-*[0-9T].jar] identifier set to project name
    -INFO- Optional dependency fulcrum-security-api failed with reason build failed
    -DEBUG- (Apache Gump generated) Apache Maven Settings in: /srv/gump/public/workspace/turbine-fulcrum/security/memory/gump_mvn_settings.xml
    -INFO- Failed with reason build failed
    -DEBUG- Maven POM in: /srv/gump/public/workspace/turbine-fulcrum/security/memory/pom.xml
    -INFO- Failed to extract fallback artifacts from Gump Repository



    The following work was performed:
    http://vmgump.apache.org/gump/public/turbine-fulcrum/fulcrum-security-memory/gump_work/build_turbine-fulcrum_fulcrum-security-memory.html
    Work Name: build_turbine-fulcrum_fulcrum-security-memory (Type: Build)
    Work ended in a state of : Failed
    Elapsed: 4 secs
    Command Line: /opt/maven2/bin/mvn --batch-mode --settings /srv/gump/public/workspace/turbine-fulcrum/security/memory/gump_mvn_settings.xml package
    [Working Directory: /srv/gump/public/workspace/turbine-fulcrum/security/memory]
    M2_HOME: /opt/maven2
    ---------------------------------------------

    Missing:
    ----------
    1) org.apache.fulcrum:fulcrum-security-api:jar:1.1.0-SNAPSHOT

    Try downloading the file manually from the project website.

    Then, install it using the command:
    mvn install:install-file -DgroupId=org.apache.fulcrum -DartifactId=fulcrum-security-api -Dversion=1.1.0-SNAPSHOT -Dpackaging=jar -Dfile=/path/to/file

    Alternatively, if you host your own repository you can deploy the file there:
    mvn deploy:deploy-file -DgroupId=org.apache.fulcrum -DartifactId=fulcrum-security-api -Dversion=1.1.0-SNAPSHOT -Dpackaging=jar -Dfile=/path/to/file -Durl=[url] -DrepositoryId=[id]

    Path to dependency:
    1) org.apache.fulcrum:fulcrum-security-memory:jar:1.1.0-SNAPSHOT
    2) org.apache.fulcrum:fulcrum-security-api:jar:1.1.0-SNAPSHOT

    2) org.apache.fulcrum:fulcrum-security-api:test-jar:tests:1.1.0-SNAPSHOT

    Try downloading the file manually from the project website.

    Then, install it using the command:
    mvn install:install-file -DgroupId=org.apache.fulcrum -DartifactId=fulcrum-security-api -Dversion=1.1.0-SNAPSHOT -Dclassifier=tests -Dpackaging=test-jar -Dfile=/path/to/file

    Alternatively, if you host your own repository you can deploy the file there:
    mvn deploy:deploy-file -DgroupId=org.apache.fulcrum -DartifactId=fulcrum-security-api -Dversion=1.1.0-SNAPSHOT -Dclassifier=tests -Dpackaging=test-jar -Dfile=/path/to/file -Durl=[url] -DrepositoryId=[id]

    Path to dependency:
    1) org.apache.fulcrum:fulcrum-security-memory:jar:1.1.0-SNAPSHOT
    2) org.apache.fulcrum:fulcrum-security-api:test-jar:tests:1.1.0-SNAPSHOT

    ----------
    2 required artifacts are missing.

    for artifact:
    org.apache.fulcrum:fulcrum-security-memory:jar:1.1.0-SNAPSHOT

    from the specified remote repositories:
    gump-central (http://localhost:8192/maven2),
    gump-apache.snapshots (http://localhost:8192/repo/m2-snapshot-repository)



    [INFO] ------------------------------------------------------------------------
    [INFO] For more information, run Maven with the -e switch
    [INFO] ------------------------------------------------------------------------
    [INFO] Total time: 3 seconds
    [INFO] Finished at: Sun Aug 12 08:18:02 UTC 2012
    [INFO] Final Memory: 10M/24M
    [INFO] ------------------------------------------------------------------------
    ---------------------------------------------

    To subscribe to this information via syndicated feeds:
    - RSS: http://vmgump.apache.org/gump/public/turbine-fulcrum/fulcrum-security-memory/rss.xml
    - Atom: http://vmgump.apache.org/gump/public/turbine-fulcrum/fulcrum-security-memory/atom.xml

    ============================== Gump Tracking Only ===
    Produced by Apache Gump(TM) version 2.3.
    Gump Run 06000612082012, vmgump.apache.org:vmgump:06000612082012
    Gump E-mail Identifier (unique within run) #23.

    --
    Apache Gump
    http://gump.apache.org/ [Instance: vmgump]

    ---------------------------------------------------------------------
    To unsubscribe, e-mail: dev-unsubscribe@turbine.apache.org
    For additional commands, e-mail: dev-help@turbine.apache.org
  • Anonymous at Aug 13, 2012 at 8:14 am
    To whom it may engage...

    This is an automated request, but not an unsolicited one. For
    more information please visit http://gump.apache.org/nagged.html,
    and/or contact the folk at general@gump.apache.org.

    Project fulcrum-security-memory has an issue affecting its community integration.
    This issue affects 2 projects,
    and has been outstanding for 9 runs.
    The current state of this project is 'Failed', with reason 'Build Failed'.
    For reference only, the following projects are affected by this:
    - fulcrum-security-memory : Services Framework
    - fulcrum_fulcrum-security-memory : Services Framework


    Full details are available at:
    http://vmgump.apache.org/gump/public/turbine-fulcrum/fulcrum-security-memory/index.html

    That said, some information snippets are provided here.

    The following annotations (debug/informational/warning/error messages) were provided:
    -DEBUG- Sole jar output [fulcrum-security-memory-*[0-9T].jar] identifier set to project name
    -INFO- Optional dependency fulcrum-security-api failed with reason build failed
    -DEBUG- (Apache Gump generated) Apache Maven Settings in: /srv/gump/public/workspace/turbine-fulcrum/security/memory/gump_mvn_settings.xml
    -INFO- Failed with reason build failed
    -DEBUG- Maven POM in: /srv/gump/public/workspace/turbine-fulcrum/security/memory/pom.xml
    -INFO- Failed to extract fallback artifacts from Gump Repository



    The following work was performed:
    http://vmgump.apache.org/gump/public/turbine-fulcrum/fulcrum-security-memory/gump_work/build_turbine-fulcrum_fulcrum-security-memory.html
    Work Name: build_turbine-fulcrum_fulcrum-security-memory (Type: Build)
    Work ended in a state of : Failed
    Elapsed: 4 secs
    Command Line: /opt/maven2/bin/mvn --batch-mode --settings /srv/gump/public/workspace/turbine-fulcrum/security/memory/gump_mvn_settings.xml package
    [Working Directory: /srv/gump/public/workspace/turbine-fulcrum/security/memory]
    M2_HOME: /opt/maven2
    ---------------------------------------------

    Missing:
    ----------
    1) org.apache.fulcrum:fulcrum-security-api:jar:1.1.0-SNAPSHOT

    Try downloading the file manually from the project website.

    Then, install it using the command:
    mvn install:install-file -DgroupId=org.apache.fulcrum -DartifactId=fulcrum-security-api -Dversion=1.1.0-SNAPSHOT -Dpackaging=jar -Dfile=/path/to/file

    Alternatively, if you host your own repository you can deploy the file there:
    mvn deploy:deploy-file -DgroupId=org.apache.fulcrum -DartifactId=fulcrum-security-api -Dversion=1.1.0-SNAPSHOT -Dpackaging=jar -Dfile=/path/to/file -Durl=[url] -DrepositoryId=[id]

    Path to dependency:
    1) org.apache.fulcrum:fulcrum-security-memory:jar:1.1.0-SNAPSHOT
    2) org.apache.fulcrum:fulcrum-security-api:jar:1.1.0-SNAPSHOT

    2) org.apache.fulcrum:fulcrum-security-api:test-jar:tests:1.1.0-SNAPSHOT

    Try downloading the file manually from the project website.

    Then, install it using the command:
    mvn install:install-file -DgroupId=org.apache.fulcrum -DartifactId=fulcrum-security-api -Dversion=1.1.0-SNAPSHOT -Dclassifier=tests -Dpackaging=test-jar -Dfile=/path/to/file

    Alternatively, if you host your own repository you can deploy the file there:
    mvn deploy:deploy-file -DgroupId=org.apache.fulcrum -DartifactId=fulcrum-security-api -Dversion=1.1.0-SNAPSHOT -Dclassifier=tests -Dpackaging=test-jar -Dfile=/path/to/file -Durl=[url] -DrepositoryId=[id]

    Path to dependency:
    1) org.apache.fulcrum:fulcrum-security-memory:jar:1.1.0-SNAPSHOT
    2) org.apache.fulcrum:fulcrum-security-api:test-jar:tests:1.1.0-SNAPSHOT

    ----------
    2 required artifacts are missing.

    for artifact:
    org.apache.fulcrum:fulcrum-security-memory:jar:1.1.0-SNAPSHOT

    from the specified remote repositories:
    gump-central (http://localhost:8192/maven2),
    gump-apache.snapshots (http://localhost:8192/repo/m2-snapshot-repository)



    [INFO] ------------------------------------------------------------------------
    [INFO] For more information, run Maven with the -e switch
    [INFO] ------------------------------------------------------------------------
    [INFO] Total time: 3 seconds
    [INFO] Finished at: Mon Aug 13 08:13:28 UTC 2012
    [INFO] Final Memory: 10M/24M
    [INFO] ------------------------------------------------------------------------
    ---------------------------------------------

    To subscribe to this information via syndicated feeds:
    - RSS: http://vmgump.apache.org/gump/public/turbine-fulcrum/fulcrum-security-memory/rss.xml
    - Atom: http://vmgump.apache.org/gump/public/turbine-fulcrum/fulcrum-security-memory/atom.xml

    ============================== Gump Tracking Only ===
    Produced by Apache Gump(TM) version 2.3.
    Gump Run 05000613082012, vmgump.apache.org:vmgump:05000613082012
    Gump E-mail Identifier (unique within run) #23.

    --
    Apache Gump
    http://gump.apache.org/ [Instance: vmgump]

    ---------------------------------------------------------------------
    To unsubscribe, e-mail: dev-unsubscribe@turbine.apache.org
    For additional commands, e-mail: dev-help@turbine.apache.org
  • Anonymous at Aug 14, 2012 at 8:23 am
    To whom it may engage...

    This is an automated request, but not an unsolicited one. For
    more information please visit http://gump.apache.org/nagged.html,
    and/or contact the folk at general@gump.apache.org.

    Project fulcrum-security-memory has an issue affecting its community integration.
    This issue affects 2 projects,
    and has been outstanding for 11 runs.
    The current state of this project is 'Failed', with reason 'Build Failed'.
    For reference only, the following projects are affected by this:
    - fulcrum-security-memory : Services Framework
    - fulcrum_fulcrum-security-memory : Services Framework


    Full details are available at:
    http://vmgump.apache.org/gump/public/turbine-fulcrum/fulcrum-security-memory/index.html

    That said, some information snippets are provided here.

    The following annotations (debug/informational/warning/error messages) were provided:
    -DEBUG- Sole jar output [fulcrum-security-memory-*[0-9T].jar] identifier set to project name
    -INFO- Optional dependency fulcrum-security-api failed with reason build failed
    -DEBUG- (Apache Gump generated) Apache Maven Settings in: /srv/gump/public/workspace/turbine-fulcrum/security/memory/gump_mvn_settings.xml
    -INFO- Failed with reason build failed
    -DEBUG- Maven POM in: /srv/gump/public/workspace/turbine-fulcrum/security/memory/pom.xml
    -INFO- Failed to extract fallback artifacts from Gump Repository



    The following work was performed:
    http://vmgump.apache.org/gump/public/turbine-fulcrum/fulcrum-security-memory/gump_work/build_turbine-fulcrum_fulcrum-security-memory.html
    Work Name: build_turbine-fulcrum_fulcrum-security-memory (Type: Build)
    Work ended in a state of : Failed
    Elapsed: 4 secs
    Command Line: /opt/maven2/bin/mvn --batch-mode --settings /srv/gump/public/workspace/turbine-fulcrum/security/memory/gump_mvn_settings.xml package
    [Working Directory: /srv/gump/public/workspace/turbine-fulcrum/security/memory]
    M2_HOME: /opt/maven2
    ---------------------------------------------

    Missing:
    ----------
    1) org.apache.fulcrum:fulcrum-security-api:jar:1.1.0-SNAPSHOT

    Try downloading the file manually from the project website.

    Then, install it using the command:
    mvn install:install-file -DgroupId=org.apache.fulcrum -DartifactId=fulcrum-security-api -Dversion=1.1.0-SNAPSHOT -Dpackaging=jar -Dfile=/path/to/file

    Alternatively, if you host your own repository you can deploy the file there:
    mvn deploy:deploy-file -DgroupId=org.apache.fulcrum -DartifactId=fulcrum-security-api -Dversion=1.1.0-SNAPSHOT -Dpackaging=jar -Dfile=/path/to/file -Durl=[url] -DrepositoryId=[id]

    Path to dependency:
    1) org.apache.fulcrum:fulcrum-security-memory:jar:1.1.0-SNAPSHOT
    2) org.apache.fulcrum:fulcrum-security-api:jar:1.1.0-SNAPSHOT

    2) org.apache.fulcrum:fulcrum-security-api:test-jar:tests:1.1.0-SNAPSHOT

    Try downloading the file manually from the project website.

    Then, install it using the command:
    mvn install:install-file -DgroupId=org.apache.fulcrum -DartifactId=fulcrum-security-api -Dversion=1.1.0-SNAPSHOT -Dclassifier=tests -Dpackaging=test-jar -Dfile=/path/to/file

    Alternatively, if you host your own repository you can deploy the file there:
    mvn deploy:deploy-file -DgroupId=org.apache.fulcrum -DartifactId=fulcrum-security-api -Dversion=1.1.0-SNAPSHOT -Dclassifier=tests -Dpackaging=test-jar -Dfile=/path/to/file -Durl=[url] -DrepositoryId=[id]

    Path to dependency:
    1) org.apache.fulcrum:fulcrum-security-memory:jar:1.1.0-SNAPSHOT
    2) org.apache.fulcrum:fulcrum-security-api:test-jar:tests:1.1.0-SNAPSHOT

    ----------
    2 required artifacts are missing.

    for artifact:
    org.apache.fulcrum:fulcrum-security-memory:jar:1.1.0-SNAPSHOT

    from the specified remote repositories:
    gump-central (http://localhost:8192/maven2),
    gump-apache.snapshots (http://localhost:8192/repo/m2-snapshot-repository)



    [INFO] ------------------------------------------------------------------------
    [INFO] For more information, run Maven with the -e switch
    [INFO] ------------------------------------------------------------------------
    [INFO] Total time: 3 seconds
    [INFO] Finished at: Tue Aug 14 08:22:37 UTC 2012
    [INFO] Final Memory: 10M/24M
    [INFO] ------------------------------------------------------------------------
    ---------------------------------------------

    To subscribe to this information via syndicated feeds:
    - RSS: http://vmgump.apache.org/gump/public/turbine-fulcrum/fulcrum-security-memory/rss.xml
    - Atom: http://vmgump.apache.org/gump/public/turbine-fulcrum/fulcrum-security-memory/atom.xml

    ============================== Gump Tracking Only ===
    Produced by Apache Gump(TM) version 2.3.
    Gump Run 06000614082012, vmgump.apache.org:vmgump:06000614082012
    Gump E-mail Identifier (unique within run) #23.

    --
    Apache Gump
    http://gump.apache.org/ [Instance: vmgump]

    ---------------------------------------------------------------------
    To unsubscribe, e-mail: dev-unsubscribe@turbine.apache.org
    For additional commands, e-mail: dev-help@turbine.apache.org
  • Anonymous at Aug 15, 2012 at 8:18 am
    To whom it may engage...

    This is an automated request, but not an unsolicited one. For
    more information please visit http://gump.apache.org/nagged.html,
    and/or contact the folk at general@gump.apache.org.

    Project fulcrum-security-memory has an issue affecting its community integration.
    This issue affects 2 projects,
    and has been outstanding for 13 runs.
    The current state of this project is 'Failed', with reason 'Build Failed'.
    For reference only, the following projects are affected by this:
    - fulcrum-security-memory : Services Framework
    - fulcrum_fulcrum-security-memory : Services Framework


    Full details are available at:
    http://vmgump.apache.org/gump/public/turbine-fulcrum/fulcrum-security-memory/index.html

    That said, some information snippets are provided here.

    The following annotations (debug/informational/warning/error messages) were provided:
    -DEBUG- Sole jar output [fulcrum-security-memory-*[0-9T].jar] identifier set to project name
    -DEBUG- (Apache Gump generated) Apache Maven Settings in: /srv/gump/public/workspace/turbine-fulcrum/security/memory/gump_mvn_settings.xml
    -INFO- Failed with reason build failed
    -DEBUG- Maven POM in: /srv/gump/public/workspace/turbine-fulcrum/security/memory/pom.xml
    -INFO- Failed to extract fallback artifacts from Gump Repository



    The following work was performed:
    http://vmgump.apache.org/gump/public/turbine-fulcrum/fulcrum-security-memory/gump_work/build_turbine-fulcrum_fulcrum-security-memory.html
    Work Name: build_turbine-fulcrum_fulcrum-security-memory (Type: Build)
    Work ended in a state of : Failed
    Elapsed: 22 secs
    Command Line: /opt/maven2/bin/mvn --batch-mode --settings /srv/gump/public/workspace/turbine-fulcrum/security/memory/gump_mvn_settings.xml package
    [Working Directory: /srv/gump/public/workspace/turbine-fulcrum/security/memory]
    M2_HOME: /opt/maven2
    ---------------------------------------------
    [DEBUG] LogEnabled.enableLogging() for userManager
    [DEBUG] Serviceable.service() for userManager
    [DEBUG] Configurable.configure() for userManager
    [DEBUG] Incarnating the service groupManager
    [DEBUG] Instantiating the implementation class for groupManager
    [DEBUG] Incarnating the service groupManager
    [DEBUG] LogEnabled.enableLogging() for groupManager
    [DEBUG] Serviceable.service() for groupManager
    [DEBUG] Configurable.configure() for groupManager
    [DEBUG] Incarnating the service modelManager
    [DEBUG] Instantiating the implementation class for modelManager
    [DEBUG] Incarnating the service modelManager
    [DEBUG] LogEnabled.enableLogging() for modelManager
    [DEBUG] Serviceable.service() for modelManager
    [DEBUG] Incarnating the service authenticator
    [DEBUG] Instantiating the implementation class for authenticator
    [DEBUG] Incarnating the service authenticator
    [DEBUG] LogEnabled.enableLogging() for authenticator
    [DEBUG] Incarnating the service aclFactory
    [DEBUG] Instantiating the implementation class for aclFactory
    [DEBUG] Incarnating the service aclFactory
    [DEBUG] LogEnabled.enableLogging() for aclFactory
    [DEBUG] Serviceable.service() for aclFactory
    [DEBUG] YAAFI Avalon Service Container is up and running
    [INFO] YaffiContainer ready.
    [DEBUG] Located the service 'org.apache.fulcrum.security.SecurityService' in the local container
    [DEBUG] Located the service 'org.apache.fulcrum.security.GroupManager' in the local container
    Tests run: 12, Failures: 0, Errors: 2, Skipped: 0, Time elapsed: 0.808 sec <<< FAILURE!

    Results :

    Tests in error:
    testGetGroup(org.apache.fulcrum.security.memory.basic.MemoryGroupManagerTest)
    testGetGroupByName(org.apache.fulcrum.security.memory.basic.MemoryGroupManagerTest)

    Tests run: 118, Failures: 0, Errors: 17, Skipped: 0

    [INFO] ------------------------------------------------------------------------
    [ERROR] BUILD FAILURE
    [INFO] ------------------------------------------------------------------------
    [INFO] There are test failures.

    Please refer to /srv/gump/public/workspace/turbine-fulcrum/security/memory/target/surefire-reports for the individual test results.
    [INFO] ------------------------------------------------------------------------
    [INFO] For more information, run Maven with the -e switch
    [INFO] ------------------------------------------------------------------------
    [INFO] Total time: 21 seconds
    [INFO] Finished at: Wed Aug 15 08:18:17 UTC 2012
    [INFO] Final Memory: 21M/51M
    [INFO] ------------------------------------------------------------------------
    ---------------------------------------------

    To subscribe to this information via syndicated feeds:
    - RSS: http://vmgump.apache.org/gump/public/turbine-fulcrum/fulcrum-security-memory/rss.xml
    - Atom: http://vmgump.apache.org/gump/public/turbine-fulcrum/fulcrum-security-memory/atom.xml

    ============================== Gump Tracking Only ===
    Produced by Apache Gump(TM) version 2.3.
    Gump Run 05000615082012, vmgump.apache.org:vmgump:05000615082012
    Gump E-mail Identifier (unique within run) #22.

    --
    Apache Gump
    http://gump.apache.org/ [Instance: vmgump]

    ---------------------------------------------------------------------
    To unsubscribe, e-mail: dev-unsubscribe@turbine.apache.org
    For additional commands, e-mail: dev-help@turbine.apache.org
  • Anonymous at Aug 16, 2012 at 8:19 am
    To whom it may engage...

    This is an automated request, but not an unsolicited one. For
    more information please visit http://gump.apache.org/nagged.html,
    and/or contact the folk at general@gump.apache.org.

    Project fulcrum-security-memory has an issue affecting its community integration.
    This issue affects 2 projects,
    and has been outstanding for 15 runs.
    The current state of this project is 'Failed', with reason 'Build Failed'.
    For reference only, the following projects are affected by this:
    - fulcrum-security-memory : Services Framework
    - fulcrum_fulcrum-security-memory : Services Framework


    Full details are available at:
    http://vmgump.apache.org/gump/public/turbine-fulcrum/fulcrum-security-memory/index.html

    That said, some information snippets are provided here.

    The following annotations (debug/informational/warning/error messages) were provided:
    -DEBUG- Sole jar output [fulcrum-security-memory-*[0-9T].jar] identifier set to project name
    -DEBUG- (Apache Gump generated) Apache Maven Settings in: /srv/gump/public/workspace/turbine-fulcrum/security/memory/gump_mvn_settings.xml
    -INFO- Failed with reason build failed
    -DEBUG- Maven POM in: /srv/gump/public/workspace/turbine-fulcrum/security/memory/pom.xml
    -INFO- Failed to extract fallback artifacts from Gump Repository



    The following work was performed:
    http://vmgump.apache.org/gump/public/turbine-fulcrum/fulcrum-security-memory/gump_work/build_turbine-fulcrum_fulcrum-security-memory.html
    Work Name: build_turbine-fulcrum_fulcrum-security-memory (Type: Build)
    Work ended in a state of : Failed
    Elapsed: 22 secs
    Command Line: /opt/maven2/bin/mvn --batch-mode --settings /srv/gump/public/workspace/turbine-fulcrum/security/memory/gump_mvn_settings.xml package
    [Working Directory: /srv/gump/public/workspace/turbine-fulcrum/security/memory]
    M2_HOME: /opt/maven2
    ---------------------------------------------
    [DEBUG] LogEnabled.enableLogging() for userManager
    [DEBUG] Serviceable.service() for userManager
    [DEBUG] Configurable.configure() for userManager
    [DEBUG] Incarnating the service groupManager
    [DEBUG] Instantiating the implementation class for groupManager
    [DEBUG] Incarnating the service groupManager
    [DEBUG] LogEnabled.enableLogging() for groupManager
    [DEBUG] Serviceable.service() for groupManager
    [DEBUG] Configurable.configure() for groupManager
    [DEBUG] Incarnating the service modelManager
    [DEBUG] Instantiating the implementation class for modelManager
    [DEBUG] Incarnating the service modelManager
    [DEBUG] LogEnabled.enableLogging() for modelManager
    [DEBUG] Serviceable.service() for modelManager
    [DEBUG] Incarnating the service authenticator
    [DEBUG] Instantiating the implementation class for authenticator
    [DEBUG] Incarnating the service authenticator
    [DEBUG] LogEnabled.enableLogging() for authenticator
    [DEBUG] Incarnating the service aclFactory
    [DEBUG] Instantiating the implementation class for aclFactory
    [DEBUG] Incarnating the service aclFactory
    [DEBUG] LogEnabled.enableLogging() for aclFactory
    [DEBUG] Serviceable.service() for aclFactory
    [DEBUG] YAAFI Avalon Service Container is up and running
    [INFO] YaffiContainer ready.
    [DEBUG] Located the service 'org.apache.fulcrum.security.SecurityService' in the local container
    [DEBUG] Located the service 'org.apache.fulcrum.security.GroupManager' in the local container
    Tests run: 12, Failures: 0, Errors: 2, Skipped: 0, Time elapsed: 0.776 sec <<< FAILURE!

    Results :

    Tests in error:
    testGetGroup(org.apache.fulcrum.security.memory.basic.MemoryGroupManagerTest)
    testGetGroupByName(org.apache.fulcrum.security.memory.basic.MemoryGroupManagerTest)

    Tests run: 118, Failures: 0, Errors: 17, Skipped: 0

    [INFO] ------------------------------------------------------------------------
    [ERROR] BUILD FAILURE
    [INFO] ------------------------------------------------------------------------
    [INFO] There are test failures.

    Please refer to /srv/gump/public/workspace/turbine-fulcrum/security/memory/target/surefire-reports for the individual test results.
    [INFO] ------------------------------------------------------------------------
    [INFO] For more information, run Maven with the -e switch
    [INFO] ------------------------------------------------------------------------
    [INFO] Total time: 21 seconds
    [INFO] Finished at: Thu Aug 16 08:18:52 UTC 2012
    [INFO] Final Memory: 21M/51M
    [INFO] ------------------------------------------------------------------------
    ---------------------------------------------

    To subscribe to this information via syndicated feeds:
    - RSS: http://vmgump.apache.org/gump/public/turbine-fulcrum/fulcrum-security-memory/rss.xml
    - Atom: http://vmgump.apache.org/gump/public/turbine-fulcrum/fulcrum-security-memory/atom.xml

    ============================== Gump Tracking Only ===
    Produced by Apache Gump(TM) version 2.3.
    Gump Run 21000616082012, vmgump.apache.org:vmgump:21000616082012
    Gump E-mail Identifier (unique within run) #23.

    --
    Apache Gump
    http://gump.apache.org/ [Instance: vmgump]

    ---------------------------------------------------------------------
    To unsubscribe, e-mail: dev-unsubscribe@turbine.apache.org
    For additional commands, e-mail: dev-help@turbine.apache.org
  • Anonymous at Aug 17, 2012 at 8:21 am
    To whom it may engage...

    This is an automated request, but not an unsolicited one. For
    more information please visit http://gump.apache.org/nagged.html,
    and/or contact the folk at general@gump.apache.org.

    Project fulcrum-security-memory has an issue affecting its community integration.
    This issue affects 2 projects,
    and has been outstanding for 17 runs.
    The current state of this project is 'Failed', with reason 'Build Failed'.
    For reference only, the following projects are affected by this:
    - fulcrum-security-memory : Services Framework
    - fulcrum_fulcrum-security-memory : Services Framework


    Full details are available at:
    http://vmgump.apache.org/gump/public/turbine-fulcrum/fulcrum-security-memory/index.html

    That said, some information snippets are provided here.

    The following annotations (debug/informational/warning/error messages) were provided:
    -DEBUG- Sole jar output [fulcrum-security-memory-*[0-9T].jar] identifier set to project name
    -DEBUG- (Apache Gump generated) Apache Maven Settings in: /srv/gump/public/workspace/turbine-fulcrum/security/memory/gump_mvn_settings.xml
    -INFO- Failed with reason build failed
    -DEBUG- Maven POM in: /srv/gump/public/workspace/turbine-fulcrum/security/memory/pom.xml
    -INFO- Failed to extract fallback artifacts from Gump Repository



    The following work was performed:
    http://vmgump.apache.org/gump/public/turbine-fulcrum/fulcrum-security-memory/gump_work/build_turbine-fulcrum_fulcrum-security-memory.html
    Work Name: build_turbine-fulcrum_fulcrum-security-memory (Type: Build)
    Work ended in a state of : Failed
    Elapsed: 23 secs
    Command Line: /opt/maven2/bin/mvn --batch-mode --settings /srv/gump/public/workspace/turbine-fulcrum/security/memory/gump_mvn_settings.xml package
    [Working Directory: /srv/gump/public/workspace/turbine-fulcrum/security/memory]
    M2_HOME: /opt/maven2
    ---------------------------------------------
    [DEBUG] LogEnabled.enableLogging() for userManager
    [DEBUG] Serviceable.service() for userManager
    [DEBUG] Configurable.configure() for userManager
    [DEBUG] Incarnating the service groupManager
    [DEBUG] Instantiating the implementation class for groupManager
    [DEBUG] Incarnating the service groupManager
    [DEBUG] LogEnabled.enableLogging() for groupManager
    [DEBUG] Serviceable.service() for groupManager
    [DEBUG] Configurable.configure() for groupManager
    [DEBUG] Incarnating the service modelManager
    [DEBUG] Instantiating the implementation class for modelManager
    [DEBUG] Incarnating the service modelManager
    [DEBUG] LogEnabled.enableLogging() for modelManager
    [DEBUG] Serviceable.service() for modelManager
    [DEBUG] Incarnating the service authenticator
    [DEBUG] Instantiating the implementation class for authenticator
    [DEBUG] Incarnating the service authenticator
    [DEBUG] LogEnabled.enableLogging() for authenticator
    [DEBUG] Incarnating the service aclFactory
    [DEBUG] Instantiating the implementation class for aclFactory
    [DEBUG] Incarnating the service aclFactory
    [DEBUG] LogEnabled.enableLogging() for aclFactory
    [DEBUG] Serviceable.service() for aclFactory
    [DEBUG] YAAFI Avalon Service Container is up and running
    [INFO] YaffiContainer ready.
    [DEBUG] Located the service 'org.apache.fulcrum.security.SecurityService' in the local container
    [DEBUG] Located the service 'org.apache.fulcrum.security.GroupManager' in the local container
    Tests run: 12, Failures: 0, Errors: 2, Skipped: 0, Time elapsed: 0.816 sec <<< FAILURE!

    Results :

    Tests in error:
    testGetGroup(org.apache.fulcrum.security.memory.basic.MemoryGroupManagerTest)
    testGetGroupByName(org.apache.fulcrum.security.memory.basic.MemoryGroupManagerTest)

    Tests run: 118, Failures: 0, Errors: 17, Skipped: 0

    [INFO] ------------------------------------------------------------------------
    [ERROR] BUILD FAILURE
    [INFO] ------------------------------------------------------------------------
    [INFO] There are test failures.

    Please refer to /srv/gump/public/workspace/turbine-fulcrum/security/memory/target/surefire-reports for the individual test results.
    [INFO] ------------------------------------------------------------------------
    [INFO] For more information, run Maven with the -e switch
    [INFO] ------------------------------------------------------------------------
    [INFO] Total time: 22 seconds
    [INFO] Finished at: Fri Aug 17 08:21:21 UTC 2012
    [INFO] Final Memory: 21M/51M
    [INFO] ------------------------------------------------------------------------
    ---------------------------------------------

    To subscribe to this information via syndicated feeds:
    - RSS: http://vmgump.apache.org/gump/public/turbine-fulcrum/fulcrum-security-memory/rss.xml
    - Atom: http://vmgump.apache.org/gump/public/turbine-fulcrum/fulcrum-security-memory/atom.xml

    ============================== Gump Tracking Only ===
    Produced by Apache Gump(TM) version 2.3.
    Gump Run 07000617082012, vmgump.apache.org:vmgump:07000617082012
    Gump E-mail Identifier (unique within run) #22.

    --
    Apache Gump
    http://gump.apache.org/ [Instance: vmgump]

    ---------------------------------------------------------------------
    To unsubscribe, e-mail: dev-unsubscribe@turbine.apache.org
    For additional commands, e-mail: dev-help@turbine.apache.org
  • Anonymous at Aug 18, 2012 at 8:17 am
    To whom it may engage...

    This is an automated request, but not an unsolicited one. For
    more information please visit http://gump.apache.org/nagged.html,
    and/or contact the folk at general@gump.apache.org.

    Project fulcrum-security-memory has an issue affecting its community integration.
    This issue affects 2 projects,
    and has been outstanding for 19 runs.
    The current state of this project is 'Failed', with reason 'Build Failed'.
    For reference only, the following projects are affected by this:
    - fulcrum-security-memory : Services Framework
    - fulcrum_fulcrum-security-memory : Services Framework


    Full details are available at:
    http://vmgump.apache.org/gump/public/turbine-fulcrum/fulcrum-security-memory/index.html

    That said, some information snippets are provided here.

    The following annotations (debug/informational/warning/error messages) were provided:
    -DEBUG- Sole jar output [fulcrum-security-memory-*[0-9T].jar] identifier set to project name
    -DEBUG- (Apache Gump generated) Apache Maven Settings in: /srv/gump/public/workspace/turbine-fulcrum/security/memory/gump_mvn_settings.xml
    -INFO- Failed with reason build failed
    -DEBUG- Maven POM in: /srv/gump/public/workspace/turbine-fulcrum/security/memory/pom.xml
    -INFO- Failed to extract fallback artifacts from Gump Repository



    The following work was performed:
    http://vmgump.apache.org/gump/public/turbine-fulcrum/fulcrum-security-memory/gump_work/build_turbine-fulcrum_fulcrum-security-memory.html
    Work Name: build_turbine-fulcrum_fulcrum-security-memory (Type: Build)
    Work ended in a state of : Failed
    Elapsed: 22 secs
    Command Line: /opt/maven2/bin/mvn --batch-mode --settings /srv/gump/public/workspace/turbine-fulcrum/security/memory/gump_mvn_settings.xml package
    [Working Directory: /srv/gump/public/workspace/turbine-fulcrum/security/memory]
    M2_HOME: /opt/maven2
    ---------------------------------------------
    [DEBUG] LogEnabled.enableLogging() for userManager
    [DEBUG] Serviceable.service() for userManager
    [DEBUG] Configurable.configure() for userManager
    [DEBUG] Incarnating the service groupManager
    [DEBUG] Instantiating the implementation class for groupManager
    [DEBUG] Incarnating the service groupManager
    [DEBUG] LogEnabled.enableLogging() for groupManager
    [DEBUG] Serviceable.service() for groupManager
    [DEBUG] Configurable.configure() for groupManager
    [DEBUG] Incarnating the service modelManager
    [DEBUG] Instantiating the implementation class for modelManager
    [DEBUG] Incarnating the service modelManager
    [DEBUG] LogEnabled.enableLogging() for modelManager
    [DEBUG] Serviceable.service() for modelManager
    [DEBUG] Incarnating the service authenticator
    [DEBUG] Instantiating the implementation class for authenticator
    [DEBUG] Incarnating the service authenticator
    [DEBUG] LogEnabled.enableLogging() for authenticator
    [DEBUG] Incarnating the service aclFactory
    [DEBUG] Instantiating the implementation class for aclFactory
    [DEBUG] Incarnating the service aclFactory
    [DEBUG] LogEnabled.enableLogging() for aclFactory
    [DEBUG] Serviceable.service() for aclFactory
    [DEBUG] YAAFI Avalon Service Container is up and running
    [INFO] YaffiContainer ready.
    [DEBUG] Located the service 'org.apache.fulcrum.security.SecurityService' in the local container
    [DEBUG] Located the service 'org.apache.fulcrum.security.GroupManager' in the local container
    Tests run: 12, Failures: 0, Errors: 2, Skipped: 0, Time elapsed: 0.791 sec <<< FAILURE!

    Results :

    Tests in error:
    testGetGroup(org.apache.fulcrum.security.memory.basic.MemoryGroupManagerTest)
    testGetGroupByName(org.apache.fulcrum.security.memory.basic.MemoryGroupManagerTest)

    Tests run: 118, Failures: 0, Errors: 17, Skipped: 0

    [INFO] ------------------------------------------------------------------------
    [ERROR] BUILD FAILURE
    [INFO] ------------------------------------------------------------------------
    [INFO] There are test failures.

    Please refer to /srv/gump/public/workspace/turbine-fulcrum/security/memory/target/surefire-reports for the individual test results.
    [INFO] ------------------------------------------------------------------------
    [INFO] For more information, run Maven with the -e switch
    [INFO] ------------------------------------------------------------------------
    [INFO] Total time: 21 seconds
    [INFO] Finished at: Sat Aug 18 08:16:45 UTC 2012
    [INFO] Final Memory: 21M/51M
    [INFO] ------------------------------------------------------------------------
    ---------------------------------------------

    To subscribe to this information via syndicated feeds:
    - RSS: http://vmgump.apache.org/gump/public/turbine-fulcrum/fulcrum-security-memory/rss.xml
    - Atom: http://vmgump.apache.org/gump/public/turbine-fulcrum/fulcrum-security-memory/atom.xml

    ============================== Gump Tracking Only ===
    Produced by Apache Gump(TM) version 2.3.
    Gump Run 06000618082012, vmgump.apache.org:vmgump:06000618082012
    Gump E-mail Identifier (unique within run) #23.

    --
    Apache Gump
    http://gump.apache.org/ [Instance: vmgump]

    ---------------------------------------------------------------------
    To unsubscribe, e-mail: dev-unsubscribe@turbine.apache.org
    For additional commands, e-mail: dev-help@turbine.apache.org
  • Anonymous at Aug 19, 2012 at 8:20 am
    To whom it may engage...

    This is an automated request, but not an unsolicited one. For
    more information please visit http://gump.apache.org/nagged.html,
    and/or contact the folk at general@gump.apache.org.

    Project fulcrum-security-memory has an issue affecting its community integration.
    This issue affects 2 projects,
    and has been outstanding for 21 runs.
    The current state of this project is 'Failed', with reason 'Build Failed'.
    For reference only, the following projects are affected by this:
    - fulcrum-security-memory : Services Framework
    - fulcrum_fulcrum-security-memory : Services Framework


    Full details are available at:
    http://vmgump.apache.org/gump/public/turbine-fulcrum/fulcrum-security-memory/index.html

    That said, some information snippets are provided here.

    The following annotations (debug/informational/warning/error messages) were provided:
    -DEBUG- Sole jar output [fulcrum-security-memory-*[0-9T].jar] identifier set to project name
    -DEBUG- (Apache Gump generated) Apache Maven Settings in: /srv/gump/public/workspace/turbine-fulcrum/security/memory/gump_mvn_settings.xml
    -INFO- Failed with reason build failed
    -DEBUG- Maven POM in: /srv/gump/public/workspace/turbine-fulcrum/security/memory/pom.xml
    -INFO- Failed to extract fallback artifacts from Gump Repository



    The following work was performed:
    http://vmgump.apache.org/gump/public/turbine-fulcrum/fulcrum-security-memory/gump_work/build_turbine-fulcrum_fulcrum-security-memory.html
    Work Name: build_turbine-fulcrum_fulcrum-security-memory (Type: Build)
    Work ended in a state of : Failed
    Elapsed: 22 secs
    Command Line: /opt/maven2/bin/mvn --batch-mode --settings /srv/gump/public/workspace/turbine-fulcrum/security/memory/gump_mvn_settings.xml package
    [Working Directory: /srv/gump/public/workspace/turbine-fulcrum/security/memory]
    M2_HOME: /opt/maven2
    ---------------------------------------------
    [DEBUG] LogEnabled.enableLogging() for userManager
    [DEBUG] Serviceable.service() for userManager
    [DEBUG] Configurable.configure() for userManager
    [DEBUG] Incarnating the service groupManager
    [DEBUG] Instantiating the implementation class for groupManager
    [DEBUG] Incarnating the service groupManager
    [DEBUG] LogEnabled.enableLogging() for groupManager
    [DEBUG] Serviceable.service() for groupManager
    [DEBUG] Configurable.configure() for groupManager
    [DEBUG] Incarnating the service modelManager
    [DEBUG] Instantiating the implementation class for modelManager
    [DEBUG] Incarnating the service modelManager
    [DEBUG] LogEnabled.enableLogging() for modelManager
    [DEBUG] Serviceable.service() for modelManager
    [DEBUG] Incarnating the service authenticator
    [DEBUG] Instantiating the implementation class for authenticator
    [DEBUG] Incarnating the service authenticator
    [DEBUG] LogEnabled.enableLogging() for authenticator
    [DEBUG] Incarnating the service aclFactory
    [DEBUG] Instantiating the implementation class for aclFactory
    [DEBUG] Incarnating the service aclFactory
    [DEBUG] LogEnabled.enableLogging() for aclFactory
    [DEBUG] Serviceable.service() for aclFactory
    [DEBUG] YAAFI Avalon Service Container is up and running
    [INFO] YaffiContainer ready.
    [DEBUG] Located the service 'org.apache.fulcrum.security.SecurityService' in the local container
    [DEBUG] Located the service 'org.apache.fulcrum.security.GroupManager' in the local container
    Tests run: 12, Failures: 0, Errors: 2, Skipped: 0, Time elapsed: 0.835 sec <<< FAILURE!

    Results :

    Tests in error:
    testGetGroup(org.apache.fulcrum.security.memory.basic.MemoryGroupManagerTest)
    testGetGroupByName(org.apache.fulcrum.security.memory.basic.MemoryGroupManagerTest)

    Tests run: 118, Failures: 0, Errors: 17, Skipped: 0

    [INFO] ------------------------------------------------------------------------
    [ERROR] BUILD FAILURE
    [INFO] ------------------------------------------------------------------------
    [INFO] There are test failures.

    Please refer to /srv/gump/public/workspace/turbine-fulcrum/security/memory/target/surefire-reports for the individual test results.
    [INFO] ------------------------------------------------------------------------
    [INFO] For more information, run Maven with the -e switch
    [INFO] ------------------------------------------------------------------------
    [INFO] Total time: 21 seconds
    [INFO] Finished at: Sun Aug 19 08:20:17 UTC 2012
    [INFO] Final Memory: 21M/51M
    [INFO] ------------------------------------------------------------------------
    ---------------------------------------------

    To subscribe to this information via syndicated feeds:
    - RSS: http://vmgump.apache.org/gump/public/turbine-fulcrum/fulcrum-security-memory/rss.xml
    - Atom: http://vmgump.apache.org/gump/public/turbine-fulcrum/fulcrum-security-memory/atom.xml

    ============================== Gump Tracking Only ===
    Produced by Apache Gump(TM) version 2.3.
    Gump Run 06000619082012, vmgump.apache.org:vmgump:06000619082012
    Gump E-mail Identifier (unique within run) #23.

    --
    Apache Gump
    http://gump.apache.org/ [Instance: vmgump]

    ---------------------------------------------------------------------
    To unsubscribe, e-mail: dev-unsubscribe@turbine.apache.org
    For additional commands, e-mail: dev-help@turbine.apache.org
  • Anonymous at Aug 20, 2012 at 8:16 am
    To whom it may engage...

    This is an automated request, but not an unsolicited one. For
    more information please visit http://gump.apache.org/nagged.html,
    and/or contact the folk at general@gump.apache.org.

    Project fulcrum-security-memory has an issue affecting its community integration.
    This issue affects 2 projects,
    and has been outstanding for 23 runs.
    The current state of this project is 'Failed', with reason 'Build Failed'.
    For reference only, the following projects are affected by this:
    - fulcrum-security-memory : Services Framework
    - fulcrum_fulcrum-security-memory : Services Framework


    Full details are available at:
    http://vmgump.apache.org/gump/public/turbine-fulcrum/fulcrum-security-memory/index.html

    That said, some information snippets are provided here.

    The following annotations (debug/informational/warning/error messages) were provided:
    -DEBUG- Sole jar output [fulcrum-security-memory-*[0-9T].jar] identifier set to project name
    -DEBUG- (Apache Gump generated) Apache Maven Settings in: /srv/gump/public/workspace/turbine-fulcrum/security/memory/gump_mvn_settings.xml
    -INFO- Failed with reason build failed
    -DEBUG- Maven POM in: /srv/gump/public/workspace/turbine-fulcrum/security/memory/pom.xml
    -INFO- Failed to extract fallback artifacts from Gump Repository



    The following work was performed:
    http://vmgump.apache.org/gump/public/turbine-fulcrum/fulcrum-security-memory/gump_work/build_turbine-fulcrum_fulcrum-security-memory.html
    Work Name: build_turbine-fulcrum_fulcrum-security-memory (Type: Build)
    Work ended in a state of : Failed
    Elapsed: 23 secs
    Command Line: /opt/maven2/bin/mvn --batch-mode --settings /srv/gump/public/workspace/turbine-fulcrum/security/memory/gump_mvn_settings.xml package
    [Working Directory: /srv/gump/public/workspace/turbine-fulcrum/security/memory]
    M2_HOME: /opt/maven2
    ---------------------------------------------
    [DEBUG] LogEnabled.enableLogging() for userManager
    [DEBUG] Serviceable.service() for userManager
    [DEBUG] Configurable.configure() for userManager
    [DEBUG] Incarnating the service groupManager
    [DEBUG] Instantiating the implementation class for groupManager
    [DEBUG] Incarnating the service groupManager
    [DEBUG] LogEnabled.enableLogging() for groupManager
    [DEBUG] Serviceable.service() for groupManager
    [DEBUG] Configurable.configure() for groupManager
    [DEBUG] Incarnating the service modelManager
    [DEBUG] Instantiating the implementation class for modelManager
    [DEBUG] Incarnating the service modelManager
    [DEBUG] LogEnabled.enableLogging() for modelManager
    [DEBUG] Serviceable.service() for modelManager
    [DEBUG] Incarnating the service authenticator
    [DEBUG] Instantiating the implementation class for authenticator
    [DEBUG] Incarnating the service authenticator
    [DEBUG] LogEnabled.enableLogging() for authenticator
    [DEBUG] Incarnating the service aclFactory
    [DEBUG] Instantiating the implementation class for aclFactory
    [DEBUG] Incarnating the service aclFactory
    [DEBUG] LogEnabled.enableLogging() for aclFactory
    [DEBUG] Serviceable.service() for aclFactory
    [DEBUG] YAAFI Avalon Service Container is up and running
    [INFO] YaffiContainer ready.
    [DEBUG] Located the service 'org.apache.fulcrum.security.SecurityService' in the local container
    [DEBUG] Located the service 'org.apache.fulcrum.security.GroupManager' in the local container
    Tests run: 12, Failures: 0, Errors: 2, Skipped: 0, Time elapsed: 0.918 sec <<< FAILURE!

    Results :

    Tests in error:
    testGetGroup(org.apache.fulcrum.security.memory.basic.MemoryGroupManagerTest)
    testGetGroupByName(org.apache.fulcrum.security.memory.basic.MemoryGroupManagerTest)

    Tests run: 118, Failures: 0, Errors: 17, Skipped: 0

    [INFO] ------------------------------------------------------------------------
    [ERROR] BUILD FAILURE
    [INFO] ------------------------------------------------------------------------
    [INFO] There are test failures.

    Please refer to /srv/gump/public/workspace/turbine-fulcrum/security/memory/target/surefire-reports for the individual test results.
    [INFO] ------------------------------------------------------------------------
    [INFO] For more information, run Maven with the -e switch
    [INFO] ------------------------------------------------------------------------
    [INFO] Total time: 22 seconds
    [INFO] Finished at: Mon Aug 20 08:15:54 UTC 2012
    [INFO] Final Memory: 21M/51M
    [INFO] ------------------------------------------------------------------------
    ---------------------------------------------

    To subscribe to this information via syndicated feeds:
    - RSS: http://vmgump.apache.org/gump/public/turbine-fulcrum/fulcrum-security-memory/rss.xml
    - Atom: http://vmgump.apache.org/gump/public/turbine-fulcrum/fulcrum-security-memory/atom.xml

    ============================== Gump Tracking Only ===
    Produced by Apache Gump(TM) version 2.3.
    Gump Run 06000620082012, vmgump.apache.org:vmgump:06000620082012
    Gump E-mail Identifier (unique within run) #22.

    --
    Apache Gump
    http://gump.apache.org/ [Instance: vmgump]

    ---------------------------------------------------------------------
    To unsubscribe, e-mail: dev-unsubscribe@turbine.apache.org
    For additional commands, e-mail: dev-help@turbine.apache.org
  • Anonymous at Aug 21, 2012 at 8:13 am
    To whom it may engage...

    This is an automated request, but not an unsolicited one. For
    more information please visit http://gump.apache.org/nagged.html,
    and/or contact the folk at general@gump.apache.org.

    Project fulcrum-security-memory has an issue affecting its community integration.
    This issue affects 2 projects,
    and has been outstanding for 25 runs.
    The current state of this project is 'Failed', with reason 'Build Failed'.
    For reference only, the following projects are affected by this:
    - fulcrum-security-memory : Services Framework
    - fulcrum_fulcrum-security-memory : Services Framework


    Full details are available at:
    http://vmgump.apache.org/gump/public/turbine-fulcrum/fulcrum-security-memory/index.html

    That said, some information snippets are provided here.

    The following annotations (debug/informational/warning/error messages) were provided:
    -DEBUG- Sole jar output [fulcrum-security-memory-*[0-9T].jar] identifier set to project name
    -DEBUG- (Apache Gump generated) Apache Maven Settings in: /srv/gump/public/workspace/turbine-fulcrum/security/memory/gump_mvn_settings.xml
    -INFO- Failed with reason build failed
    -DEBUG- Maven POM in: /srv/gump/public/workspace/turbine-fulcrum/security/memory/pom.xml
    -INFO- Failed to extract fallback artifacts from Gump Repository



    The following work was performed:
    http://vmgump.apache.org/gump/public/turbine-fulcrum/fulcrum-security-memory/gump_work/build_turbine-fulcrum_fulcrum-security-memory.html
    Work Name: build_turbine-fulcrum_fulcrum-security-memory (Type: Build)
    Work ended in a state of : Failed
    Elapsed: 22 secs
    Command Line: /opt/maven2/bin/mvn --batch-mode --settings /srv/gump/public/workspace/turbine-fulcrum/security/memory/gump_mvn_settings.xml package
    [Working Directory: /srv/gump/public/workspace/turbine-fulcrum/security/memory]
    M2_HOME: /opt/maven2
    ---------------------------------------------
    [DEBUG] LogEnabled.enableLogging() for userManager
    [DEBUG] Serviceable.service() for userManager
    [DEBUG] Configurable.configure() for userManager
    [DEBUG] Incarnating the service groupManager
    [DEBUG] Instantiating the implementation class for groupManager
    [DEBUG] Incarnating the service groupManager
    [DEBUG] LogEnabled.enableLogging() for groupManager
    [DEBUG] Serviceable.service() for groupManager
    [DEBUG] Configurable.configure() for groupManager
    [DEBUG] Incarnating the service modelManager
    [DEBUG] Instantiating the implementation class for modelManager
    [DEBUG] Incarnating the service modelManager
    [DEBUG] LogEnabled.enableLogging() for modelManager
    [DEBUG] Serviceable.service() for modelManager
    [DEBUG] Incarnating the service authenticator
    [DEBUG] Instantiating the implementation class for authenticator
    [DEBUG] Incarnating the service authenticator
    [DEBUG] LogEnabled.enableLogging() for authenticator
    [DEBUG] Incarnating the service aclFactory
    [DEBUG] Instantiating the implementation class for aclFactory
    [DEBUG] Incarnating the service aclFactory
    [DEBUG] LogEnabled.enableLogging() for aclFactory
    [DEBUG] Serviceable.service() for aclFactory
    [DEBUG] YAAFI Avalon Service Container is up and running
    [INFO] YaffiContainer ready.
    [DEBUG] Located the service 'org.apache.fulcrum.security.SecurityService' in the local container
    [DEBUG] Located the service 'org.apache.fulcrum.security.GroupManager' in the local container
    Tests run: 12, Failures: 0, Errors: 2, Skipped: 0, Time elapsed: 0.693 sec <<< FAILURE!

    Results :

    Tests in error:
    testGetGroup(org.apache.fulcrum.security.memory.basic.MemoryGroupManagerTest)
    testGetGroupByName(org.apache.fulcrum.security.memory.basic.MemoryGroupManagerTest)

    Tests run: 118, Failures: 0, Errors: 17, Skipped: 0

    [INFO] ------------------------------------------------------------------------
    [ERROR] BUILD FAILURE
    [INFO] ------------------------------------------------------------------------
    [INFO] There are test failures.

    Please refer to /srv/gump/public/workspace/turbine-fulcrum/security/memory/target/surefire-reports for the individual test results.
    [INFO] ------------------------------------------------------------------------
    [INFO] For more information, run Maven with the -e switch
    [INFO] ------------------------------------------------------------------------
    [INFO] Total time: 21 seconds
    [INFO] Finished at: Tue Aug 21 08:12:57 UTC 2012
    [INFO] Final Memory: 21M/51M
    [INFO] ------------------------------------------------------------------------
    ---------------------------------------------

    To subscribe to this information via syndicated feeds:
    - RSS: http://vmgump.apache.org/gump/public/turbine-fulcrum/fulcrum-security-memory/rss.xml
    - Atom: http://vmgump.apache.org/gump/public/turbine-fulcrum/fulcrum-security-memory/atom.xml

    ============================== Gump Tracking Only ===
    Produced by Apache Gump(TM) version 2.3.
    Gump Run 06000621082012, vmgump.apache.org:vmgump:06000621082012
    Gump E-mail Identifier (unique within run) #20.

    --
    Apache Gump
    http://gump.apache.org/ [Instance: vmgump]

    ---------------------------------------------------------------------
    To unsubscribe, e-mail: dev-unsubscribe@turbine.apache.org
    For additional commands, e-mail: dev-help@turbine.apache.org
  • Anonymous at Aug 22, 2012 at 8:17 am
    To whom it may engage...

    This is an automated request, but not an unsolicited one. For
    more information please visit http://gump.apache.org/nagged.html,
    and/or contact the folk at general@gump.apache.org.

    Project fulcrum-security-memory has an issue affecting its community integration.
    This issue affects 2 projects,
    and has been outstanding for 27 runs.
    The current state of this project is 'Failed', with reason 'Build Failed'.
    For reference only, the following projects are affected by this:
    - fulcrum-security-memory : Services Framework
    - fulcrum_fulcrum-security-memory : Services Framework


    Full details are available at:
    http://vmgump.apache.org/gump/public/turbine-fulcrum/fulcrum-security-memory/index.html

    That said, some information snippets are provided here.

    The following annotations (debug/informational/warning/error messages) were provided:
    -DEBUG- Sole jar output [fulcrum-security-memory-*[0-9T].jar] identifier set to project name
    -DEBUG- (Apache Gump generated) Apache Maven Settings in: /srv/gump/public/workspace/turbine-fulcrum/security/memory/gump_mvn_settings.xml
    -INFO- Failed with reason build failed
    -DEBUG- Maven POM in: /srv/gump/public/workspace/turbine-fulcrum/security/memory/pom.xml
    -INFO- Failed to extract fallback artifacts from Gump Repository



    The following work was performed:
    http://vmgump.apache.org/gump/public/turbine-fulcrum/fulcrum-security-memory/gump_work/build_turbine-fulcrum_fulcrum-security-memory.html
    Work Name: build_turbine-fulcrum_fulcrum-security-memory (Type: Build)
    Work ended in a state of : Failed
    Elapsed: 22 secs
    Command Line: /opt/maven2/bin/mvn --batch-mode --settings /srv/gump/public/workspace/turbine-fulcrum/security/memory/gump_mvn_settings.xml package
    [Working Directory: /srv/gump/public/workspace/turbine-fulcrum/security/memory]
    M2_HOME: /opt/maven2
    ---------------------------------------------
    [DEBUG] LogEnabled.enableLogging() for userManager
    [DEBUG] Serviceable.service() for userManager
    [DEBUG] Configurable.configure() for userManager
    [DEBUG] Incarnating the service groupManager
    [DEBUG] Instantiating the implementation class for groupManager
    [DEBUG] Incarnating the service groupManager
    [DEBUG] LogEnabled.enableLogging() for groupManager
    [DEBUG] Serviceable.service() for groupManager
    [DEBUG] Configurable.configure() for groupManager
    [DEBUG] Incarnating the service modelManager
    [DEBUG] Instantiating the implementation class for modelManager
    [DEBUG] Incarnating the service modelManager
    [DEBUG] LogEnabled.enableLogging() for modelManager
    [DEBUG] Serviceable.service() for modelManager
    [DEBUG] Incarnating the service authenticator
    [DEBUG] Instantiating the implementation class for authenticator
    [DEBUG] Incarnating the service authenticator
    [DEBUG] LogEnabled.enableLogging() for authenticator
    [DEBUG] Incarnating the service aclFactory
    [DEBUG] Instantiating the implementation class for aclFactory
    [DEBUG] Incarnating the service aclFactory
    [DEBUG] LogEnabled.enableLogging() for aclFactory
    [DEBUG] Serviceable.service() for aclFactory
    [DEBUG] YAAFI Avalon Service Container is up and running
    [INFO] YaffiContainer ready.
    [DEBUG] Located the service 'org.apache.fulcrum.security.SecurityService' in the local container
    [DEBUG] Located the service 'org.apache.fulcrum.security.GroupManager' in the local container
    Tests run: 12, Failures: 0, Errors: 2, Skipped: 0, Time elapsed: 0.812 sec <<< FAILURE!

    Results :

    Tests in error:
    testGetGroup(org.apache.fulcrum.security.memory.basic.MemoryGroupManagerTest)
    testGetGroupByName(org.apache.fulcrum.security.memory.basic.MemoryGroupManagerTest)

    Tests run: 118, Failures: 0, Errors: 17, Skipped: 0

    [INFO] ------------------------------------------------------------------------
    [ERROR] BUILD FAILURE
    [INFO] ------------------------------------------------------------------------
    [INFO] There are test failures.

    Please refer to /srv/gump/public/workspace/turbine-fulcrum/security/memory/target/surefire-reports for the individual test results.
    [INFO] ------------------------------------------------------------------------
    [INFO] For more information, run Maven with the -e switch
    [INFO] ------------------------------------------------------------------------
    [INFO] Total time: 21 seconds
    [INFO] Finished at: Wed Aug 22 08:16:48 UTC 2012
    [INFO] Final Memory: 21M/51M
    [INFO] ------------------------------------------------------------------------
    ---------------------------------------------

    To subscribe to this information via syndicated feeds:
    - RSS: http://vmgump.apache.org/gump/public/turbine-fulcrum/fulcrum-security-memory/rss.xml
    - Atom: http://vmgump.apache.org/gump/public/turbine-fulcrum/fulcrum-security-memory/atom.xml

    ============================== Gump Tracking Only ===
    Produced by Apache Gump(TM) version 2.3.
    Gump Run 06000622082012, vmgump.apache.org:vmgump:06000622082012
    Gump E-mail Identifier (unique within run) #20.

    --
    Apache Gump
    http://gump.apache.org/ [Instance: vmgump]

    ---------------------------------------------------------------------
    To unsubscribe, e-mail: dev-unsubscribe@turbine.apache.org
    For additional commands, e-mail: dev-help@turbine.apache.org
  • Anonymous at Aug 23, 2012 at 2:08 am
    To whom it may engage...

    This is an automated request, but not an unsolicited one. For
    more information please visit http://gump.apache.org/nagged.html,
    and/or contact the folk at general@gump.apache.org.

    Project fulcrum-security-memory has an issue affecting its community integration.
    This issue affects 2 projects,
    and has been outstanding for 28 runs.
    The current state of this project is 'Failed', with reason 'Build Failed'.
    For reference only, the following projects are affected by this:
    - fulcrum-security-memory : Services Framework
    - fulcrum_fulcrum-security-memory : Services Framework


    Full details are available at:
    http://vmgump.apache.org/gump/public/turbine-fulcrum/fulcrum-security-memory/index.html

    That said, some information snippets are provided here.

    The following annotations (debug/informational/warning/error messages) were provided:
    -DEBUG- Sole jar output [fulcrum-security-memory-*[0-9T].jar] identifier set to project name
    -DEBUG- (Apache Gump generated) Apache Maven Settings in: /srv/gump/public/workspace/turbine-fulcrum/security/memory/gump_mvn_settings.xml
    -INFO- Failed with reason build failed
    -DEBUG- Maven POM in: /srv/gump/public/workspace/turbine-fulcrum/security/memory/pom.xml
    -INFO- Failed to extract fallback artifacts from Gump Repository



    The following work was performed:
    http://vmgump.apache.org/gump/public/turbine-fulcrum/fulcrum-security-memory/gump_work/build_turbine-fulcrum_fulcrum-security-memory.html
    Work Name: build_turbine-fulcrum_fulcrum-security-memory (Type: Build)
    Work ended in a state of : Failed
    Elapsed: 23 secs
    Command Line: /opt/maven2/bin/mvn --batch-mode --settings /srv/gump/public/workspace/turbine-fulcrum/security/memory/gump_mvn_settings.xml package
    [Working Directory: /srv/gump/public/workspace/turbine-fulcrum/security/memory]
    M2_HOME: /opt/maven2
    ---------------------------------------------
    [DEBUG] LogEnabled.enableLogging() for userManager
    [DEBUG] Serviceable.service() for userManager
    [DEBUG] Configurable.configure() for userManager
    [DEBUG] Incarnating the service groupManager
    [DEBUG] Instantiating the implementation class for groupManager
    [DEBUG] Incarnating the service groupManager
    [DEBUG] LogEnabled.enableLogging() for groupManager
    [DEBUG] Serviceable.service() for groupManager
    [DEBUG] Configurable.configure() for groupManager
    [DEBUG] Incarnating the service modelManager
    [DEBUG] Instantiating the implementation class for modelManager
    [DEBUG] Incarnating the service modelManager
    [DEBUG] LogEnabled.enableLogging() for modelManager
    [DEBUG] Serviceable.service() for modelManager
    [DEBUG] Incarnating the service authenticator
    [DEBUG] Instantiating the implementation class for authenticator
    [DEBUG] Incarnating the service authenticator
    [DEBUG] LogEnabled.enableLogging() for authenticator
    [DEBUG] Incarnating the service aclFactory
    [DEBUG] Instantiating the implementation class for aclFactory
    [DEBUG] Incarnating the service aclFactory
    [DEBUG] LogEnabled.enableLogging() for aclFactory
    [DEBUG] Serviceable.service() for aclFactory
    [DEBUG] YAAFI Avalon Service Container is up and running
    [INFO] YaffiContainer ready.
    [DEBUG] Located the service 'org.apache.fulcrum.security.SecurityService' in the local container
    [DEBUG] Located the service 'org.apache.fulcrum.security.GroupManager' in the local container
    Tests run: 12, Failures: 0, Errors: 2, Skipped: 0, Time elapsed: 0.82 sec <<< FAILURE!

    Results :

    Tests in error:
    testGetGroup(org.apache.fulcrum.security.memory.basic.MemoryGroupManagerTest)
    testGetGroupByName(org.apache.fulcrum.security.memory.basic.MemoryGroupManagerTest)

    Tests run: 118, Failures: 0, Errors: 17, Skipped: 0

    [INFO] ------------------------------------------------------------------------
    [ERROR] BUILD FAILURE
    [INFO] ------------------------------------------------------------------------
    [INFO] There are test failures.

    Please refer to /srv/gump/public/workspace/turbine-fulcrum/security/memory/target/surefire-reports for the individual test results.
    [INFO] ------------------------------------------------------------------------
    [INFO] For more information, run Maven with the -e switch
    [INFO] ------------------------------------------------------------------------
    [INFO] Total time: 22 seconds
    [INFO] Finished at: Thu Aug 23 02:08:08 UTC 2012
    [INFO] Final Memory: 21M/51M
    [INFO] ------------------------------------------------------------------------
    ---------------------------------------------

    To subscribe to this information via syndicated feeds:
    - RSS: http://vmgump.apache.org/gump/public/turbine-fulcrum/fulcrum-security-memory/rss.xml
    - Atom: http://vmgump.apache.org/gump/public/turbine-fulcrum/fulcrum-security-memory/atom.xml

    ============================== Gump Tracking Only ===
    Produced by Apache Gump(TM) version 2.3.
    Gump Run 09000023082012, vmgump.apache.org:vmgump:09000023082012
    Gump E-mail Identifier (unique within run) #20.

    --
    Apache Gump
    http://gump.apache.org/ [Instance: vmgump]

    ---------------------------------------------------------------------
    To unsubscribe, e-mail: dev-unsubscribe@turbine.apache.org
    For additional commands, e-mail: dev-help@turbine.apache.org
  • Thomas Vandahl at Aug 26, 2012 at 7:01 pm
    Hi General Gump,
    On 23.08.12 02:08, fulcrum-security-memory development wrote:
    Tests run: 12, Failures: 0, Errors: 2, Skipped: 0, Time elapsed: 0.82 sec <<< FAILURE!

    Results :

    Tests in error:
    testGetGroup(org.apache.fulcrum.security.memory.basic.MemoryGroupManagerTest)
    testGetGroupByName(org.apache.fulcrum.security.memory.basic.MemoryGroupManagerTest)

    Tests run: 118, Failures: 0, Errors: 17, Skipped: 0
    Any chance to get access to the target directory of the build? No idea
    why the tests fail.

    Bye, Thomas.


    ---------------------------------------------------------------------
    To unsubscribe, e-mail: dev-unsubscribe@turbine.apache.org
    For additional commands, e-mail: dev-help@turbine.apache.org
  • Anonymous at Aug 24, 2012 at 2:11 am
    To whom it may engage...

    This is an automated request, but not an unsolicited one. For
    more information please visit http://gump.apache.org/nagged.html,
    and/or contact the folk at general@gump.apache.org.

    Project fulcrum-security-memory has an issue affecting its community integration.
    This issue affects 2 projects,
    and has been outstanding for 30 runs.
    The current state of this project is 'Failed', with reason 'Build Failed'.
    For reference only, the following projects are affected by this:
    - fulcrum-security-memory : Services Framework
    - fulcrum_fulcrum-security-memory : Services Framework


    Full details are available at:
    http://vmgump.apache.org/gump/public/turbine-fulcrum/fulcrum-security-memory/index.html

    That said, some information snippets are provided here.

    The following annotations (debug/informational/warning/error messages) were provided:
    -DEBUG- Sole jar output [fulcrum-security-memory-*[0-9T].jar] identifier set to project name
    -DEBUG- (Apache Gump generated) Apache Maven Settings in: /srv/gump/public/workspace/turbine-fulcrum/security/memory/gump_mvn_settings.xml
    -INFO- Failed with reason build failed
    -DEBUG- Maven POM in: /srv/gump/public/workspace/turbine-fulcrum/security/memory/pom.xml
    -INFO- Failed to extract fallback artifacts from Gump Repository



    The following work was performed:
    http://vmgump.apache.org/gump/public/turbine-fulcrum/fulcrum-security-memory/gump_work/build_turbine-fulcrum_fulcrum-security-memory.html
    Work Name: build_turbine-fulcrum_fulcrum-security-memory (Type: Build)
    Work ended in a state of : Failed
    Elapsed: 22 secs
    Command Line: /opt/maven2/bin/mvn --batch-mode --settings /srv/gump/public/workspace/turbine-fulcrum/security/memory/gump_mvn_settings.xml package
    [Working Directory: /srv/gump/public/workspace/turbine-fulcrum/security/memory]
    M2_HOME: /opt/maven2
    ---------------------------------------------
    [DEBUG] LogEnabled.enableLogging() for userManager
    [DEBUG] Serviceable.service() for userManager
    [DEBUG] Configurable.configure() for userManager
    [DEBUG] Incarnating the service groupManager
    [DEBUG] Instantiating the implementation class for groupManager
    [DEBUG] Incarnating the service groupManager
    [DEBUG] LogEnabled.enableLogging() for groupManager
    [DEBUG] Serviceable.service() for groupManager
    [DEBUG] Configurable.configure() for groupManager
    [DEBUG] Incarnating the service modelManager
    [DEBUG] Instantiating the implementation class for modelManager
    [DEBUG] Incarnating the service modelManager
    [DEBUG] LogEnabled.enableLogging() for modelManager
    [DEBUG] Serviceable.service() for modelManager
    [DEBUG] Incarnating the service authenticator
    [DEBUG] Instantiating the implementation class for authenticator
    [DEBUG] Incarnating the service authenticator
    [DEBUG] LogEnabled.enableLogging() for authenticator
    [DEBUG] Incarnating the service aclFactory
    [DEBUG] Instantiating the implementation class for aclFactory
    [DEBUG] Incarnating the service aclFactory
    [DEBUG] LogEnabled.enableLogging() for aclFactory
    [DEBUG] Serviceable.service() for aclFactory
    [DEBUG] YAAFI Avalon Service Container is up and running
    [INFO] YaffiContainer ready.
    [DEBUG] Located the service 'org.apache.fulcrum.security.SecurityService' in the local container
    [DEBUG] Located the service 'org.apache.fulcrum.security.GroupManager' in the local container
    Tests run: 12, Failures: 0, Errors: 2, Skipped: 0, Time elapsed: 0.792 sec <<< FAILURE!

    Results :

    Tests in error:
    testGetGroup(org.apache.fulcrum.security.memory.basic.MemoryGroupManagerTest)
    testGetGroupByName(org.apache.fulcrum.security.memory.basic.MemoryGroupManagerTest)

    Tests run: 118, Failures: 0, Errors: 17, Skipped: 0

    [INFO] ------------------------------------------------------------------------
    [ERROR] BUILD FAILURE
    [INFO] ------------------------------------------------------------------------
    [INFO] There are test failures.

    Please refer to /srv/gump/public/workspace/turbine-fulcrum/security/memory/target/surefire-reports for the individual test results.
    [INFO] ------------------------------------------------------------------------
    [INFO] For more information, run Maven with the -e switch
    [INFO] ------------------------------------------------------------------------
    [INFO] Total time: 21 seconds
    [INFO] Finished at: Fri Aug 24 02:10:47 UTC 2012
    [INFO] Final Memory: 21M/51M
    [INFO] ------------------------------------------------------------------------
    ---------------------------------------------

    To subscribe to this information via syndicated feeds:
    - RSS: http://vmgump.apache.org/gump/public/turbine-fulcrum/fulcrum-security-memory/rss.xml
    - Atom: http://vmgump.apache.org/gump/public/turbine-fulcrum/fulcrum-security-memory/atom.xml

    ============================== Gump Tracking Only ===
    Produced by Apache Gump(TM) version 2.3.
    Gump Run 10000024082012, vmgump.apache.org:vmgump:10000024082012
    Gump E-mail Identifier (unique within run) #20.

    --
    Apache Gump
    http://gump.apache.org/ [Instance: vmgump]

    ---------------------------------------------------------------------
    To unsubscribe, e-mail: dev-unsubscribe@turbine.apache.org
    For additional commands, e-mail: dev-help@turbine.apache.org
  • Anonymous at Aug 25, 2012 at 2:13 am
    To whom it may engage...

    This is an automated request, but not an unsolicited one. For
    more information please visit http://gump.apache.org/nagged.html,
    and/or contact the folk at general@gump.apache.org.

    Project fulcrum-security-memory has an issue affecting its community integration.
    This issue affects 2 projects,
    and has been outstanding for 32 runs.
    The current state of this project is 'Failed', with reason 'Build Failed'.
    For reference only, the following projects are affected by this:
    - fulcrum-security-memory : Services Framework
    - fulcrum_fulcrum-security-memory : Services Framework


    Full details are available at:
    http://vmgump.apache.org/gump/public/turbine-fulcrum/fulcrum-security-memory/index.html

    That said, some information snippets are provided here.

    The following annotations (debug/informational/warning/error messages) were provided:
    -DEBUG- Sole jar output [fulcrum-security-memory-*[0-9T].jar] identifier set to project name
    -DEBUG- (Apache Gump generated) Apache Maven Settings in: /srv/gump/public/workspace/turbine-fulcrum/security/memory/gump_mvn_settings.xml
    -INFO- Failed with reason build failed
    -DEBUG- Maven POM in: /srv/gump/public/workspace/turbine-fulcrum/security/memory/pom.xml
    -INFO- Failed to extract fallback artifacts from Gump Repository



    The following work was performed:
    http://vmgump.apache.org/gump/public/turbine-fulcrum/fulcrum-security-memory/gump_work/build_turbine-fulcrum_fulcrum-security-memory.html
    Work Name: build_turbine-fulcrum_fulcrum-security-memory (Type: Build)
    Work ended in a state of : Failed
    Elapsed: 22 secs
    Command Line: /opt/maven2/bin/mvn --batch-mode --settings /srv/gump/public/workspace/turbine-fulcrum/security/memory/gump_mvn_settings.xml package
    [Working Directory: /srv/gump/public/workspace/turbine-fulcrum/security/memory]
    M2_HOME: /opt/maven2
    ---------------------------------------------
    [DEBUG] LogEnabled.enableLogging() for userManager
    [DEBUG] Serviceable.service() for userManager
    [DEBUG] Configurable.configure() for userManager
    [DEBUG] Incarnating the service groupManager
    [DEBUG] Instantiating the implementation class for groupManager
    [DEBUG] Incarnating the service groupManager
    [DEBUG] LogEnabled.enableLogging() for groupManager
    [DEBUG] Serviceable.service() for groupManager
    [DEBUG] Configurable.configure() for groupManager
    [DEBUG] Incarnating the service modelManager
    [DEBUG] Instantiating the implementation class for modelManager
    [DEBUG] Incarnating the service modelManager
    [DEBUG] LogEnabled.enableLogging() for modelManager
    [DEBUG] Serviceable.service() for modelManager
    [DEBUG] Incarnating the service authenticator
    [DEBUG] Instantiating the implementation class for authenticator
    [DEBUG] Incarnating the service authenticator
    [DEBUG] LogEnabled.enableLogging() for authenticator
    [DEBUG] Incarnating the service aclFactory
    [DEBUG] Instantiating the implementation class for aclFactory
    [DEBUG] Incarnating the service aclFactory
    [DEBUG] LogEnabled.enableLogging() for aclFactory
    [DEBUG] Serviceable.service() for aclFactory
    [DEBUG] YAAFI Avalon Service Container is up and running
    [INFO] YaffiContainer ready.
    [DEBUG] Located the service 'org.apache.fulcrum.security.SecurityService' in the local container
    [DEBUG] Located the service 'org.apache.fulcrum.security.GroupManager' in the local container
    Tests run: 12, Failures: 0, Errors: 2, Skipped: 0, Time elapsed: 0.79 sec <<< FAILURE!

    Results :

    Tests in error:
    testGetGroup(org.apache.fulcrum.security.memory.basic.MemoryGroupManagerTest)
    testGetGroupByName(org.apache.fulcrum.security.memory.basic.MemoryGroupManagerTest)

    Tests run: 118, Failures: 0, Errors: 17, Skipped: 0

    [INFO] ------------------------------------------------------------------------
    [ERROR] BUILD FAILURE
    [INFO] ------------------------------------------------------------------------
    [INFO] There are test failures.

    Please refer to /srv/gump/public/workspace/turbine-fulcrum/security/memory/target/surefire-reports for the individual test results.
    [INFO] ------------------------------------------------------------------------
    [INFO] For more information, run Maven with the -e switch
    [INFO] ------------------------------------------------------------------------
    [INFO] Total time: 21 seconds
    [INFO] Finished at: Sat Aug 25 02:13:02 UTC 2012
    [INFO] Final Memory: 21M/51M
    [INFO] ------------------------------------------------------------------------
    ---------------------------------------------

    To subscribe to this information via syndicated feeds:
    - RSS: http://vmgump.apache.org/gump/public/turbine-fulcrum/fulcrum-security-memory/rss.xml
    - Atom: http://vmgump.apache.org/gump/public/turbine-fulcrum/fulcrum-security-memory/atom.xml

    ============================== Gump Tracking Only ===
    Produced by Apache Gump(TM) version 2.3.
    Gump Run 12000025082012, vmgump.apache.org:vmgump:12000025082012
    Gump E-mail Identifier (unique within run) #20.

    --
    Apache Gump
    http://gump.apache.org/ [Instance: vmgump]

    ---------------------------------------------------------------------
    To unsubscribe, e-mail: dev-unsubscribe@turbine.apache.org
    For additional commands, e-mail: dev-help@turbine.apache.org
  • Anonymous at Aug 26, 2012 at 2:11 am
    To whom it may engage...

    This is an automated request, but not an unsolicited one. For
    more information please visit http://gump.apache.org/nagged.html,
    and/or contact the folk at general@gump.apache.org.

    Project fulcrum-security-memory has an issue affecting its community integration.
    This issue affects 2 projects,
    and has been outstanding for 34 runs.
    The current state of this project is 'Failed', with reason 'Build Failed'.
    For reference only, the following projects are affected by this:
    - fulcrum-security-memory : Services Framework
    - fulcrum_fulcrum-security-memory : Services Framework


    Full details are available at:
    http://vmgump.apache.org/gump/public/turbine-fulcrum/fulcrum-security-memory/index.html

    That said, some information snippets are provided here.

    The following annotations (debug/informational/warning/error messages) were provided:
    -DEBUG- Sole jar output [fulcrum-security-memory-*[0-9T].jar] identifier set to project name
    -DEBUG- (Apache Gump generated) Apache Maven Settings in: /srv/gump/public/workspace/turbine-fulcrum/security/memory/gump_mvn_settings.xml
    -INFO- Failed with reason build failed
    -DEBUG- Maven POM in: /srv/gump/public/workspace/turbine-fulcrum/security/memory/pom.xml
    -INFO- Failed to extract fallback artifacts from Gump Repository



    The following work was performed:
    http://vmgump.apache.org/gump/public/turbine-fulcrum/fulcrum-security-memory/gump_work/build_turbine-fulcrum_fulcrum-security-memory.html
    Work Name: build_turbine-fulcrum_fulcrum-security-memory (Type: Build)
    Work ended in a state of : Failed
    Elapsed: 22 secs
    Command Line: /opt/maven2/bin/mvn --batch-mode --settings /srv/gump/public/workspace/turbine-fulcrum/security/memory/gump_mvn_settings.xml package
    [Working Directory: /srv/gump/public/workspace/turbine-fulcrum/security/memory]
    M2_HOME: /opt/maven2
    ---------------------------------------------
    [DEBUG] LogEnabled.enableLogging() for userManager
    [DEBUG] Serviceable.service() for userManager
    [DEBUG] Configurable.configure() for userManager
    [DEBUG] Incarnating the service groupManager
    [DEBUG] Instantiating the implementation class for groupManager
    [DEBUG] Incarnating the service groupManager
    [DEBUG] LogEnabled.enableLogging() for groupManager
    [DEBUG] Serviceable.service() for groupManager
    [DEBUG] Configurable.configure() for groupManager
    [DEBUG] Incarnating the service modelManager
    [DEBUG] Instantiating the implementation class for modelManager
    [DEBUG] Incarnating the service modelManager
    [DEBUG] LogEnabled.enableLogging() for modelManager
    [DEBUG] Serviceable.service() for modelManager
    [DEBUG] Incarnating the service authenticator
    [DEBUG] Instantiating the implementation class for authenticator
    [DEBUG] Incarnating the service authenticator
    [DEBUG] LogEnabled.enableLogging() for authenticator
    [DEBUG] Incarnating the service aclFactory
    [DEBUG] Instantiating the implementation class for aclFactory
    [DEBUG] Incarnating the service aclFactory
    [DEBUG] LogEnabled.enableLogging() for aclFactory
    [DEBUG] Serviceable.service() for aclFactory
    [DEBUG] YAAFI Avalon Service Container is up and running
    [INFO] YaffiContainer ready.
    [DEBUG] Located the service 'org.apache.fulcrum.security.SecurityService' in the local container
    [DEBUG] Located the service 'org.apache.fulcrum.security.GroupManager' in the local container
    Tests run: 12, Failures: 0, Errors: 2, Skipped: 0, Time elapsed: 0.783 sec <<< FAILURE!

    Results :

    Tests in error:
    testGetGroup(org.apache.fulcrum.security.memory.basic.MemoryGroupManagerTest)
    testGetGroupByName(org.apache.fulcrum.security.memory.basic.MemoryGroupManagerTest)

    Tests run: 118, Failures: 0, Errors: 17, Skipped: 0

    [INFO] ------------------------------------------------------------------------
    [ERROR] BUILD FAILURE
    [INFO] ------------------------------------------------------------------------
    [INFO] There are test failures.

    Please refer to /srv/gump/public/workspace/turbine-fulcrum/security/memory/target/surefire-reports for the individual test results.
    [INFO] ------------------------------------------------------------------------
    [INFO] For more information, run Maven with the -e switch
    [INFO] ------------------------------------------------------------------------
    [INFO] Total time: 21 seconds
    [INFO] Finished at: Sun Aug 26 02:11:13 UTC 2012
    [INFO] Final Memory: 21M/51M
    [INFO] ------------------------------------------------------------------------
    ---------------------------------------------

    To subscribe to this information via syndicated feeds:
    - RSS: http://vmgump.apache.org/gump/public/turbine-fulcrum/fulcrum-security-memory/rss.xml
    - Atom: http://vmgump.apache.org/gump/public/turbine-fulcrum/fulcrum-security-memory/atom.xml

    ============================== Gump Tracking Only ===
    Produced by Apache Gump(TM) version 2.3.
    Gump Run 10000026082012, vmgump.apache.org:vmgump:10000026082012
    Gump E-mail Identifier (unique within run) #20.

    --
    Apache Gump
    http://gump.apache.org/ [Instance: vmgump]

    ---------------------------------------------------------------------
    To unsubscribe, e-mail: dev-unsubscribe@turbine.apache.org
    For additional commands, e-mail: dev-help@turbine.apache.org
  • Anonymous at Aug 27, 2012 at 2:13 am
    To whom it may engage...

    This is an automated request, but not an unsolicited one. For
    more information please visit http://gump.apache.org/nagged.html,
    and/or contact the folk at general@gump.apache.org.

    Project fulcrum-security-memory has an issue affecting its community integration.
    This issue affects 2 projects,
    and has been outstanding for 36 runs.
    The current state of this project is 'Failed', with reason 'Build Failed'.
    For reference only, the following projects are affected by this:
    - fulcrum-security-memory : Services Framework
    - fulcrum_fulcrum-security-memory : Services Framework


    Full details are available at:
    http://vmgump.apache.org/gump/public/turbine-fulcrum/fulcrum-security-memory/index.html

    That said, some information snippets are provided here.

    The following annotations (debug/informational/warning/error messages) were provided:
    -DEBUG- Sole jar output [fulcrum-security-memory-*[0-9T].jar] identifier set to project name
    -DEBUG- (Apache Gump generated) Apache Maven Settings in: /srv/gump/public/workspace/turbine-fulcrum/security/memory/gump_mvn_settings.xml
    -INFO- Failed with reason build failed
    -DEBUG- Maven POM in: /srv/gump/public/workspace/turbine-fulcrum/security/memory/pom.xml
    -INFO- Failed to extract fallback artifacts from Gump Repository



    The following work was performed:
    http://vmgump.apache.org/gump/public/turbine-fulcrum/fulcrum-security-memory/gump_work/build_turbine-fulcrum_fulcrum-security-memory.html
    Work Name: build_turbine-fulcrum_fulcrum-security-memory (Type: Build)
    Work ended in a state of : Failed
    Elapsed: 22 secs
    Command Line: /opt/maven2/bin/mvn --batch-mode --settings /srv/gump/public/workspace/turbine-fulcrum/security/memory/gump_mvn_settings.xml package
    [Working Directory: /srv/gump/public/workspace/turbine-fulcrum/security/memory]
    M2_HOME: /opt/maven2
    ---------------------------------------------
    [DEBUG] LogEnabled.enableLogging() for userManager
    [DEBUG] Serviceable.service() for userManager
    [DEBUG] Configurable.configure() for userManager
    [DEBUG] Incarnating the service groupManager
    [DEBUG] Instantiating the implementation class for groupManager
    [DEBUG] Incarnating the service groupManager
    [DEBUG] LogEnabled.enableLogging() for groupManager
    [DEBUG] Serviceable.service() for groupManager
    [DEBUG] Configurable.configure() for groupManager
    [DEBUG] Incarnating the service modelManager
    [DEBUG] Instantiating the implementation class for modelManager
    [DEBUG] Incarnating the service modelManager
    [DEBUG] LogEnabled.enableLogging() for modelManager
    [DEBUG] Serviceable.service() for modelManager
    [DEBUG] Incarnating the service authenticator
    [DEBUG] Instantiating the implementation class for authenticator
    [DEBUG] Incarnating the service authenticator
    [DEBUG] LogEnabled.enableLogging() for authenticator
    [DEBUG] Incarnating the service aclFactory
    [DEBUG] Instantiating the implementation class for aclFactory
    [DEBUG] Incarnating the service aclFactory
    [DEBUG] LogEnabled.enableLogging() for aclFactory
    [DEBUG] Serviceable.service() for aclFactory
    [DEBUG] YAAFI Avalon Service Container is up and running
    [INFO] YaffiContainer ready.
    [DEBUG] Located the service 'org.apache.fulcrum.security.SecurityService' in the local container
    [DEBUG] Located the service 'org.apache.fulcrum.security.GroupManager' in the local container
    Tests run: 12, Failures: 0, Errors: 2, Skipped: 0, Time elapsed: 0.798 sec <<< FAILURE!

    Results :

    Tests in error:
    testGetGroup(org.apache.fulcrum.security.memory.basic.MemoryGroupManagerTest)
    testGetGroupByName(org.apache.fulcrum.security.memory.basic.MemoryGroupManagerTest)

    Tests run: 118, Failures: 0, Errors: 17, Skipped: 0

    [INFO] ------------------------------------------------------------------------
    [ERROR] BUILD FAILURE
    [INFO] ------------------------------------------------------------------------
    [INFO] There are test failures.

    Please refer to /srv/gump/public/workspace/turbine-fulcrum/security/memory/target/surefire-reports for the individual test results.
    [INFO] ------------------------------------------------------------------------
    [INFO] For more information, run Maven with the -e switch
    [INFO] ------------------------------------------------------------------------
    [INFO] Total time: 21 seconds
    [INFO] Finished at: Mon Aug 27 02:12:40 UTC 2012
    [INFO] Final Memory: 21M/51M
    [INFO] ------------------------------------------------------------------------
    ---------------------------------------------

    To subscribe to this information via syndicated feeds:
    - RSS: http://vmgump.apache.org/gump/public/turbine-fulcrum/fulcrum-security-memory/rss.xml
    - Atom: http://vmgump.apache.org/gump/public/turbine-fulcrum/fulcrum-security-memory/atom.xml

    ============================== Gump Tracking Only ===
    Produced by Apache Gump(TM) version 2.3.
    Gump Run 12000027082012, vmgump.apache.org:vmgump:12000027082012
    Gump E-mail Identifier (unique within run) #20.

    --
    Apache Gump
    http://gump.apache.org/ [Instance: vmgump]

    ---------------------------------------------------------------------
    To unsubscribe, e-mail: dev-unsubscribe@turbine.apache.org
    For additional commands, e-mail: dev-help@turbine.apache.org
  • Anonymous at Aug 28, 2012 at 2:16 am
    To whom it may engage...

    This is an automated request, but not an unsolicited one. For
    more information please visit http://gump.apache.org/nagged.html,
    and/or contact the folk at general@gump.apache.org.

    Project fulcrum-security-memory has an issue affecting its community integration.
    This issue affects 2 projects,
    and has been outstanding for 38 runs.
    The current state of this project is 'Failed', with reason 'Build Failed'.
    For reference only, the following projects are affected by this:
    - fulcrum-security-memory : Services Framework
    - fulcrum_fulcrum-security-memory : Services Framework


    Full details are available at:
    http://vmgump.apache.org/gump/public/turbine-fulcrum/fulcrum-security-memory/index.html

    That said, some information snippets are provided here.

    The following annotations (debug/informational/warning/error messages) were provided:
    -DEBUG- Sole jar output [fulcrum-security-memory-*[0-9T].jar] identifier set to project name
    -DEBUG- (Apache Gump generated) Apache Maven Settings in: /srv/gump/public/workspace/turbine-fulcrum/security/memory/gump_mvn_settings.xml
    -INFO- Failed with reason build failed
    -DEBUG- Maven POM in: /srv/gump/public/workspace/turbine-fulcrum/security/memory/pom.xml
    -INFO- Failed to extract fallback artifacts from Gump Repository



    The following work was performed:
    http://vmgump.apache.org/gump/public/turbine-fulcrum/fulcrum-security-memory/gump_work/build_turbine-fulcrum_fulcrum-security-memory.html
    Work Name: build_turbine-fulcrum_fulcrum-security-memory (Type: Build)
    Work ended in a state of : Failed
    Elapsed: 23 secs
    Command Line: /opt/maven2/bin/mvn --batch-mode --settings /srv/gump/public/workspace/turbine-fulcrum/security/memory/gump_mvn_settings.xml package
    [Working Directory: /srv/gump/public/workspace/turbine-fulcrum/security/memory]
    M2_HOME: /opt/maven2
    ---------------------------------------------
    [DEBUG] LogEnabled.enableLogging() for userManager
    [DEBUG] Serviceable.service() for userManager
    [DEBUG] Configurable.configure() for userManager
    [DEBUG] Incarnating the service groupManager
    [DEBUG] Instantiating the implementation class for groupManager
    [DEBUG] Incarnating the service groupManager
    [DEBUG] LogEnabled.enableLogging() for groupManager
    [DEBUG] Serviceable.service() for groupManager
    [DEBUG] Configurable.configure() for groupManager
    [DEBUG] Incarnating the service modelManager
    [DEBUG] Instantiating the implementation class for modelManager
    [DEBUG] Incarnating the service modelManager
    [DEBUG] LogEnabled.enableLogging() for modelManager
    [DEBUG] Serviceable.service() for modelManager
    [DEBUG] Incarnating the service authenticator
    [DEBUG] Instantiating the implementation class for authenticator
    [DEBUG] Incarnating the service authenticator
    [DEBUG] LogEnabled.enableLogging() for authenticator
    [DEBUG] Incarnating the service aclFactory
    [DEBUG] Instantiating the implementation class for aclFactory
    [DEBUG] Incarnating the service aclFactory
    [DEBUG] LogEnabled.enableLogging() for aclFactory
    [DEBUG] Serviceable.service() for aclFactory
    [DEBUG] YAAFI Avalon Service Container is up and running
    [INFO] YaffiContainer ready.
    [DEBUG] Located the service 'org.apache.fulcrum.security.SecurityService' in the local container
    [DEBUG] Located the service 'org.apache.fulcrum.security.GroupManager' in the local container
    Tests run: 12, Failures: 0, Errors: 2, Skipped: 0, Time elapsed: 0.82 sec <<< FAILURE!

    Results :

    Tests in error:
    testGetGroup(org.apache.fulcrum.security.memory.basic.MemoryGroupManagerTest)
    testGetGroupByName(org.apache.fulcrum.security.memory.basic.MemoryGroupManagerTest)

    Tests run: 118, Failures: 0, Errors: 17, Skipped: 0

    [INFO] ------------------------------------------------------------------------
    [ERROR] BUILD FAILURE
    [INFO] ------------------------------------------------------------------------
    [INFO] There are test failures.

    Please refer to /srv/gump/public/workspace/turbine-fulcrum/security/memory/target/surefire-reports for the individual test results.
    [INFO] ------------------------------------------------------------------------
    [INFO] For more information, run Maven with the -e switch
    [INFO] ------------------------------------------------------------------------
    [INFO] Total time: 22 seconds
    [INFO] Finished at: Tue Aug 28 02:15:44 UTC 2012
    [INFO] Final Memory: 21M/51M
    [INFO] ------------------------------------------------------------------------
    ---------------------------------------------

    To subscribe to this information via syndicated feeds:
    - RSS: http://vmgump.apache.org/gump/public/turbine-fulcrum/fulcrum-security-memory/rss.xml
    - Atom: http://vmgump.apache.org/gump/public/turbine-fulcrum/fulcrum-security-memory/atom.xml

    ============================== Gump Tracking Only ===
    Produced by Apache Gump(TM) version 2.3.
    Gump Run 11000028082012, vmgump.apache.org:vmgump:11000028082012
    Gump E-mail Identifier (unique within run) #19.

    --
    Apache Gump
    http://gump.apache.org/ [Instance: vmgump]

    ---------------------------------------------------------------------
    To unsubscribe, e-mail: dev-unsubscribe@turbine.apache.org
    For additional commands, e-mail: dev-help@turbine.apache.org
  • Anonymous at Aug 29, 2012 at 2:14 am
    To whom it may engage...

    This is an automated request, but not an unsolicited one. For
    more information please visit http://gump.apache.org/nagged.html,
    and/or contact the folk at general@gump.apache.org.

    Project fulcrum-security-memory has an issue affecting its community integration.
    This issue affects 2 projects,
    and has been outstanding for 40 runs.
    The current state of this project is 'Failed', with reason 'Build Failed'.
    For reference only, the following projects are affected by this:
    - fulcrum-security-memory : Services Framework
    - fulcrum_fulcrum-security-memory : Services Framework


    Full details are available at:
    http://vmgump.apache.org/gump/public/turbine-fulcrum/fulcrum-security-memory/index.html

    That said, some information snippets are provided here.

    The following annotations (debug/informational/warning/error messages) were provided:
    -DEBUG- Sole jar output [fulcrum-security-memory-*[0-9T].jar] identifier set to project name
    -DEBUG- (Apache Gump generated) Apache Maven Settings in: /srv/gump/public/workspace/turbine-fulcrum/security/memory/gump_mvn_settings.xml
    -INFO- Failed with reason build failed
    -DEBUG- Maven POM in: /srv/gump/public/workspace/turbine-fulcrum/security/memory/pom.xml
    -INFO- Failed to extract fallback artifacts from Gump Repository



    The following work was performed:
    http://vmgump.apache.org/gump/public/turbine-fulcrum/fulcrum-security-memory/gump_work/build_turbine-fulcrum_fulcrum-security-memory.html
    Work Name: build_turbine-fulcrum_fulcrum-security-memory (Type: Build)
    Work ended in a state of : Failed
    Elapsed: 22 secs
    Command Line: /opt/maven2/bin/mvn --batch-mode --settings /srv/gump/public/workspace/turbine-fulcrum/security/memory/gump_mvn_settings.xml package
    [Working Directory: /srv/gump/public/workspace/turbine-fulcrum/security/memory]
    M2_HOME: /opt/maven2
    ---------------------------------------------
    [DEBUG] LogEnabled.enableLogging() for userManager
    [DEBUG] Serviceable.service() for userManager
    [DEBUG] Configurable.configure() for userManager
    [DEBUG] Incarnating the service groupManager
    [DEBUG] Instantiating the implementation class for groupManager
    [DEBUG] Incarnating the service groupManager
    [DEBUG] LogEnabled.enableLogging() for groupManager
    [DEBUG] Serviceable.service() for groupManager
    [DEBUG] Configurable.configure() for groupManager
    [DEBUG] Incarnating the service modelManager
    [DEBUG] Instantiating the implementation class for modelManager
    [DEBUG] Incarnating the service modelManager
    [DEBUG] LogEnabled.enableLogging() for modelManager
    [DEBUG] Serviceable.service() for modelManager
    [DEBUG] Incarnating the service authenticator
    [DEBUG] Instantiating the implementation class for authenticator
    [DEBUG] Incarnating the service authenticator
    [DEBUG] LogEnabled.enableLogging() for authenticator
    [DEBUG] Incarnating the service aclFactory
    [DEBUG] Instantiating the implementation class for aclFactory
    [DEBUG] Incarnating the service aclFactory
    [DEBUG] LogEnabled.enableLogging() for aclFactory
    [DEBUG] Serviceable.service() for aclFactory
    [DEBUG] YAAFI Avalon Service Container is up and running
    [INFO] YaffiContainer ready.
    [DEBUG] Located the service 'org.apache.fulcrum.security.SecurityService' in the local container
    [DEBUG] Located the service 'org.apache.fulcrum.security.GroupManager' in the local container
    Tests run: 12, Failures: 0, Errors: 2, Skipped: 0, Time elapsed: 0.799 sec <<< FAILURE!

    Results :

    Tests in error:
    testGetGroup(org.apache.fulcrum.security.memory.basic.MemoryGroupManagerTest)
    testGetGroupByName(org.apache.fulcrum.security.memory.basic.MemoryGroupManagerTest)

    Tests run: 118, Failures: 0, Errors: 17, Skipped: 0

    [INFO] ------------------------------------------------------------------------
    [ERROR] BUILD FAILURE
    [INFO] ------------------------------------------------------------------------
    [INFO] There are test failures.

    Please refer to /srv/gump/public/workspace/turbine-fulcrum/security/memory/target/surefire-reports for the individual test results.
    [INFO] ------------------------------------------------------------------------
    [INFO] For more information, run Maven with the -e switch
    [INFO] ------------------------------------------------------------------------
    [INFO] Total time: 21 seconds
    [INFO] Finished at: Wed Aug 29 02:13:44 UTC 2012
    [INFO] Final Memory: 21M/51M
    [INFO] ------------------------------------------------------------------------
    ---------------------------------------------

    To subscribe to this information via syndicated feeds:
    - RSS: http://vmgump.apache.org/gump/public/turbine-fulcrum/fulcrum-security-memory/rss.xml
    - Atom: http://vmgump.apache.org/gump/public/turbine-fulcrum/fulcrum-security-memory/atom.xml

    ============================== Gump Tracking Only ===
    Produced by Apache Gump(TM) version 2.3.
    Gump Run 13000029082012, vmgump.apache.org:vmgump:13000029082012
    Gump E-mail Identifier (unique within run) #20.

    --
    Apache Gump
    http://gump.apache.org/ [Instance: vmgump]

    ---------------------------------------------------------------------
    To unsubscribe, e-mail: dev-unsubscribe@turbine.apache.org
    For additional commands, e-mail: dev-help@turbine.apache.org
  • Anonymous at Aug 30, 2012 at 2:15 am
    To whom it may engage...

    This is an automated request, but not an unsolicited one. For
    more information please visit http://gump.apache.org/nagged.html,
    and/or contact the folk at general@gump.apache.org.

    Project fulcrum-security-memory has an issue affecting its community integration.
    This issue affects 2 projects,
    and has been outstanding for 42 runs.
    The current state of this project is 'Failed', with reason 'Build Failed'.
    For reference only, the following projects are affected by this:
    - fulcrum-security-memory : Services Framework
    - fulcrum_fulcrum-security-memory : Services Framework


    Full details are available at:
    http://vmgump.apache.org/gump/public/turbine-fulcrum/fulcrum-security-memory/index.html

    That said, some information snippets are provided here.

    The following annotations (debug/informational/warning/error messages) were provided:
    -DEBUG- Sole jar output [fulcrum-security-memory-*[0-9T].jar] identifier set to project name
    -DEBUG- (Apache Gump generated) Apache Maven Settings in: /srv/gump/public/workspace/turbine-fulcrum/security/memory/gump_mvn_settings.xml
    -INFO- Failed with reason build failed
    -DEBUG- Maven POM in: /srv/gump/public/workspace/turbine-fulcrum/security/memory/pom.xml
    -INFO- Failed to extract fallback artifacts from Gump Repository



    The following work was performed:
    http://vmgump.apache.org/gump/public/turbine-fulcrum/fulcrum-security-memory/gump_work/build_turbine-fulcrum_fulcrum-security-memory.html
    Work Name: build_turbine-fulcrum_fulcrum-security-memory (Type: Build)
    Work ended in a state of : Failed
    Elapsed: 23 secs
    Command Line: /opt/maven2/bin/mvn --batch-mode --settings /srv/gump/public/workspace/turbine-fulcrum/security/memory/gump_mvn_settings.xml package
    [Working Directory: /srv/gump/public/workspace/turbine-fulcrum/security/memory]
    M2_HOME: /opt/maven2
    ---------------------------------------------
    [DEBUG] LogEnabled.enableLogging() for userManager
    [DEBUG] Serviceable.service() for userManager
    [DEBUG] Configurable.configure() for userManager
    [DEBUG] Incarnating the service groupManager
    [DEBUG] Instantiating the implementation class for groupManager
    [DEBUG] Incarnating the service groupManager
    [DEBUG] LogEnabled.enableLogging() for groupManager
    [DEBUG] Serviceable.service() for groupManager
    [DEBUG] Configurable.configure() for groupManager
    [DEBUG] Incarnating the service modelManager
    [DEBUG] Instantiating the implementation class for modelManager
    [DEBUG] Incarnating the service modelManager
    [DEBUG] LogEnabled.enableLogging() for modelManager
    [DEBUG] Serviceable.service() for modelManager
    [DEBUG] Incarnating the service authenticator
    [DEBUG] Instantiating the implementation class for authenticator
    [DEBUG] Incarnating the service authenticator
    [DEBUG] LogEnabled.enableLogging() for authenticator
    [DEBUG] Incarnating the service aclFactory
    [DEBUG] Instantiating the implementation class for aclFactory
    [DEBUG] Incarnating the service aclFactory
    [DEBUG] LogEnabled.enableLogging() for aclFactory
    [DEBUG] Serviceable.service() for aclFactory
    [DEBUG] YAAFI Avalon Service Container is up and running
    [INFO] YaffiContainer ready.
    [DEBUG] Located the service 'org.apache.fulcrum.security.SecurityService' in the local container
    [DEBUG] Located the service 'org.apache.fulcrum.security.GroupManager' in the local container
    Tests run: 12, Failures: 0, Errors: 2, Skipped: 0, Time elapsed: 0.859 sec <<< FAILURE!

    Results :

    Tests in error:
    testGetGroup(org.apache.fulcrum.security.memory.basic.MemoryGroupManagerTest)
    testGetGroupByName(org.apache.fulcrum.security.memory.basic.MemoryGroupManagerTest)

    Tests run: 118, Failures: 0, Errors: 17, Skipped: 0

    [INFO] ------------------------------------------------------------------------
    [ERROR] BUILD FAILURE
    [INFO] ------------------------------------------------------------------------
    [INFO] There are test failures.

    Please refer to /srv/gump/public/workspace/turbine-fulcrum/security/memory/target/surefire-reports for the individual test results.
    [INFO] ------------------------------------------------------------------------
    [INFO] For more information, run Maven with the -e switch
    [INFO] ------------------------------------------------------------------------
    [INFO] Total time: 22 seconds
    [INFO] Finished at: Thu Aug 30 02:14:49 UTC 2012
    [INFO] Final Memory: 21M/51M
    [INFO] ------------------------------------------------------------------------
    ---------------------------------------------

    To subscribe to this information via syndicated feeds:
    - RSS: http://vmgump.apache.org/gump/public/turbine-fulcrum/fulcrum-security-memory/rss.xml
    - Atom: http://vmgump.apache.org/gump/public/turbine-fulcrum/fulcrum-security-memory/atom.xml

    ============================== Gump Tracking Only ===
    Produced by Apache Gump(TM) version 2.3.
    Gump Run 11000030082012, vmgump.apache.org:vmgump:11000030082012
    Gump E-mail Identifier (unique within run) #20.

    --
    Apache Gump
    http://gump.apache.org/ [Instance: vmgump]

    ---------------------------------------------------------------------
    To unsubscribe, e-mail: dev-unsubscribe@turbine.apache.org
    For additional commands, e-mail: dev-help@turbine.apache.org

Related Discussions

Discussion Navigation
viewthread | post
Discussion Overview
groupdev @
categoriesturbine
postedAug 9, '12 at 8:19a
activeAug 30, '12 at 2:15a
posts23
users2
websiteturbine.apache.org

2 users in discussion

Anonymous: 22 posts Thomas Vandahl: 1 post

People

Translate

site design / logo © 2018 Grokbase