FAQ
To whom it may engage...

This is an automated request, but not an unsolicited one. For
more information please visit http://gump.apache.org/nagged.html,
and/or contact the folk at general@gump.apache.org.

Project fulcrum-security-api has an issue affecting its community integration.
This issue affects 2 projects,
and has been outstanding for 440 runs.
The current state of this project is 'Failed', with reason 'Build Failed'.
For reference only, the following projects are affected by this:
- fulcrum-security-api : Services Framework
- fulcrum_fulcrum-security-api : Services Framework


Full details are available at:
http://vmgump.apache.org/gump/public/turbine-fulcrum/fulcrum-security-api/index.html

That said, some information snippets are provided here.

The following annotations (debug/informational/warning/error messages) were provided:
-DEBUG- Sole jar output [fulcrum-security-api-*[0-9T].jar] identifier set to project name
-DEBUG- Sole testsjar output [fulcrum-security-api-*[0-9T]-tests.jar] identifier set to project name
-DEBUG- (Apache Gump generated) Apache Maven Settings in: /srv/gump/public/workspace/turbine-fulcrum/security/api/gump_mvn_settings.xml
-INFO- Failed with reason build failed
-DEBUG- Maven POM in: /srv/gump/public/workspace/turbine-fulcrum/security/api/pom.xml
-INFO- Failed to extract fallback artifacts from Gump Repository



The following work was performed:
http://vmgump.apache.org/gump/public/turbine-fulcrum/fulcrum-security-api/gump_work/build_turbine-fulcrum_fulcrum-security-api.html
Work Name: build_turbine-fulcrum_fulcrum-security-api (Type: Build)
Work ended in a state of : Failed
Elapsed: 12 secs
Command Line: /opt/maven2/bin/mvn --batch-mode --settings /srv/gump/public/workspace/turbine-fulcrum/security/api/gump_mvn_settings.xml package
[Working Directory: /srv/gump/public/workspace/turbine-fulcrum/security/api]
M2_HOME: /opt/maven2
---------------------------------------------
[DEBUG] Incarnating the service crypto
[DEBUG] Instantiating the implementation class for crypto
[DEBUG] Incarnating the service crypto
[DEBUG] LogEnabled.enableLogging() for crypto
[DEBUG] Configurable.configure() for crypto
[DEBUG] Initializable.initialize() for crypto
[DEBUG] initialize()
[DEBUG] Incarnating the service authenticator
[DEBUG] Instantiating the implementation class for authenticator
[DEBUG] Incarnating the service authenticator
[DEBUG] LogEnabled.enableLogging() for authenticator
[DEBUG] Serviceable.service() for authenticator
[DEBUG] Located the service 'org.apache.fulcrum.crypto.CryptoService' in the local container
[DEBUG] Configurable.configure() for authenticator
[DEBUG] YAAFI Avalon Service Container is up and running
[INFO] YaffiContainer ready.
[DEBUG] Located the service 'org.apache.fulcrum.security.authenticator.Authenticator' in the local container
[DEBUG] Disposing of container...
[DEBUG] Disposing all services
[DEBUG] Decommision the service authenticator
[DEBUG] Decommisioning the service authenticator
[DEBUG] Disposable.dispose() for authenticator
[DEBUG] Decommision the service crypto
[DEBUG] Decommisioning the service crypto
[DEBUG] Disposing the service authenticator
[DEBUG] Disposing the service crypto
[DEBUG] All services are disposed
[INFO] YaffiContainer has been disposed.
Tests run: 1, Failures: 0, Errors: 0, Skipped: 0, Time elapsed: 0.064 sec

Results :

Tests in error:
testContainsName(org.apache.fulcrum.security.util.SecuritySetTest)

Tests run: 18, Failures: 0, Errors: 1, Skipped: 0

[INFO] ------------------------------------------------------------------------
[ERROR] BUILD FAILURE
[INFO] ------------------------------------------------------------------------
[INFO] There are test failures.

Please refer to /srv/gump/public/workspace/turbine-fulcrum/security/api/target/surefire-reports for the individual test results.
[INFO] ------------------------------------------------------------------------
[INFO] For more information, run Maven with the -e switch
[INFO] ------------------------------------------------------------------------
[INFO] Total time: 11 seconds
[INFO] Finished at: Wed Aug 08 07:28:12 UTC 2012
[INFO] Final Memory: 21M/52M
[INFO] ------------------------------------------------------------------------
---------------------------------------------

To subscribe to this information via syndicated feeds:
- RSS: http://vmgump.apache.org/gump/public/turbine-fulcrum/fulcrum-security-api/rss.xml
- Atom: http://vmgump.apache.org/gump/public/turbine-fulcrum/fulcrum-security-api/atom.xml

============================== Gump Tracking Only ===
Produced by Apache Gump(TM) version 2.3.
Gump Run 06000608082012, vmgump.apache.org:vmgump:06000608082012
Gump E-mail Identifier (unique within run) #15.

--
Apache Gump
http://gump.apache.org/ [Instance: vmgump]

---------------------------------------------------------------------
To unsubscribe, e-mail: dev-unsubscribe@turbine.apache.org
For additional commands, e-mail: dev-help@turbine.apache.org

Search Discussions

  • Anonymous at Aug 8, 2012 at 7:24 pm
    To whom it may engage...

    This is an automated request, but not an unsolicited one. For
    more information please visit http://gump.apache.org/nagged.html,
    and/or contact the folk at general@gump.apache.org.

    Project fulcrum-security-api has an issue affecting its community integration.
    This issue affects 2 projects.
    The current state of this project is 'Failed', with reason 'Build Failed'.
    For reference only, the following projects are affected by this:
    - fulcrum-security-api : Services Framework
    - fulcrum_fulcrum-security-api : Services Framework


    Full details are available at:
    http://vmgump.apache.org/gump/public/turbine-fulcrum/fulcrum-security-api/index.html

    That said, some information snippets are provided here.

    The following annotations (debug/informational/warning/error messages) were provided:
    -DEBUG- Sole jar output [fulcrum-security-api-*[0-9T].jar] identifier set to project name
    -DEBUG- Sole testsjar output [fulcrum-security-api-*[0-9T]-tests.jar] identifier set to project name
    -DEBUG- (Apache Gump generated) Apache Maven Settings in: /srv/gump/public/workspace/turbine-fulcrum/security/api/gump_mvn_settings.xml
    -INFO- Failed with reason build failed
    -DEBUG- Maven POM in: /srv/gump/public/workspace/turbine-fulcrum/security/api/pom.xml
    -INFO- Failed to extract fallback artifacts from Gump Repository



    The following work was performed:
    http://vmgump.apache.org/gump/public/turbine-fulcrum/fulcrum-security-api/gump_work/build_turbine-fulcrum_fulcrum-security-api.html
    Work Name: build_turbine-fulcrum_fulcrum-security-api (Type: Build)
    Work ended in a state of : Failed
    Elapsed: 13 secs
    Command Line: /opt/maven2/bin/mvn --batch-mode --settings /srv/gump/public/workspace/turbine-fulcrum/security/api/gump_mvn_settings.xml package
    [Working Directory: /srv/gump/public/workspace/turbine-fulcrum/security/api]
    M2_HOME: /opt/maven2
    ---------------------------------------------
    [DEBUG] Incarnating the service crypto
    [DEBUG] Instantiating the implementation class for crypto
    [DEBUG] Incarnating the service crypto
    [DEBUG] LogEnabled.enableLogging() for crypto
    [DEBUG] Configurable.configure() for crypto
    [DEBUG] Initializable.initialize() for crypto
    [DEBUG] initialize()
    [DEBUG] Incarnating the service authenticator
    [DEBUG] Instantiating the implementation class for authenticator
    [DEBUG] Incarnating the service authenticator
    [DEBUG] LogEnabled.enableLogging() for authenticator
    [DEBUG] Serviceable.service() for authenticator
    [DEBUG] Located the service 'org.apache.fulcrum.crypto.CryptoService' in the local container
    [DEBUG] Configurable.configure() for authenticator
    [DEBUG] YAAFI Avalon Service Container is up and running
    [INFO] YaffiContainer ready.
    [DEBUG] Located the service 'org.apache.fulcrum.security.authenticator.Authenticator' in the local container
    [DEBUG] Disposing of container...
    [DEBUG] Disposing all services
    [DEBUG] Decommision the service authenticator
    [DEBUG] Decommisioning the service authenticator
    [DEBUG] Disposable.dispose() for authenticator
    [DEBUG] Decommision the service crypto
    [DEBUG] Decommisioning the service crypto
    [DEBUG] Disposing the service authenticator
    [DEBUG] Disposing the service crypto
    [DEBUG] All services are disposed
    [INFO] YaffiContainer has been disposed.
    Tests run: 1, Failures: 0, Errors: 0, Skipped: 0, Time elapsed: 0.063 sec

    Results :

    Tests in error:
    testContainsName(org.apache.fulcrum.security.util.SecuritySetTest)

    Tests run: 18, Failures: 0, Errors: 1, Skipped: 0

    [INFO] ------------------------------------------------------------------------
    [ERROR] BUILD FAILURE
    [INFO] ------------------------------------------------------------------------
    [INFO] There are test failures.

    Please refer to /srv/gump/public/workspace/turbine-fulcrum/security/api/target/surefire-reports for the individual test results.
    [INFO] ------------------------------------------------------------------------
    [INFO] For more information, run Maven with the -e switch
    [INFO] ------------------------------------------------------------------------
    [INFO] Total time: 11 seconds
    [INFO] Finished at: Wed Aug 08 19:23:38 UTC 2012
    [INFO] Final Memory: 22M/52M
    [INFO] ------------------------------------------------------------------------
    ---------------------------------------------

    To subscribe to this information via syndicated feeds:
    - RSS: http://vmgump.apache.org/gump/public/turbine-fulcrum/fulcrum-security-api/rss.xml
    - Atom: http://vmgump.apache.org/gump/public/turbine-fulcrum/fulcrum-security-api/atom.xml

    ============================== Gump Tracking Only ===
    Produced by Apache Gump(TM) version 2.3.
    Gump Run 06001808082012, vmgump.apache.org:vmgump:06001808082012
    Gump E-mail Identifier (unique within run) #7.

    --
    Apache Gump
    http://gump.apache.org/ [Instance: vmgump]

    ---------------------------------------------------------------------
    To unsubscribe, e-mail: dev-unsubscribe@turbine.apache.org
    For additional commands, e-mail: dev-help@turbine.apache.org
  • Anonymous at Aug 9, 2012 at 7:37 am
    To whom it may engage...

    This is an automated request, but not an unsolicited one. For
    more information please visit http://gump.apache.org/nagged.html,
    and/or contact the folk at general@gump.apache.org.

    Project fulcrum-security-api has an issue affecting its community integration.
    This issue affects 2 projects,
    and has been outstanding for 2 runs.
    The current state of this project is 'Failed', with reason 'Build Failed'.
    For reference only, the following projects are affected by this:
    - fulcrum-security-api : Services Framework
    - fulcrum_fulcrum-security-api : Services Framework


    Full details are available at:
    http://vmgump.apache.org/gump/public/turbine-fulcrum/fulcrum-security-api/index.html

    That said, some information snippets are provided here.

    The following annotations (debug/informational/warning/error messages) were provided:
    -DEBUG- Sole jar output [fulcrum-security-api-*[0-9T].jar] identifier set to project name
    -DEBUG- Sole testsjar output [fulcrum-security-api-*[0-9T]-tests.jar] identifier set to project name
    -DEBUG- (Apache Gump generated) Apache Maven Settings in: /srv/gump/public/workspace/turbine-fulcrum/security/api/gump_mvn_settings.xml
    -INFO- Failed with reason build failed
    -DEBUG- Maven POM in: /srv/gump/public/workspace/turbine-fulcrum/security/api/pom.xml
    -INFO- Failed to extract fallback artifacts from Gump Repository



    The following work was performed:
    http://vmgump.apache.org/gump/public/turbine-fulcrum/fulcrum-security-api/gump_work/build_turbine-fulcrum_fulcrum-security-api.html
    Work Name: build_turbine-fulcrum_fulcrum-security-api (Type: Build)
    Work ended in a state of : Failed
    Elapsed: 15 secs
    Command Line: /opt/maven2/bin/mvn --batch-mode --settings /srv/gump/public/workspace/turbine-fulcrum/security/api/gump_mvn_settings.xml package
    [Working Directory: /srv/gump/public/workspace/turbine-fulcrum/security/api]
    M2_HOME: /opt/maven2
    ---------------------------------------------
    [DEBUG] Incarnating the service crypto
    [DEBUG] Instantiating the implementation class for crypto
    [DEBUG] Incarnating the service crypto
    [DEBUG] LogEnabled.enableLogging() for crypto
    [DEBUG] Configurable.configure() for crypto
    [DEBUG] Initializable.initialize() for crypto
    [DEBUG] initialize()
    [DEBUG] Incarnating the service authenticator
    [DEBUG] Instantiating the implementation class for authenticator
    [DEBUG] Incarnating the service authenticator
    [DEBUG] LogEnabled.enableLogging() for authenticator
    [DEBUG] Serviceable.service() for authenticator
    [DEBUG] Located the service 'org.apache.fulcrum.crypto.CryptoService' in the local container
    [DEBUG] Configurable.configure() for authenticator
    [DEBUG] YAAFI Avalon Service Container is up and running
    [INFO] YaffiContainer ready.
    [DEBUG] Located the service 'org.apache.fulcrum.security.authenticator.Authenticator' in the local container
    [DEBUG] Disposing of container...
    [DEBUG] Disposing all services
    [DEBUG] Decommision the service authenticator
    [DEBUG] Decommisioning the service authenticator
    [DEBUG] Disposable.dispose() for authenticator
    [DEBUG] Decommision the service crypto
    [DEBUG] Decommisioning the service crypto
    [DEBUG] Disposing the service authenticator
    [DEBUG] Disposing the service crypto
    [DEBUG] All services are disposed
    [INFO] YaffiContainer has been disposed.
    Tests run: 1, Failures: 0, Errors: 0, Skipped: 0, Time elapsed: 0.086 sec

    Results :

    Tests in error:
    testContainsName(org.apache.fulcrum.security.util.SecuritySetTest)

    Tests run: 18, Failures: 0, Errors: 1, Skipped: 0

    [INFO] ------------------------------------------------------------------------
    [ERROR] BUILD FAILURE
    [INFO] ------------------------------------------------------------------------
    [INFO] There are test failures.

    Please refer to /srv/gump/public/workspace/turbine-fulcrum/security/api/target/surefire-reports for the individual test results.
    [INFO] ------------------------------------------------------------------------
    [INFO] For more information, run Maven with the -e switch
    [INFO] ------------------------------------------------------------------------
    [INFO] Total time: 14 seconds
    [INFO] Finished at: Thu Aug 09 07:37:24 UTC 2012
    [INFO] Final Memory: 21M/52M
    [INFO] ------------------------------------------------------------------------
    ---------------------------------------------

    To subscribe to this information via syndicated feeds:
    - RSS: http://vmgump.apache.org/gump/public/turbine-fulcrum/fulcrum-security-api/rss.xml
    - Atom: http://vmgump.apache.org/gump/public/turbine-fulcrum/fulcrum-security-api/atom.xml

    ============================== Gump Tracking Only ===
    Produced by Apache Gump(TM) version 2.3.
    Gump Run 07000609082012, vmgump.apache.org:vmgump:07000609082012
    Gump E-mail Identifier (unique within run) #16.

    --
    Apache Gump
    http://gump.apache.org/ [Instance: vmgump]

    ---------------------------------------------------------------------
    To unsubscribe, e-mail: dev-unsubscribe@turbine.apache.org
    For additional commands, e-mail: dev-help@turbine.apache.org
  • Anonymous at Aug 10, 2012 at 7:29 am
    To whom it may engage...

    This is an automated request, but not an unsolicited one. For
    more information please visit http://gump.apache.org/nagged.html,
    and/or contact the folk at general@gump.apache.org.

    Project fulcrum-security-api has an issue affecting its community integration.
    This issue affects 2 projects,
    and has been outstanding for 4 runs.
    The current state of this project is 'Failed', with reason 'Build Failed'.
    For reference only, the following projects are affected by this:
    - fulcrum-security-api : Services Framework
    - fulcrum_fulcrum-security-api : Services Framework


    Full details are available at:
    http://vmgump.apache.org/gump/public/turbine-fulcrum/fulcrum-security-api/index.html

    That said, some information snippets are provided here.

    The following annotations (debug/informational/warning/error messages) were provided:
    -DEBUG- Sole jar output [fulcrum-security-api-*[0-9T].jar] identifier set to project name
    -DEBUG- Sole testsjar output [fulcrum-security-api-*[0-9T]-tests.jar] identifier set to project name
    -DEBUG- (Apache Gump generated) Apache Maven Settings in: /srv/gump/public/workspace/turbine-fulcrum/security/api/gump_mvn_settings.xml
    -INFO- Failed with reason build failed
    -DEBUG- Maven POM in: /srv/gump/public/workspace/turbine-fulcrum/security/api/pom.xml
    -INFO- Failed to extract fallback artifacts from Gump Repository



    The following work was performed:
    http://vmgump.apache.org/gump/public/turbine-fulcrum/fulcrum-security-api/gump_work/build_turbine-fulcrum_fulcrum-security-api.html
    Work Name: build_turbine-fulcrum_fulcrum-security-api (Type: Build)
    Work ended in a state of : Failed
    Elapsed: 14 secs
    Command Line: /opt/maven2/bin/mvn --batch-mode --settings /srv/gump/public/workspace/turbine-fulcrum/security/api/gump_mvn_settings.xml package
    [Working Directory: /srv/gump/public/workspace/turbine-fulcrum/security/api]
    M2_HOME: /opt/maven2
    ---------------------------------------------
    [DEBUG] Incarnating the service crypto
    [DEBUG] Instantiating the implementation class for crypto
    [DEBUG] Incarnating the service crypto
    [DEBUG] LogEnabled.enableLogging() for crypto
    [DEBUG] Configurable.configure() for crypto
    [DEBUG] Initializable.initialize() for crypto
    [DEBUG] initialize()
    [DEBUG] Incarnating the service authenticator
    [DEBUG] Instantiating the implementation class for authenticator
    [DEBUG] Incarnating the service authenticator
    [DEBUG] LogEnabled.enableLogging() for authenticator
    [DEBUG] Serviceable.service() for authenticator
    [DEBUG] Located the service 'org.apache.fulcrum.crypto.CryptoService' in the local container
    [DEBUG] Configurable.configure() for authenticator
    [DEBUG] YAAFI Avalon Service Container is up and running
    [INFO] YaffiContainer ready.
    [DEBUG] Located the service 'org.apache.fulcrum.security.authenticator.Authenticator' in the local container
    [DEBUG] Disposing of container...
    [DEBUG] Disposing all services
    [DEBUG] Decommision the service authenticator
    [DEBUG] Decommisioning the service authenticator
    [DEBUG] Disposable.dispose() for authenticator
    [DEBUG] Decommision the service crypto
    [DEBUG] Decommisioning the service crypto
    [DEBUG] Disposing the service authenticator
    [DEBUG] Disposing the service crypto
    [DEBUG] All services are disposed
    [INFO] YaffiContainer has been disposed.
    Tests run: 1, Failures: 0, Errors: 0, Skipped: 0, Time elapsed: 0.064 sec

    Results :

    Tests in error:
    testContainsName(org.apache.fulcrum.security.util.SecuritySetTest)

    Tests run: 18, Failures: 0, Errors: 1, Skipped: 0

    [INFO] ------------------------------------------------------------------------
    [ERROR] BUILD FAILURE
    [INFO] ------------------------------------------------------------------------
    [INFO] There are test failures.

    Please refer to /srv/gump/public/workspace/turbine-fulcrum/security/api/target/surefire-reports for the individual test results.
    [INFO] ------------------------------------------------------------------------
    [INFO] For more information, run Maven with the -e switch
    [INFO] ------------------------------------------------------------------------
    [INFO] Total time: 13 seconds
    [INFO] Finished at: Fri Aug 10 07:29:16 UTC 2012
    [INFO] Final Memory: 21M/52M
    [INFO] ------------------------------------------------------------------------
    ---------------------------------------------

    To subscribe to this information via syndicated feeds:
    - RSS: http://vmgump.apache.org/gump/public/turbine-fulcrum/fulcrum-security-api/rss.xml
    - Atom: http://vmgump.apache.org/gump/public/turbine-fulcrum/fulcrum-security-api/atom.xml

    ============================== Gump Tracking Only ===
    Produced by Apache Gump(TM) version 2.3.
    Gump Run 06000610082012, vmgump.apache.org:vmgump:06000610082012
    Gump E-mail Identifier (unique within run) #16.

    --
    Apache Gump
    http://gump.apache.org/ [Instance: vmgump]

    ---------------------------------------------------------------------
    To unsubscribe, e-mail: dev-unsubscribe@turbine.apache.org
    For additional commands, e-mail: dev-help@turbine.apache.org
  • Anonymous at Aug 11, 2012 at 7:27 am
    To whom it may engage...

    This is an automated request, but not an unsolicited one. For
    more information please visit http://gump.apache.org/nagged.html,
    and/or contact the folk at general@gump.apache.org.

    Project fulcrum-security-api has an issue affecting its community integration.
    This issue affects 2 projects,
    and has been outstanding for 6 runs.
    The current state of this project is 'Failed', with reason 'Build Failed'.
    For reference only, the following projects are affected by this:
    - fulcrum-security-api : Services Framework
    - fulcrum_fulcrum-security-api : Services Framework


    Full details are available at:
    http://vmgump.apache.org/gump/public/turbine-fulcrum/fulcrum-security-api/index.html

    That said, some information snippets are provided here.

    The following annotations (debug/informational/warning/error messages) were provided:
    -DEBUG- Sole jar output [fulcrum-security-api-*[0-9T].jar] identifier set to project name
    -DEBUG- Sole testsjar output [fulcrum-security-api-*[0-9T]-tests.jar] identifier set to project name
    -DEBUG- (Apache Gump generated) Apache Maven Settings in: /srv/gump/public/workspace/turbine-fulcrum/security/api/gump_mvn_settings.xml
    -INFO- Failed with reason build failed
    -DEBUG- Maven POM in: /srv/gump/public/workspace/turbine-fulcrum/security/api/pom.xml
    -INFO- Failed to extract fallback artifacts from Gump Repository



    The following work was performed:
    http://vmgump.apache.org/gump/public/turbine-fulcrum/fulcrum-security-api/gump_work/build_turbine-fulcrum_fulcrum-security-api.html
    Work Name: build_turbine-fulcrum_fulcrum-security-api (Type: Build)
    Work ended in a state of : Failed
    Elapsed: 12 secs
    Command Line: /opt/maven2/bin/mvn --batch-mode --settings /srv/gump/public/workspace/turbine-fulcrum/security/api/gump_mvn_settings.xml package
    [Working Directory: /srv/gump/public/workspace/turbine-fulcrum/security/api]
    M2_HOME: /opt/maven2
    ---------------------------------------------
    [DEBUG] Incarnating the service crypto
    [DEBUG] Instantiating the implementation class for crypto
    [DEBUG] Incarnating the service crypto
    [DEBUG] LogEnabled.enableLogging() for crypto
    [DEBUG] Configurable.configure() for crypto
    [DEBUG] Initializable.initialize() for crypto
    [DEBUG] initialize()
    [DEBUG] Incarnating the service authenticator
    [DEBUG] Instantiating the implementation class for authenticator
    [DEBUG] Incarnating the service authenticator
    [DEBUG] LogEnabled.enableLogging() for authenticator
    [DEBUG] Serviceable.service() for authenticator
    [DEBUG] Located the service 'org.apache.fulcrum.crypto.CryptoService' in the local container
    [DEBUG] Configurable.configure() for authenticator
    [DEBUG] YAAFI Avalon Service Container is up and running
    [INFO] YaffiContainer ready.
    [DEBUG] Located the service 'org.apache.fulcrum.security.authenticator.Authenticator' in the local container
    [DEBUG] Disposing of container...
    [DEBUG] Disposing all services
    [DEBUG] Decommision the service authenticator
    [DEBUG] Decommisioning the service authenticator
    [DEBUG] Disposable.dispose() for authenticator
    [DEBUG] Decommision the service crypto
    [DEBUG] Decommisioning the service crypto
    [DEBUG] Disposing the service authenticator
    [DEBUG] Disposing the service crypto
    [DEBUG] All services are disposed
    [INFO] YaffiContainer has been disposed.
    Tests run: 1, Failures: 0, Errors: 0, Skipped: 0, Time elapsed: 0.063 sec

    Results :

    Tests in error:
    testContainsName(org.apache.fulcrum.security.util.SecuritySetTest)

    Tests run: 18, Failures: 0, Errors: 1, Skipped: 0

    [INFO] ------------------------------------------------------------------------
    [ERROR] BUILD FAILURE
    [INFO] ------------------------------------------------------------------------
    [INFO] There are test failures.

    Please refer to /srv/gump/public/workspace/turbine-fulcrum/security/api/target/surefire-reports for the individual test results.
    [INFO] ------------------------------------------------------------------------
    [INFO] For more information, run Maven with the -e switch
    [INFO] ------------------------------------------------------------------------
    [INFO] Total time: 11 seconds
    [INFO] Finished at: Sat Aug 11 07:26:33 UTC 2012
    [INFO] Final Memory: 21M/52M
    [INFO] ------------------------------------------------------------------------
    ---------------------------------------------

    To subscribe to this information via syndicated feeds:
    - RSS: http://vmgump.apache.org/gump/public/turbine-fulcrum/fulcrum-security-api/rss.xml
    - Atom: http://vmgump.apache.org/gump/public/turbine-fulcrum/fulcrum-security-api/atom.xml

    ============================== Gump Tracking Only ===
    Produced by Apache Gump(TM) version 2.3.
    Gump Run 05000611082012, vmgump.apache.org:vmgump:05000611082012
    Gump E-mail Identifier (unique within run) #16.

    --
    Apache Gump
    http://gump.apache.org/ [Instance: vmgump]

    ---------------------------------------------------------------------
    To unsubscribe, e-mail: dev-unsubscribe@turbine.apache.org
    For additional commands, e-mail: dev-help@turbine.apache.org
  • Anonymous at Aug 12, 2012 at 7:36 am
    To whom it may engage...

    This is an automated request, but not an unsolicited one. For
    more information please visit http://gump.apache.org/nagged.html,
    and/or contact the folk at general@gump.apache.org.

    Project fulcrum-security-api has an issue affecting its community integration.
    This issue affects 2 projects,
    and has been outstanding for 8 runs.
    The current state of this project is 'Failed', with reason 'Build Failed'.
    For reference only, the following projects are affected by this:
    - fulcrum-security-api : Services Framework
    - fulcrum_fulcrum-security-api : Services Framework


    Full details are available at:
    http://vmgump.apache.org/gump/public/turbine-fulcrum/fulcrum-security-api/index.html

    That said, some information snippets are provided here.

    The following annotations (debug/informational/warning/error messages) were provided:
    -DEBUG- Sole jar output [fulcrum-security-api-*[0-9T].jar] identifier set to project name
    -DEBUG- Sole testsjar output [fulcrum-security-api-*[0-9T]-tests.jar] identifier set to project name
    -DEBUG- (Apache Gump generated) Apache Maven Settings in: /srv/gump/public/workspace/turbine-fulcrum/security/api/gump_mvn_settings.xml
    -INFO- Failed with reason build failed
    -DEBUG- Maven POM in: /srv/gump/public/workspace/turbine-fulcrum/security/api/pom.xml
    -INFO- Failed to extract fallback artifacts from Gump Repository



    The following work was performed:
    http://vmgump.apache.org/gump/public/turbine-fulcrum/fulcrum-security-api/gump_work/build_turbine-fulcrum_fulcrum-security-api.html
    Work Name: build_turbine-fulcrum_fulcrum-security-api (Type: Build)
    Work ended in a state of : Failed
    Elapsed: 13 secs
    Command Line: /opt/maven2/bin/mvn --batch-mode --settings /srv/gump/public/workspace/turbine-fulcrum/security/api/gump_mvn_settings.xml package
    [Working Directory: /srv/gump/public/workspace/turbine-fulcrum/security/api]
    M2_HOME: /opt/maven2
    ---------------------------------------------
    [DEBUG] Incarnating the service crypto
    [DEBUG] Instantiating the implementation class for crypto
    [DEBUG] Incarnating the service crypto
    [DEBUG] LogEnabled.enableLogging() for crypto
    [DEBUG] Configurable.configure() for crypto
    [DEBUG] Initializable.initialize() for crypto
    [DEBUG] initialize()
    [DEBUG] Incarnating the service authenticator
    [DEBUG] Instantiating the implementation class for authenticator
    [DEBUG] Incarnating the service authenticator
    [DEBUG] LogEnabled.enableLogging() for authenticator
    [DEBUG] Serviceable.service() for authenticator
    [DEBUG] Located the service 'org.apache.fulcrum.crypto.CryptoService' in the local container
    [DEBUG] Configurable.configure() for authenticator
    [DEBUG] YAAFI Avalon Service Container is up and running
    [INFO] YaffiContainer ready.
    [DEBUG] Located the service 'org.apache.fulcrum.security.authenticator.Authenticator' in the local container
    [DEBUG] Disposing of container...
    [DEBUG] Disposing all services
    [DEBUG] Decommision the service authenticator
    [DEBUG] Decommisioning the service authenticator
    [DEBUG] Disposable.dispose() for authenticator
    [DEBUG] Decommision the service crypto
    [DEBUG] Decommisioning the service crypto
    [DEBUG] Disposing the service authenticator
    [DEBUG] Disposing the service crypto
    [DEBUG] All services are disposed
    [INFO] YaffiContainer has been disposed.
    Tests run: 1, Failures: 0, Errors: 0, Skipped: 0, Time elapsed: 0.063 sec

    Results :

    Tests in error:
    testContainsName(org.apache.fulcrum.security.util.SecuritySetTest)

    Tests run: 18, Failures: 0, Errors: 1, Skipped: 0

    [INFO] ------------------------------------------------------------------------
    [ERROR] BUILD FAILURE
    [INFO] ------------------------------------------------------------------------
    [INFO] There are test failures.

    Please refer to /srv/gump/public/workspace/turbine-fulcrum/security/api/target/surefire-reports for the individual test results.
    [INFO] ------------------------------------------------------------------------
    [INFO] For more information, run Maven with the -e switch
    [INFO] ------------------------------------------------------------------------
    [INFO] Total time: 12 seconds
    [INFO] Finished at: Sun Aug 12 07:35:32 UTC 2012
    [INFO] Final Memory: 21M/52M
    [INFO] ------------------------------------------------------------------------
    ---------------------------------------------

    To subscribe to this information via syndicated feeds:
    - RSS: http://vmgump.apache.org/gump/public/turbine-fulcrum/fulcrum-security-api/rss.xml
    - Atom: http://vmgump.apache.org/gump/public/turbine-fulcrum/fulcrum-security-api/atom.xml

    ============================== Gump Tracking Only ===
    Produced by Apache Gump(TM) version 2.3.
    Gump Run 06000612082012, vmgump.apache.org:vmgump:06000612082012
    Gump E-mail Identifier (unique within run) #16.

    --
    Apache Gump
    http://gump.apache.org/ [Instance: vmgump]

    ---------------------------------------------------------------------
    To unsubscribe, e-mail: dev-unsubscribe@turbine.apache.org
    For additional commands, e-mail: dev-help@turbine.apache.org
  • Anonymous at Aug 13, 2012 at 7:33 am
    To whom it may engage...

    This is an automated request, but not an unsolicited one. For
    more information please visit http://gump.apache.org/nagged.html,
    and/or contact the folk at general@gump.apache.org.

    Project fulcrum-security-api has an issue affecting its community integration.
    This issue affects 2 projects,
    and has been outstanding for 10 runs.
    The current state of this project is 'Failed', with reason 'Build Failed'.
    For reference only, the following projects are affected by this:
    - fulcrum-security-api : Services Framework
    - fulcrum_fulcrum-security-api : Services Framework


    Full details are available at:
    http://vmgump.apache.org/gump/public/turbine-fulcrum/fulcrum-security-api/index.html

    That said, some information snippets are provided here.

    The following annotations (debug/informational/warning/error messages) were provided:
    -DEBUG- Sole jar output [fulcrum-security-api-*[0-9T].jar] identifier set to project name
    -DEBUG- Sole testsjar output [fulcrum-security-api-*[0-9T]-tests.jar] identifier set to project name
    -DEBUG- (Apache Gump generated) Apache Maven Settings in: /srv/gump/public/workspace/turbine-fulcrum/security/api/gump_mvn_settings.xml
    -INFO- Failed with reason build failed
    -DEBUG- Maven POM in: /srv/gump/public/workspace/turbine-fulcrum/security/api/pom.xml
    -INFO- Failed to extract fallback artifacts from Gump Repository



    The following work was performed:
    http://vmgump.apache.org/gump/public/turbine-fulcrum/fulcrum-security-api/gump_work/build_turbine-fulcrum_fulcrum-security-api.html
    Work Name: build_turbine-fulcrum_fulcrum-security-api (Type: Build)
    Work ended in a state of : Failed
    Elapsed: 13 secs
    Command Line: /opt/maven2/bin/mvn --batch-mode --settings /srv/gump/public/workspace/turbine-fulcrum/security/api/gump_mvn_settings.xml package
    [Working Directory: /srv/gump/public/workspace/turbine-fulcrum/security/api]
    M2_HOME: /opt/maven2
    ---------------------------------------------
    [DEBUG] Incarnating the service crypto
    [DEBUG] Instantiating the implementation class for crypto
    [DEBUG] Incarnating the service crypto
    [DEBUG] LogEnabled.enableLogging() for crypto
    [DEBUG] Configurable.configure() for crypto
    [DEBUG] Initializable.initialize() for crypto
    [DEBUG] initialize()
    [DEBUG] Incarnating the service authenticator
    [DEBUG] Instantiating the implementation class for authenticator
    [DEBUG] Incarnating the service authenticator
    [DEBUG] LogEnabled.enableLogging() for authenticator
    [DEBUG] Serviceable.service() for authenticator
    [DEBUG] Located the service 'org.apache.fulcrum.crypto.CryptoService' in the local container
    [DEBUG] Configurable.configure() for authenticator
    [DEBUG] YAAFI Avalon Service Container is up and running
    [INFO] YaffiContainer ready.
    [DEBUG] Located the service 'org.apache.fulcrum.security.authenticator.Authenticator' in the local container
    [DEBUG] Disposing of container...
    [DEBUG] Disposing all services
    [DEBUG] Decommision the service authenticator
    [DEBUG] Decommisioning the service authenticator
    [DEBUG] Disposable.dispose() for authenticator
    [DEBUG] Decommision the service crypto
    [DEBUG] Decommisioning the service crypto
    [DEBUG] Disposing the service authenticator
    [DEBUG] Disposing the service crypto
    [DEBUG] All services are disposed
    [INFO] YaffiContainer has been disposed.
    Tests run: 1, Failures: 0, Errors: 0, Skipped: 0, Time elapsed: 0.066 sec

    Results :

    Tests in error:
    testContainsName(org.apache.fulcrum.security.util.SecuritySetTest)

    Tests run: 18, Failures: 0, Errors: 1, Skipped: 0

    [INFO] ------------------------------------------------------------------------
    [ERROR] BUILD FAILURE
    [INFO] ------------------------------------------------------------------------
    [INFO] There are test failures.

    Please refer to /srv/gump/public/workspace/turbine-fulcrum/security/api/target/surefire-reports for the individual test results.
    [INFO] ------------------------------------------------------------------------
    [INFO] For more information, run Maven with the -e switch
    [INFO] ------------------------------------------------------------------------
    [INFO] Total time: 12 seconds
    [INFO] Finished at: Mon Aug 13 07:33:09 UTC 2012
    [INFO] Final Memory: 21M/52M
    [INFO] ------------------------------------------------------------------------
    ---------------------------------------------

    To subscribe to this information via syndicated feeds:
    - RSS: http://vmgump.apache.org/gump/public/turbine-fulcrum/fulcrum-security-api/rss.xml
    - Atom: http://vmgump.apache.org/gump/public/turbine-fulcrum/fulcrum-security-api/atom.xml

    ============================== Gump Tracking Only ===
    Produced by Apache Gump(TM) version 2.3.
    Gump Run 05000613082012, vmgump.apache.org:vmgump:05000613082012
    Gump E-mail Identifier (unique within run) #16.

    --
    Apache Gump
    http://gump.apache.org/ [Instance: vmgump]

    ---------------------------------------------------------------------
    To unsubscribe, e-mail: dev-unsubscribe@turbine.apache.org
    For additional commands, e-mail: dev-help@turbine.apache.org
  • Anonymous at Aug 14, 2012 at 7:40 am
    To whom it may engage...

    This is an automated request, but not an unsolicited one. For
    more information please visit http://gump.apache.org/nagged.html,
    and/or contact the folk at general@gump.apache.org.

    Project fulcrum-security-api has an issue affecting its community integration.
    This issue affects 2 projects,
    and has been outstanding for 12 runs.
    The current state of this project is 'Failed', with reason 'Build Failed'.
    For reference only, the following projects are affected by this:
    - fulcrum-security-api : Services Framework
    - fulcrum_fulcrum-security-api : Services Framework


    Full details are available at:
    http://vmgump.apache.org/gump/public/turbine-fulcrum/fulcrum-security-api/index.html

    That said, some information snippets are provided here.

    The following annotations (debug/informational/warning/error messages) were provided:
    -DEBUG- Sole jar output [fulcrum-security-api-*[0-9T].jar] identifier set to project name
    -DEBUG- Sole testsjar output [fulcrum-security-api-*[0-9T]-tests.jar] identifier set to project name
    -DEBUG- (Apache Gump generated) Apache Maven Settings in: /srv/gump/public/workspace/turbine-fulcrum/security/api/gump_mvn_settings.xml
    -INFO- Failed with reason build failed
    -DEBUG- Maven POM in: /srv/gump/public/workspace/turbine-fulcrum/security/api/pom.xml
    -INFO- Failed to extract fallback artifacts from Gump Repository



    The following work was performed:
    http://vmgump.apache.org/gump/public/turbine-fulcrum/fulcrum-security-api/gump_work/build_turbine-fulcrum_fulcrum-security-api.html
    Work Name: build_turbine-fulcrum_fulcrum-security-api (Type: Build)
    Work ended in a state of : Failed
    Elapsed: 13 secs
    Command Line: /opt/maven2/bin/mvn --batch-mode --settings /srv/gump/public/workspace/turbine-fulcrum/security/api/gump_mvn_settings.xml package
    [Working Directory: /srv/gump/public/workspace/turbine-fulcrum/security/api]
    M2_HOME: /opt/maven2
    ---------------------------------------------
    [DEBUG] Incarnating the service crypto
    [DEBUG] Instantiating the implementation class for crypto
    [DEBUG] Incarnating the service crypto
    [DEBUG] LogEnabled.enableLogging() for crypto
    [DEBUG] Configurable.configure() for crypto
    [DEBUG] Initializable.initialize() for crypto
    [DEBUG] initialize()
    [DEBUG] Incarnating the service authenticator
    [DEBUG] Instantiating the implementation class for authenticator
    [DEBUG] Incarnating the service authenticator
    [DEBUG] LogEnabled.enableLogging() for authenticator
    [DEBUG] Serviceable.service() for authenticator
    [DEBUG] Located the service 'org.apache.fulcrum.crypto.CryptoService' in the local container
    [DEBUG] Configurable.configure() for authenticator
    [DEBUG] YAAFI Avalon Service Container is up and running
    [INFO] YaffiContainer ready.
    [DEBUG] Located the service 'org.apache.fulcrum.security.authenticator.Authenticator' in the local container
    [DEBUG] Disposing of container...
    [DEBUG] Disposing all services
    [DEBUG] Decommision the service authenticator
    [DEBUG] Decommisioning the service authenticator
    [DEBUG] Disposable.dispose() for authenticator
    [DEBUG] Decommision the service crypto
    [DEBUG] Decommisioning the service crypto
    [DEBUG] Disposing the service authenticator
    [DEBUG] Disposing the service crypto
    [DEBUG] All services are disposed
    [INFO] YaffiContainer has been disposed.
    Tests run: 1, Failures: 0, Errors: 0, Skipped: 0, Time elapsed: 0.086 sec

    Results :

    Tests in error:
    testContainsName(org.apache.fulcrum.security.util.SecuritySetTest)

    Tests run: 18, Failures: 0, Errors: 1, Skipped: 0

    [INFO] ------------------------------------------------------------------------
    [ERROR] BUILD FAILURE
    [INFO] ------------------------------------------------------------------------
    [INFO] There are test failures.

    Please refer to /srv/gump/public/workspace/turbine-fulcrum/security/api/target/surefire-reports for the individual test results.
    [INFO] ------------------------------------------------------------------------
    [INFO] For more information, run Maven with the -e switch
    [INFO] ------------------------------------------------------------------------
    [INFO] Total time: 12 seconds
    [INFO] Finished at: Tue Aug 14 07:40:25 UTC 2012
    [INFO] Final Memory: 21M/52M
    [INFO] ------------------------------------------------------------------------
    ---------------------------------------------

    To subscribe to this information via syndicated feeds:
    - RSS: http://vmgump.apache.org/gump/public/turbine-fulcrum/fulcrum-security-api/rss.xml
    - Atom: http://vmgump.apache.org/gump/public/turbine-fulcrum/fulcrum-security-api/atom.xml

    ============================== Gump Tracking Only ===
    Produced by Apache Gump(TM) version 2.3.
    Gump Run 06000614082012, vmgump.apache.org:vmgump:06000614082012
    Gump E-mail Identifier (unique within run) #16.

    --
    Apache Gump
    http://gump.apache.org/ [Instance: vmgump]

    ---------------------------------------------------------------------
    To unsubscribe, e-mail: dev-unsubscribe@turbine.apache.org
    For additional commands, e-mail: dev-help@turbine.apache.org

Related Discussions

Discussion Navigation
viewthread | post
Discussion Overview
groupdev @
categoriesturbine
postedAug 8, '12 at 7:28a
activeAug 14, '12 at 7:40a
posts8
users1
websiteturbine.apache.org

1 user in discussion

Anonymous: 8 posts

People

Translate

site design / logo © 2018 Grokbase