Grokbase Groups Turbine dev May 2012
FAQ
To whom it may engage...

This is an automated request, but not an unsolicited one. For
more information please visit http://gump.apache.org/nagged.html,
and/or contact the folk at general@gump.apache.org.

Project fulcrum-cache-test has an issue affecting its community integration.
This issue affects 1 projects,
and has been outstanding for 139 runs.
The current state of this project is 'Failed', with reason 'Build Failed'.
For reference only, the following projects are affected by this:
- fulcrum-cache-test : Services Framework


Full details are available at:
http://vmgump.apache.org/gump/public/turbine-fulcrum/fulcrum-cache-test/index.html

That said, some information snippets are provided here.

The following annotations (debug/informational/warning/error messages) were provided:
-WARNING- Overriding Maven settings: [/srv/gump/public/workspace/turbine-fulcrum/cache/gump_mvn_settings.xml]
-DEBUG- (Apache Gump generated) Apache Maven Settings in: /srv/gump/public/workspace/turbine-fulcrum/cache/gump_mvn_settings.xml
-INFO- Failed with reason build failed
-DEBUG- Maven POM in: /srv/gump/public/workspace/turbine-fulcrum/cache/pom.xml



The following work was performed:
http://vmgump.apache.org/gump/public/turbine-fulcrum/fulcrum-cache-test/gump_work/build_turbine-fulcrum_fulcrum-cache-test.html
Work Name: build_turbine-fulcrum_fulcrum-cache-test (Type: Build)
Work ended in a state of : Failed
Elapsed: 6 mins 56 secs
Command Line: /opt/maven2/bin/mvn --batch-mode --settings /srv/gump/public/workspace/turbine-fulcrum/cache/gump_mvn_settings.xml test
[Working Directory: /srv/gump/public/workspace/turbine-fulcrum/cache]
M2_HOME: /opt/maven2
---------------------------------------------
May 1, 2012 7:11:14 AM org.apache.jcs.engine.control.CompositeCache dispose
INFO: In DISPOSE, [Cache_Test] fromRemote [false]
Region Name = Cache_Test
HitCountRam = 308
HitCountAux = 0
---------------------------LRU Memory Cache
List Size = 3
Map Size = 3
Put Count = 23
Hit Count = 309
Miss Count = 1
[DEBUG] Disposing all services
[DEBUG] Decommision the service jcscache
[DEBUG] Decommisioning the service jcscache
[DEBUG] Disposable.dispose() for jcscache
[DEBUG] JCSCacheService stopped.
[DEBUG] Decommision the service ehcache
[DEBUG] Decommisioning the service ehcache
[DEBUG] Disposable.dispose() for ehcache
[DEBUG] EHCacheService stopped!
[DEBUG] Decommision the service cache
[DEBUG] Decommisioning the service cache
[DEBUG] Disposable.dispose() for cache
[DEBUG] Disposing the service jcscache
[DEBUG] Disposing the service ehcache
[DEBUG] Disposing the service cache
[DEBUG] All services are disposed
[INFO] YaffiContainer has been disposed.
Tests run: 10, Failures: 0, Errors: 0, Skipped: 0, Time elapsed: 142.14 sec

Results :

Failed tests:
testObjectCount(org.apache.fulcrum.cache.JCSCacheTest)

Tests run: 30, Failures: 1, Errors: 0, Skipped: 0

[INFO] ------------------------------------------------------------------------
[ERROR] BUILD FAILURE
[INFO] ------------------------------------------------------------------------
[INFO] There are test failures.

Please refer to /srv/gump/public/workspace/turbine-fulcrum/cache/target/surefire-reports for the individual test results.
[INFO] ------------------------------------------------------------------------
[INFO] For more information, run Maven with the -e switch
[INFO] ------------------------------------------------------------------------
[INFO] Total time: 6 minutes 55 seconds
[INFO] Finished at: Tue May 01 07:11:14 UTC 2012
[INFO] Final Memory: 14M/35M
[INFO] ------------------------------------------------------------------------
---------------------------------------------

To subscribe to this information via syndicated feeds:
- RSS: http://vmgump.apache.org/gump/public/turbine-fulcrum/fulcrum-cache-test/rss.xml
- Atom: http://vmgump.apache.org/gump/public/turbine-fulcrum/fulcrum-cache-test/atom.xml

============================== Gump Tracking Only ===
Produced by Apache Gump(TM) version 2.3.
Gump Run 11000001052012, vmgump.apache.org:vmgump:11000001052012
Gump E-mail Identifier (unique within run) #47.

--
Apache Gump
http://gump.apache.org/ [Instance: vmgump]

---------------------------------------------------------------------
To unsubscribe, e-mail: dev-unsubscribe@turbine.apache.org
For additional commands, e-mail: dev-help@turbine.apache.org

Search Discussions

  • Anonymous at May 2, 2012 at 7:03 am
    To whom it may engage...

    This is an automated request, but not an unsolicited one. For
    more information please visit http://gump.apache.org/nagged.html,
    and/or contact the folk at general@gump.apache.org.

    Project fulcrum-cache-test has an issue affecting its community integration.
    This issue affects 1 projects,
    and has been outstanding for 141 runs.
    The current state of this project is 'Failed', with reason 'Build Failed'.
    For reference only, the following projects are affected by this:
    - fulcrum-cache-test : Services Framework


    Full details are available at:
    http://vmgump.apache.org/gump/public/turbine-fulcrum/fulcrum-cache-test/index.html

    That said, some information snippets are provided here.

    The following annotations (debug/informational/warning/error messages) were provided:
    -WARNING- Overriding Maven settings: [/srv/gump/public/workspace/turbine-fulcrum/cache/gump_mvn_settings.xml]
    -DEBUG- (Apache Gump generated) Apache Maven Settings in: /srv/gump/public/workspace/turbine-fulcrum/cache/gump_mvn_settings.xml
    -INFO- Failed with reason build failed
    -DEBUG- Maven POM in: /srv/gump/public/workspace/turbine-fulcrum/cache/pom.xml



    The following work was performed:
    http://vmgump.apache.org/gump/public/turbine-fulcrum/fulcrum-cache-test/gump_work/build_turbine-fulcrum_fulcrum-cache-test.html
    Work Name: build_turbine-fulcrum_fulcrum-cache-test (Type: Build)
    Work ended in a state of : Failed
    Elapsed: 6 mins 57 secs
    Command Line: /opt/maven2/bin/mvn --batch-mode --settings /srv/gump/public/workspace/turbine-fulcrum/cache/gump_mvn_settings.xml test
    [Working Directory: /srv/gump/public/workspace/turbine-fulcrum/cache]
    M2_HOME: /opt/maven2
    ---------------------------------------------
    [DEBUG] Disposing all services
    [DEBUG] Decommision the service jcscache
    [DEBUG] Decommisioning the service jcscache
    May 2, 2012 7:03:08 AM org.apache.jcs.engine.control.CompositeCache dispose
    INFO: In DISPOSE, [Cache_Test] fromRemote [false]
    Region Name = Cache_Test
    HitCountRam = 308
    HitCountAux = 0
    ---------------------------LRU Memory Cache
    List Size = 3
    Map Size = 3
    Put Count = 23
    Hit Count = 309
    Miss Count = 1
    [DEBUG] Disposable.dispose() for jcscache
    [DEBUG] JCSCacheService stopped.
    [DEBUG] Decommision the service ehcache
    [DEBUG] Decommisioning the service ehcache
    [DEBUG] Disposable.dispose() for ehcache
    [DEBUG] EHCacheService stopped!
    [DEBUG] Decommision the service cache
    [DEBUG] Decommisioning the service cache
    [DEBUG] Disposable.dispose() for cache
    [DEBUG] Disposing the service jcscache
    [DEBUG] Disposing the service ehcache
    [DEBUG] Disposing the service cache
    [DEBUG] All services are disposed
    [INFO] YaffiContainer has been disposed.
    Tests run: 10, Failures: 0, Errors: 0, Skipped: 0, Time elapsed: 142.141 sec

    Results :

    Failed tests:
    testObjectCount(org.apache.fulcrum.cache.JCSCacheTest)

    Tests run: 30, Failures: 1, Errors: 0, Skipped: 0

    [INFO] ------------------------------------------------------------------------
    [ERROR] BUILD FAILURE
    [INFO] ------------------------------------------------------------------------
    [INFO] There are test failures.

    Please refer to /srv/gump/public/workspace/turbine-fulcrum/cache/target/surefire-reports for the individual test results.
    [INFO] ------------------------------------------------------------------------
    [INFO] For more information, run Maven with the -e switch
    [INFO] ------------------------------------------------------------------------
    [INFO] Total time: 6 minutes 55 seconds
    [INFO] Finished at: Wed May 02 07:03:08 UTC 2012
    [INFO] Final Memory: 14M/35M
    [INFO] ------------------------------------------------------------------------
    ---------------------------------------------

    To subscribe to this information via syndicated feeds:
    - RSS: http://vmgump.apache.org/gump/public/turbine-fulcrum/fulcrum-cache-test/rss.xml
    - Atom: http://vmgump.apache.org/gump/public/turbine-fulcrum/fulcrum-cache-test/atom.xml

    ============================== Gump Tracking Only ===
    Produced by Apache Gump(TM) version 2.3.
    Gump Run 12000002052012, vmgump.apache.org:vmgump:12000002052012
    Gump E-mail Identifier (unique within run) #48.

    --
    Apache Gump
    http://gump.apache.org/ [Instance: vmgump]

    ---------------------------------------------------------------------
    To unsubscribe, e-mail: dev-unsubscribe@turbine.apache.org
    For additional commands, e-mail: dev-help@turbine.apache.org
  • Anonymous at May 3, 2012 at 4:09 pm
    To whom it may engage...

    This is an automated request, but not an unsolicited one. For
    more information please visit http://gump.apache.org/nagged.html,
    and/or contact the folk at general@gump.apache.org.

    Project fulcrum-cache-test has an issue affecting its community integration.
    This issue affects 1 projects,
    and has been outstanding for 143 runs.
    The current state of this project is 'Failed', with reason 'Build Failed'.
    For reference only, the following projects are affected by this:
    - fulcrum-cache-test : Services Framework


    Full details are available at:
    http://vmgump.apache.org/gump/public/turbine-fulcrum/fulcrum-cache-test/index.html

    That said, some information snippets are provided here.

    The following annotations (debug/informational/warning/error messages) were provided:
    -WARNING- Overriding Maven settings: [/srv/gump/public/workspace/turbine-fulcrum/cache/gump_mvn_settings.xml]
    -DEBUG- (Apache Gump generated) Apache Maven Settings in: /srv/gump/public/workspace/turbine-fulcrum/cache/gump_mvn_settings.xml
    -INFO- Failed with reason build failed
    -DEBUG- Maven POM in: /srv/gump/public/workspace/turbine-fulcrum/cache/pom.xml



    The following work was performed:
    http://vmgump.apache.org/gump/public/turbine-fulcrum/fulcrum-cache-test/gump_work/build_turbine-fulcrum_fulcrum-cache-test.html
    Work Name: build_turbine-fulcrum_fulcrum-cache-test (Type: Build)
    Work ended in a state of : Failed
    Elapsed: 6 mins 56 secs
    Command Line: /opt/maven2/bin/mvn --batch-mode --settings /srv/gump/public/workspace/turbine-fulcrum/cache/gump_mvn_settings.xml test
    [Working Directory: /srv/gump/public/workspace/turbine-fulcrum/cache]
    M2_HOME: /opt/maven2
    ---------------------------------------------
    INFO: In DISPOSE, [Cache_Test] fromRemote [false]
    Region Name = Cache_Test
    HitCountRam = 308
    HitCountAux = 0
    ---------------------------LRU Memory Cache
    List Size = 3
    Map Size = 3
    Put Count = 23
    Hit Count = 309
    Miss Count = 1
    [DEBUG] Disposing of container...
    [DEBUG] Disposing all services
    [DEBUG] Decommision the service jcscache
    [DEBUG] Decommisioning the service jcscache
    [DEBUG] Disposable.dispose() for jcscache
    [DEBUG] JCSCacheService stopped.
    [DEBUG] Decommision the service ehcache
    [DEBUG] Decommisioning the service ehcache
    [DEBUG] Disposable.dispose() for ehcache
    [DEBUG] EHCacheService stopped!
    [DEBUG] Decommision the service cache
    [DEBUG] Decommisioning the service cache
    [DEBUG] Disposable.dispose() for cache
    [DEBUG] Disposing the service jcscache
    [DEBUG] Disposing the service ehcache
    [DEBUG] Disposing the service cache
    [DEBUG] All services are disposed
    [INFO] YaffiContainer has been disposed.
    Tests run: 10, Failures: 0, Errors: 0, Skipped: 0, Time elapsed: 142.136 sec

    Results :

    Failed tests:
    testObjectCount(org.apache.fulcrum.cache.JCSCacheTest)

    Tests run: 30, Failures: 1, Errors: 0, Skipped: 0

    [INFO] ------------------------------------------------------------------------
    [ERROR] BUILD FAILURE
    [INFO] ------------------------------------------------------------------------
    [INFO] There are test failures.

    Please refer to /srv/gump/public/workspace/turbine-fulcrum/cache/target/surefire-reports for the individual test results.
    [INFO] ------------------------------------------------------------------------
    [INFO] For more information, run Maven with the -e switch
    [INFO] ------------------------------------------------------------------------
    [INFO] Total time: 6 minutes 55 seconds
    [INFO] Finished at: Thu May 03 16:08:35 UTC 2012
    [INFO] Final Memory: 14M/35M
    [INFO] ------------------------------------------------------------------------
    ---------------------------------------------

    To subscribe to this information via syndicated feeds:
    - RSS: http://vmgump.apache.org/gump/public/turbine-fulcrum/fulcrum-cache-test/rss.xml
    - Atom: http://vmgump.apache.org/gump/public/turbine-fulcrum/fulcrum-cache-test/atom.xml

    ============================== Gump Tracking Only ===
    Produced by Apache Gump(TM) version 2.3.
    Gump Run 06000603052012, vmgump.apache.org:vmgump:06000603052012
    Gump E-mail Identifier (unique within run) #54.

    --
    Apache Gump
    http://gump.apache.org/ [Instance: vmgump]

    ---------------------------------------------------------------------
    To unsubscribe, e-mail: dev-unsubscribe@turbine.apache.org
    For additional commands, e-mail: dev-help@turbine.apache.org
  • Anonymous at May 4, 2012 at 9:09 am
    To whom it may engage...

    This is an automated request, but not an unsolicited one. For
    more information please visit http://gump.apache.org/nagged.html,
    and/or contact the folk at general@gump.apache.org.

    Project fulcrum-cache-test has an issue affecting its community integration.
    This issue affects 1 projects,
    and has been outstanding for 144 runs.
    The current state of this project is 'Failed', with reason 'Build Failed'.
    For reference only, the following projects are affected by this:
    - fulcrum-cache-test : Services Framework


    Full details are available at:
    http://vmgump.apache.org/gump/public/turbine-fulcrum/fulcrum-cache-test/index.html

    That said, some information snippets are provided here.

    The following annotations (debug/informational/warning/error messages) were provided:
    -WARNING- Overriding Maven settings: [/srv/gump/public/workspace/turbine-fulcrum/cache/gump_mvn_settings.xml]
    -DEBUG- (Apache Gump generated) Apache Maven Settings in: /srv/gump/public/workspace/turbine-fulcrum/cache/gump_mvn_settings.xml
    -INFO- Failed with reason build failed
    -DEBUG- Maven POM in: /srv/gump/public/workspace/turbine-fulcrum/cache/pom.xml



    The following work was performed:
    http://vmgump.apache.org/gump/public/turbine-fulcrum/fulcrum-cache-test/gump_work/build_turbine-fulcrum_fulcrum-cache-test.html
    Work Name: build_turbine-fulcrum_fulcrum-cache-test (Type: Build)
    Work ended in a state of : Failed
    Elapsed: 6 mins 56 secs
    Command Line: /opt/maven2/bin/mvn --batch-mode --settings /srv/gump/public/workspace/turbine-fulcrum/cache/gump_mvn_settings.xml test
    [Working Directory: /srv/gump/public/workspace/turbine-fulcrum/cache]
    M2_HOME: /opt/maven2
    ---------------------------------------------
    INFO: In DISPOSE, [Cache_Test] fromRemote [false]
    Region Name = Cache_Test
    HitCountRam = 308
    HitCountAux = 0
    ---------------------------LRU Memory Cache
    List Size = 3
    Map Size = 3
    Put Count = 23
    Hit Count = 309
    Miss Count = 1
    [DEBUG] Disposing of container...
    [DEBUG] Disposing all services
    [DEBUG] Decommision the service jcscache
    [DEBUG] Decommisioning the service jcscache
    [DEBUG] Disposable.dispose() for jcscache
    [DEBUG] JCSCacheService stopped.
    [DEBUG] Decommision the service ehcache
    [DEBUG] Decommisioning the service ehcache
    [DEBUG] Disposable.dispose() for ehcache
    [DEBUG] EHCacheService stopped!
    [DEBUG] Decommision the service cache
    [DEBUG] Decommisioning the service cache
    [DEBUG] Disposable.dispose() for cache
    [DEBUG] Disposing the service jcscache
    [DEBUG] Disposing the service ehcache
    [DEBUG] Disposing the service cache
    [DEBUG] All services are disposed
    [INFO] YaffiContainer has been disposed.
    Tests run: 10, Failures: 0, Errors: 0, Skipped: 0, Time elapsed: 142.144 sec

    Results :

    Failed tests:
    testObjectCount(org.apache.fulcrum.cache.JCSCacheTest)

    Tests run: 30, Failures: 1, Errors: 0, Skipped: 0

    [INFO] ------------------------------------------------------------------------
    [ERROR] BUILD FAILURE
    [INFO] ------------------------------------------------------------------------
    [INFO] There are test failures.

    Please refer to /srv/gump/public/workspace/turbine-fulcrum/cache/target/surefire-reports for the individual test results.
    [INFO] ------------------------------------------------------------------------
    [INFO] For more information, run Maven with the -e switch
    [INFO] ------------------------------------------------------------------------
    [INFO] Total time: 6 minutes 55 seconds
    [INFO] Finished at: Fri May 04 09:08:54 UTC 2012
    [INFO] Final Memory: 14M/35M
    [INFO] ------------------------------------------------------------------------
    ---------------------------------------------

    To subscribe to this information via syndicated feeds:
    - RSS: http://vmgump.apache.org/gump/public/turbine-fulcrum/fulcrum-cache-test/rss.xml
    - Atom: http://vmgump.apache.org/gump/public/turbine-fulcrum/fulcrum-cache-test/atom.xml

    ============================== Gump Tracking Only ===
    Produced by Apache Gump(TM) version 2.3.
    Gump Run 11000004052012, vmgump.apache.org:vmgump:11000004052012
    Gump E-mail Identifier (unique within run) #53.

    --
    Apache Gump
    http://gump.apache.org/ [Instance: vmgump]

    ---------------------------------------------------------------------
    To unsubscribe, e-mail: dev-unsubscribe@turbine.apache.org
    For additional commands, e-mail: dev-help@turbine.apache.org
  • Anonymous at May 5, 2012 at 1:11 pm
    To whom it may engage...

    This is an automated request, but not an unsolicited one. For
    more information please visit http://gump.apache.org/nagged.html,
    and/or contact the folk at general@gump.apache.org.

    Project fulcrum-cache-test has an issue affecting its community integration.
    This issue affects 1 projects,
    and has been outstanding for 146 runs.
    The current state of this project is 'Failed', with reason 'Build Failed'.
    For reference only, the following projects are affected by this:
    - fulcrum-cache-test : Services Framework


    Full details are available at:
    http://vmgump.apache.org/gump/public/turbine-fulcrum/fulcrum-cache-test/index.html

    That said, some information snippets are provided here.

    The following annotations (debug/informational/warning/error messages) were provided:
    -WARNING- Overriding Maven settings: [/srv/gump/public/workspace/turbine-fulcrum/cache/gump_mvn_settings.xml]
    -DEBUG- (Apache Gump generated) Apache Maven Settings in: /srv/gump/public/workspace/turbine-fulcrum/cache/gump_mvn_settings.xml
    -INFO- Failed with reason build failed
    -DEBUG- Maven POM in: /srv/gump/public/workspace/turbine-fulcrum/cache/pom.xml



    The following work was performed:
    http://vmgump.apache.org/gump/public/turbine-fulcrum/fulcrum-cache-test/gump_work/build_turbine-fulcrum_fulcrum-cache-test.html
    Work Name: build_turbine-fulcrum_fulcrum-cache-test (Type: Build)
    Work ended in a state of : Failed
    Elapsed: 6 mins 56 secs
    Command Line: /opt/maven2/bin/mvn --batch-mode --settings /srv/gump/public/workspace/turbine-fulcrum/cache/gump_mvn_settings.xml test
    [Working Directory: /srv/gump/public/workspace/turbine-fulcrum/cache]
    M2_HOME: /opt/maven2
    ---------------------------------------------
    [DEBUG] Disposing all services
    [DEBUG] Decommision the service jcscache
    [DEBUG] Decommisioning the service jcscache
    [DEBUG] Disposable.dispose() for jcscache
    May 5, 2012 1:10:30 PM org.apache.jcs.engine.control.CompositeCache dispose
    INFO: In DISPOSE, [Cache_Test] fromRemote [false]
    Region Name = Cache_Test
    HitCountRam = 308
    HitCountAux = 0
    ---------------------------LRU Memory Cache
    List Size = 3
    Map Size = 3
    Put Count = 23
    Hit Count = 309
    Miss Count = 1
    [DEBUG] JCSCacheService stopped.
    [DEBUG] Decommision the service ehcache
    [DEBUG] Decommisioning the service ehcache
    [DEBUG] Disposable.dispose() for ehcache
    [DEBUG] EHCacheService stopped!
    [DEBUG] Decommision the service cache
    [DEBUG] Decommisioning the service cache
    [DEBUG] Disposable.dispose() for cache
    [DEBUG] Disposing the service jcscache
    [DEBUG] Disposing the service ehcache
    [DEBUG] Disposing the service cache
    [DEBUG] All services are disposed
    [INFO] YaffiContainer has been disposed.
    Tests run: 10, Failures: 0, Errors: 0, Skipped: 0, Time elapsed: 142.149 sec

    Results :

    Failed tests:
    testObjectCount(org.apache.fulcrum.cache.JCSCacheTest)

    Tests run: 30, Failures: 1, Errors: 0, Skipped: 0

    [INFO] ------------------------------------------------------------------------
    [ERROR] BUILD FAILURE
    [INFO] ------------------------------------------------------------------------
    [INFO] There are test failures.

    Please refer to /srv/gump/public/workspace/turbine-fulcrum/cache/target/surefire-reports for the individual test results.
    [INFO] ------------------------------------------------------------------------
    [INFO] For more information, run Maven with the -e switch
    [INFO] ------------------------------------------------------------------------
    [INFO] Total time: 6 minutes 55 seconds
    [INFO] Finished at: Sat May 05 13:10:30 UTC 2012
    [INFO] Final Memory: 14M/35M
    [INFO] ------------------------------------------------------------------------
    ---------------------------------------------

    To subscribe to this information via syndicated feeds:
    - RSS: http://vmgump.apache.org/gump/public/turbine-fulcrum/fulcrum-cache-test/rss.xml
    - Atom: http://vmgump.apache.org/gump/public/turbine-fulcrum/fulcrum-cache-test/atom.xml

    ============================== Gump Tracking Only ===
    Produced by Apache Gump(TM) version 2.3.
    Gump Run 07000605052012, vmgump.apache.org:vmgump:07000605052012
    Gump E-mail Identifier (unique within run) #55.

    --
    Apache Gump
    http://gump.apache.org/ [Instance: vmgump]

    ---------------------------------------------------------------------
    To unsubscribe, e-mail: dev-unsubscribe@turbine.apache.org
    For additional commands, e-mail: dev-help@turbine.apache.org
  • Anonymous at May 6, 2012 at 1:10 pm
    To whom it may engage...

    This is an automated request, but not an unsolicited one. For
    more information please visit http://gump.apache.org/nagged.html,
    and/or contact the folk at general@gump.apache.org.

    Project fulcrum-cache-test has an issue affecting its community integration.
    This issue affects 1 projects,
    and has been outstanding for 148 runs.
    The current state of this project is 'Failed', with reason 'Build Failed'.
    For reference only, the following projects are affected by this:
    - fulcrum-cache-test : Services Framework


    Full details are available at:
    http://vmgump.apache.org/gump/public/turbine-fulcrum/fulcrum-cache-test/index.html

    That said, some information snippets are provided here.

    The following annotations (debug/informational/warning/error messages) were provided:
    -WARNING- Overriding Maven settings: [/srv/gump/public/workspace/turbine-fulcrum/cache/gump_mvn_settings.xml]
    -DEBUG- (Apache Gump generated) Apache Maven Settings in: /srv/gump/public/workspace/turbine-fulcrum/cache/gump_mvn_settings.xml
    -INFO- Failed with reason build failed
    -DEBUG- Maven POM in: /srv/gump/public/workspace/turbine-fulcrum/cache/pom.xml



    The following work was performed:
    http://vmgump.apache.org/gump/public/turbine-fulcrum/fulcrum-cache-test/gump_work/build_turbine-fulcrum_fulcrum-cache-test.html
    Work Name: build_turbine-fulcrum_fulcrum-cache-test (Type: Build)
    Work ended in a state of : Failed
    Elapsed: 6 mins 56 secs
    Command Line: /opt/maven2/bin/mvn --batch-mode --settings /srv/gump/public/workspace/turbine-fulcrum/cache/gump_mvn_settings.xml test
    [Working Directory: /srv/gump/public/workspace/turbine-fulcrum/cache]
    M2_HOME: /opt/maven2
    ---------------------------------------------
    INFO: In DISPOSE, [Cache_Test] fromRemote [false]
    Region Name = Cache_Test
    HitCountRam = 308
    HitCountAux = 0
    ---------------------------LRU Memory Cache
    List Size = 3
    Map Size = 3
    Put Count = 23
    Hit Count = 309
    Miss Count = 1
    [DEBUG] Disposing of container...
    [DEBUG] Disposing all services
    [DEBUG] Decommision the service jcscache
    [DEBUG] Decommisioning the service jcscache
    [DEBUG] Disposable.dispose() for jcscache
    [DEBUG] JCSCacheService stopped.
    [DEBUG] Decommision the service ehcache
    [DEBUG] Decommisioning the service ehcache
    [DEBUG] Disposable.dispose() for ehcache
    [DEBUG] EHCacheService stopped!
    [DEBUG] Decommision the service cache
    [DEBUG] Decommisioning the service cache
    [DEBUG] Disposable.dispose() for cache
    [DEBUG] Disposing the service jcscache
    [DEBUG] Disposing the service ehcache
    [DEBUG] Disposing the service cache
    [DEBUG] All services are disposed
    [INFO] YaffiContainer has been disposed.
    Tests run: 10, Failures: 0, Errors: 0, Skipped: 0, Time elapsed: 142.138 sec

    Results :

    Failed tests:
    testObjectCount(org.apache.fulcrum.cache.JCSCacheTest)

    Tests run: 30, Failures: 1, Errors: 0, Skipped: 0

    [INFO] ------------------------------------------------------------------------
    [ERROR] BUILD FAILURE
    [INFO] ------------------------------------------------------------------------
    [INFO] There are test failures.

    Please refer to /srv/gump/public/workspace/turbine-fulcrum/cache/target/surefire-reports for the individual test results.
    [INFO] ------------------------------------------------------------------------
    [INFO] For more information, run Maven with the -e switch
    [INFO] ------------------------------------------------------------------------
    [INFO] Total time: 6 minutes 55 seconds
    [INFO] Finished at: Sun May 06 13:10:14 UTC 2012
    [INFO] Final Memory: 14M/35M
    [INFO] ------------------------------------------------------------------------
    ---------------------------------------------

    To subscribe to this information via syndicated feeds:
    - RSS: http://vmgump.apache.org/gump/public/turbine-fulcrum/fulcrum-cache-test/rss.xml
    - Atom: http://vmgump.apache.org/gump/public/turbine-fulcrum/fulcrum-cache-test/atom.xml

    ============================== Gump Tracking Only ===
    Produced by Apache Gump(TM) version 2.3.
    Gump Run 06000606052012, vmgump.apache.org:vmgump:06000606052012
    Gump E-mail Identifier (unique within run) #53.

    --
    Apache Gump
    http://gump.apache.org/ [Instance: vmgump]

    ---------------------------------------------------------------------
    To unsubscribe, e-mail: dev-unsubscribe@turbine.apache.org
    For additional commands, e-mail: dev-help@turbine.apache.org
  • Anonymous at May 7, 2012 at 2:42 pm
    To whom it may engage...

    This is an automated request, but not an unsolicited one. For
    more information please visit http://gump.apache.org/nagged.html,
    and/or contact the folk at general@gump.apache.org.

    Project fulcrum-cache-test has an issue affecting its community integration.
    This issue affects 1 projects,
    and has been outstanding for 150 runs.
    The current state of this project is 'Failed', with reason 'Build Failed'.
    For reference only, the following projects are affected by this:
    - fulcrum-cache-test : Services Framework


    Full details are available at:
    http://vmgump.apache.org/gump/public/turbine-fulcrum/fulcrum-cache-test/index.html

    That said, some information snippets are provided here.

    The following annotations (debug/informational/warning/error messages) were provided:
    -WARNING- Overriding Maven settings: [/srv/gump/public/workspace/turbine-fulcrum/cache/gump_mvn_settings.xml]
    -DEBUG- (Apache Gump generated) Apache Maven Settings in: /srv/gump/public/workspace/turbine-fulcrum/cache/gump_mvn_settings.xml
    -INFO- Failed with reason build failed
    -DEBUG- Maven POM in: /srv/gump/public/workspace/turbine-fulcrum/cache/pom.xml



    The following work was performed:
    http://vmgump.apache.org/gump/public/turbine-fulcrum/fulcrum-cache-test/gump_work/build_turbine-fulcrum_fulcrum-cache-test.html
    Work Name: build_turbine-fulcrum_fulcrum-cache-test (Type: Build)
    Work ended in a state of : Failed
    Elapsed: 6 mins 57 secs
    Command Line: /opt/maven2/bin/mvn --batch-mode --settings /srv/gump/public/workspace/turbine-fulcrum/cache/gump_mvn_settings.xml test
    [Working Directory: /srv/gump/public/workspace/turbine-fulcrum/cache]
    M2_HOME: /opt/maven2
    ---------------------------------------------
    INFO: In DISPOSE, [Cache_Test] fromRemote [false]
    Region Name = Cache_Test
    HitCountRam = 308
    HitCountAux = 0
    ---------------------------LRU Memory Cache
    List Size = 3
    Map Size = 3
    Put Count = 23
    Hit Count = 309
    Miss Count = 1
    [DEBUG] Disposing of container...
    [DEBUG] Disposing all services
    [DEBUG] Decommision the service jcscache
    [DEBUG] Decommisioning the service jcscache
    [DEBUG] Disposable.dispose() for jcscache
    [DEBUG] JCSCacheService stopped.
    [DEBUG] Decommision the service ehcache
    [DEBUG] Decommisioning the service ehcache
    [DEBUG] Disposable.dispose() for ehcache
    [DEBUG] EHCacheService stopped!
    [DEBUG] Decommision the service cache
    [DEBUG] Decommisioning the service cache
    [DEBUG] Disposable.dispose() for cache
    [DEBUG] Disposing the service jcscache
    [DEBUG] Disposing the service ehcache
    [DEBUG] Disposing the service cache
    [DEBUG] All services are disposed
    [INFO] YaffiContainer has been disposed.
    Tests run: 10, Failures: 0, Errors: 0, Skipped: 0, Time elapsed: 142.133 sec

    Results :

    Failed tests:
    testObjectCount(org.apache.fulcrum.cache.JCSCacheTest)

    Tests run: 30, Failures: 1, Errors: 0, Skipped: 0

    [INFO] ------------------------------------------------------------------------
    [ERROR] BUILD FAILURE
    [INFO] ------------------------------------------------------------------------
    [INFO] There are test failures.

    Please refer to /srv/gump/public/workspace/turbine-fulcrum/cache/target/surefire-reports for the individual test results.
    [INFO] ------------------------------------------------------------------------
    [INFO] For more information, run Maven with the -e switch
    [INFO] ------------------------------------------------------------------------
    [INFO] Total time: 6 minutes 56 seconds
    [INFO] Finished at: Mon May 07 14:42:03 UTC 2012
    [INFO] Final Memory: 14M/35M
    [INFO] ------------------------------------------------------------------------
    ---------------------------------------------

    To subscribe to this information via syndicated feeds:
    - RSS: http://vmgump.apache.org/gump/public/turbine-fulcrum/fulcrum-cache-test/rss.xml
    - Atom: http://vmgump.apache.org/gump/public/turbine-fulcrum/fulcrum-cache-test/atom.xml

    ============================== Gump Tracking Only ===
    Produced by Apache Gump(TM) version 2.3.
    Gump Run 06000607052012, vmgump.apache.org:vmgump:06000607052012
    Gump E-mail Identifier (unique within run) #57.

    --
    Apache Gump
    http://gump.apache.org/ [Instance: vmgump]

    ---------------------------------------------------------------------
    To unsubscribe, e-mail: dev-unsubscribe@turbine.apache.org
    For additional commands, e-mail: dev-help@turbine.apache.org
  • Anonymous at May 8, 2012 at 7:17 am
    To whom it may engage...

    This is an automated request, but not an unsolicited one. For
    more information please visit http://gump.apache.org/nagged.html,
    and/or contact the folk at general@gump.apache.org.

    Project fulcrum-cache-test has an issue affecting its community integration.
    This issue affects 1 projects,
    and has been outstanding for 151 runs.
    The current state of this project is 'Failed', with reason 'Build Failed'.
    For reference only, the following projects are affected by this:
    - fulcrum-cache-test : Services Framework


    Full details are available at:
    http://vmgump.apache.org/gump/public/turbine-fulcrum/fulcrum-cache-test/index.html

    That said, some information snippets are provided here.

    The following annotations (debug/informational/warning/error messages) were provided:
    -WARNING- Overriding Maven settings: [/srv/gump/public/workspace/turbine-fulcrum/cache/gump_mvn_settings.xml]
    -DEBUG- (Apache Gump generated) Apache Maven Settings in: /srv/gump/public/workspace/turbine-fulcrum/cache/gump_mvn_settings.xml
    -INFO- Failed with reason build failed
    -DEBUG- Maven POM in: /srv/gump/public/workspace/turbine-fulcrum/cache/pom.xml



    The following work was performed:
    http://vmgump.apache.org/gump/public/turbine-fulcrum/fulcrum-cache-test/gump_work/build_turbine-fulcrum_fulcrum-cache-test.html
    Work Name: build_turbine-fulcrum_fulcrum-cache-test (Type: Build)
    Work ended in a state of : Failed
    Elapsed: 6 mins 58 secs
    Command Line: /opt/maven2/bin/mvn --batch-mode --settings /srv/gump/public/workspace/turbine-fulcrum/cache/gump_mvn_settings.xml test
    [Working Directory: /srv/gump/public/workspace/turbine-fulcrum/cache]
    M2_HOME: /opt/maven2
    ---------------------------------------------
    [DEBUG] Disposing all services
    [DEBUG] Decommision the service jcscache
    [DEBUG] Decommisioning the service jcscache
    [DEBUG] Disposable.dispose() for jcscache
    May 8, 2012 7:17:09 AM org.apache.jcs.engine.control.CompositeCache dispose
    INFO: In DISPOSE, [Cache_Test] fromRemote [false]
    Region Name = Cache_Test
    HitCountRam = 308
    HitCountAux = 0
    ---------------------------LRU Memory Cache
    List Size = 3
    Map Size = 3
    Put Count = 23
    Hit Count = 309
    Miss Count = 1
    [DEBUG] JCSCacheService stopped.
    [DEBUG] Decommision the service ehcache
    [DEBUG] Decommisioning the service ehcache
    [DEBUG] Disposable.dispose() for ehcache
    [DEBUG] EHCacheService stopped!
    [DEBUG] Decommision the service cache
    [DEBUG] Decommisioning the service cache
    [DEBUG] Disposable.dispose() for cache
    [DEBUG] Disposing the service jcscache
    [DEBUG] Disposing the service ehcache
    [DEBUG] Disposing the service cache
    [DEBUG] All services are disposed
    [INFO] YaffiContainer has been disposed.
    Tests run: 10, Failures: 0, Errors: 0, Skipped: 0, Time elapsed: 142.213 sec

    Results :

    Failed tests:
    testObjectCount(org.apache.fulcrum.cache.JCSCacheTest)

    Tests run: 30, Failures: 1, Errors: 0, Skipped: 0

    [INFO] ------------------------------------------------------------------------
    [ERROR] BUILD FAILURE
    [INFO] ------------------------------------------------------------------------
    [INFO] There are test failures.

    Please refer to /srv/gump/public/workspace/turbine-fulcrum/cache/target/surefire-reports for the individual test results.
    [INFO] ------------------------------------------------------------------------
    [INFO] For more information, run Maven with the -e switch
    [INFO] ------------------------------------------------------------------------
    [INFO] Total time: 6 minutes 56 seconds
    [INFO] Finished at: Tue May 08 07:17:09 UTC 2012
    [INFO] Final Memory: 14M/35M
    [INFO] ------------------------------------------------------------------------
    ---------------------------------------------

    To subscribe to this information via syndicated feeds:
    - RSS: http://vmgump.apache.org/gump/public/turbine-fulcrum/fulcrum-cache-test/rss.xml
    - Atom: http://vmgump.apache.org/gump/public/turbine-fulcrum/fulcrum-cache-test/atom.xml

    ============================== Gump Tracking Only ===
    Produced by Apache Gump(TM) version 2.3.
    Gump Run 12000008052012, vmgump.apache.org:vmgump:12000008052012
    Gump E-mail Identifier (unique within run) #56.

    --
    Apache Gump
    http://gump.apache.org/ [Instance: vmgump]

    ---------------------------------------------------------------------
    To unsubscribe, e-mail: dev-unsubscribe@turbine.apache.org
    For additional commands, e-mail: dev-help@turbine.apache.org
  • Anonymous at May 9, 2012 at 7:14 am
    To whom it may engage...

    This is an automated request, but not an unsolicited one. For
    more information please visit http://gump.apache.org/nagged.html,
    and/or contact the folk at general@gump.apache.org.

    Project fulcrum-cache-test has an issue affecting its community integration.
    This issue affects 1 projects,
    and has been outstanding for 153 runs.
    The current state of this project is 'Failed', with reason 'Build Failed'.
    For reference only, the following projects are affected by this:
    - fulcrum-cache-test : Services Framework


    Full details are available at:
    http://vmgump.apache.org/gump/public/turbine-fulcrum/fulcrum-cache-test/index.html

    That said, some information snippets are provided here.

    The following annotations (debug/informational/warning/error messages) were provided:
    -WARNING- Overriding Maven settings: [/srv/gump/public/workspace/turbine-fulcrum/cache/gump_mvn_settings.xml]
    -DEBUG- (Apache Gump generated) Apache Maven Settings in: /srv/gump/public/workspace/turbine-fulcrum/cache/gump_mvn_settings.xml
    -INFO- Failed with reason build failed
    -DEBUG- Maven POM in: /srv/gump/public/workspace/turbine-fulcrum/cache/pom.xml



    The following work was performed:
    http://vmgump.apache.org/gump/public/turbine-fulcrum/fulcrum-cache-test/gump_work/build_turbine-fulcrum_fulcrum-cache-test.html
    Work Name: build_turbine-fulcrum_fulcrum-cache-test (Type: Build)
    Work ended in a state of : Failed
    Elapsed: 6 mins 57 secs
    Command Line: /opt/maven2/bin/mvn --batch-mode --settings /srv/gump/public/workspace/turbine-fulcrum/cache/gump_mvn_settings.xml test
    [Working Directory: /srv/gump/public/workspace/turbine-fulcrum/cache]
    M2_HOME: /opt/maven2
    ---------------------------------------------
    [DEBUG] Disposing all services
    [DEBUG] Decommision the service jcscache
    [DEBUG] Decommisioning the service jcscache
    [DEBUG] Disposable.dispose() for jcscache
    May 9, 2012 7:13:59 AM org.apache.jcs.engine.control.CompositeCache dispose
    INFO: In DISPOSE, [Cache_Test] fromRemote [false]
    Region Name = Cache_Test
    HitCountRam = 308
    HitCountAux = 0
    ---------------------------LRU Memory Cache
    List Size = 3
    Map Size = 3
    Put Count = 23
    Hit Count = 309
    Miss Count = 1
    [DEBUG] JCSCacheService stopped.
    [DEBUG] Decommision the service ehcache
    [DEBUG] Decommisioning the service ehcache
    [DEBUG] Disposable.dispose() for ehcache
    [DEBUG] EHCacheService stopped!
    [DEBUG] Decommision the service cache
    [DEBUG] Decommisioning the service cache
    [DEBUG] Disposable.dispose() for cache
    [DEBUG] Disposing the service jcscache
    [DEBUG] Disposing the service ehcache
    [DEBUG] Disposing the service cache
    [DEBUG] All services are disposed
    [INFO] YaffiContainer has been disposed.
    Tests run: 10, Failures: 0, Errors: 0, Skipped: 0, Time elapsed: 142.17 sec

    Results :

    Failed tests:
    testObjectCount(org.apache.fulcrum.cache.JCSCacheTest)

    Tests run: 30, Failures: 1, Errors: 0, Skipped: 0

    [INFO] ------------------------------------------------------------------------
    [ERROR] BUILD FAILURE
    [INFO] ------------------------------------------------------------------------
    [INFO] There are test failures.

    Please refer to /srv/gump/public/workspace/turbine-fulcrum/cache/target/surefire-reports for the individual test results.
    [INFO] ------------------------------------------------------------------------
    [INFO] For more information, run Maven with the -e switch
    [INFO] ------------------------------------------------------------------------
    [INFO] Total time: 6 minutes 56 seconds
    [INFO] Finished at: Wed May 09 07:13:59 UTC 2012
    [INFO] Final Memory: 14M/35M
    [INFO] ------------------------------------------------------------------------
    ---------------------------------------------

    To subscribe to this information via syndicated feeds:
    - RSS: http://vmgump.apache.org/gump/public/turbine-fulcrum/fulcrum-cache-test/rss.xml
    - Atom: http://vmgump.apache.org/gump/public/turbine-fulcrum/fulcrum-cache-test/atom.xml

    ============================== Gump Tracking Only ===
    Produced by Apache Gump(TM) version 2.3.
    Gump Run 12000009052012, vmgump.apache.org:vmgump:12000009052012
    Gump E-mail Identifier (unique within run) #57.

    --
    Apache Gump
    http://gump.apache.org/ [Instance: vmgump]

    ---------------------------------------------------------------------
    To unsubscribe, e-mail: dev-unsubscribe@turbine.apache.org
    For additional commands, e-mail: dev-help@turbine.apache.org
  • Anonymous at May 10, 2012 at 6:53 am
    To whom it may engage...

    This is an automated request, but not an unsolicited one. For
    more information please visit http://gump.apache.org/nagged.html,
    and/or contact the folk at general@gump.apache.org.

    Project fulcrum-cache-test has an issue affecting its community integration.
    This issue affects 1 projects,
    and has been outstanding for 155 runs.
    The current state of this project is 'Failed', with reason 'Build Failed'.
    For reference only, the following projects are affected by this:
    - fulcrum-cache-test : Services Framework


    Full details are available at:
    http://vmgump.apache.org/gump/public/turbine-fulcrum/fulcrum-cache-test/index.html

    That said, some information snippets are provided here.

    The following annotations (debug/informational/warning/error messages) were provided:
    -WARNING- Overriding Maven settings: [/srv/gump/public/workspace/turbine-fulcrum/cache/gump_mvn_settings.xml]
    -DEBUG- (Apache Gump generated) Apache Maven Settings in: /srv/gump/public/workspace/turbine-fulcrum/cache/gump_mvn_settings.xml
    -INFO- Failed with reason build failed
    -DEBUG- Maven POM in: /srv/gump/public/workspace/turbine-fulcrum/cache/pom.xml



    The following work was performed:
    http://vmgump.apache.org/gump/public/turbine-fulcrum/fulcrum-cache-test/gump_work/build_turbine-fulcrum_fulcrum-cache-test.html
    Work Name: build_turbine-fulcrum_fulcrum-cache-test (Type: Build)
    Work ended in a state of : Failed
    Elapsed: 6 mins 57 secs
    Command Line: /opt/maven2/bin/mvn --batch-mode --settings /srv/gump/public/workspace/turbine-fulcrum/cache/gump_mvn_settings.xml test
    [Working Directory: /srv/gump/public/workspace/turbine-fulcrum/cache]
    M2_HOME: /opt/maven2
    ---------------------------------------------
    INFO: In DISPOSE, [Cache_Test] fromRemote [false]
    Region Name = Cache_Test
    HitCountRam = 308
    HitCountAux = 0
    ---------------------------LRU Memory Cache
    List Size = 3
    Map Size = 3
    Put Count = 23
    Hit Count = 309
    Miss Count = 1
    [DEBUG] Disposing of container...
    [DEBUG] Disposing all services
    [DEBUG] Decommision the service jcscache
    [DEBUG] Decommisioning the service jcscache
    [DEBUG] Disposable.dispose() for jcscache
    [DEBUG] JCSCacheService stopped.
    [DEBUG] Decommision the service ehcache
    [DEBUG] Decommisioning the service ehcache
    [DEBUG] Disposable.dispose() for ehcache
    [DEBUG] EHCacheService stopped!
    [DEBUG] Decommision the service cache
    [DEBUG] Decommisioning the service cache
    [DEBUG] Disposable.dispose() for cache
    [DEBUG] Disposing the service jcscache
    [DEBUG] Disposing the service ehcache
    [DEBUG] Disposing the service cache
    [DEBUG] All services are disposed
    [INFO] YaffiContainer has been disposed.
    Tests run: 10, Failures: 0, Errors: 0, Skipped: 0, Time elapsed: 142.281 sec

    Results :

    Failed tests:
    testObjectCount(org.apache.fulcrum.cache.JCSCacheTest)

    Tests run: 30, Failures: 1, Errors: 0, Skipped: 0

    [INFO] ------------------------------------------------------------------------
    [ERROR] BUILD FAILURE
    [INFO] ------------------------------------------------------------------------
    [INFO] There are test failures.

    Please refer to /srv/gump/public/workspace/turbine-fulcrum/cache/target/surefire-reports for the individual test results.
    [INFO] ------------------------------------------------------------------------
    [INFO] For more information, run Maven with the -e switch
    [INFO] ------------------------------------------------------------------------
    [INFO] Total time: 6 minutes 56 seconds
    [INFO] Finished at: Thu May 10 06:52:27 UTC 2012
    [INFO] Final Memory: 14M/35M
    [INFO] ------------------------------------------------------------------------
    ---------------------------------------------

    To subscribe to this information via syndicated feeds:
    - RSS: http://vmgump.apache.org/gump/public/turbine-fulcrum/fulcrum-cache-test/rss.xml
    - Atom: http://vmgump.apache.org/gump/public/turbine-fulcrum/fulcrum-cache-test/atom.xml

    ============================== Gump Tracking Only ===
    Produced by Apache Gump(TM) version 2.3.
    Gump Run 13000010052012, vmgump.apache.org:vmgump:13000010052012
    Gump E-mail Identifier (unique within run) #57.

    --
    Apache Gump
    http://gump.apache.org/ [Instance: vmgump]

    ---------------------------------------------------------------------
    To unsubscribe, e-mail: dev-unsubscribe@turbine.apache.org
    For additional commands, e-mail: dev-help@turbine.apache.org
  • Anonymous at May 11, 2012 at 7:09 am
    To whom it may engage...

    This is an automated request, but not an unsolicited one. For
    more information please visit http://gump.apache.org/nagged.html,
    and/or contact the folk at general@gump.apache.org.

    Project fulcrum-cache-test has an issue affecting its community integration.
    This issue affects 1 projects,
    and has been outstanding for 157 runs.
    The current state of this project is 'Failed', with reason 'Build Failed'.
    For reference only, the following projects are affected by this:
    - fulcrum-cache-test : Services Framework


    Full details are available at:
    http://vmgump.apache.org/gump/public/turbine-fulcrum/fulcrum-cache-test/index.html

    That said, some information snippets are provided here.

    The following annotations (debug/informational/warning/error messages) were provided:
    -WARNING- Overriding Maven settings: [/srv/gump/public/workspace/turbine-fulcrum/cache/gump_mvn_settings.xml]
    -DEBUG- (Apache Gump generated) Apache Maven Settings in: /srv/gump/public/workspace/turbine-fulcrum/cache/gump_mvn_settings.xml
    -INFO- Failed with reason build failed
    -DEBUG- Maven POM in: /srv/gump/public/workspace/turbine-fulcrum/cache/pom.xml



    The following work was performed:
    http://vmgump.apache.org/gump/public/turbine-fulcrum/fulcrum-cache-test/gump_work/build_turbine-fulcrum_fulcrum-cache-test.html
    Work Name: build_turbine-fulcrum_fulcrum-cache-test (Type: Build)
    Work ended in a state of : Failed
    Elapsed: 6 mins 57 secs
    Command Line: /opt/maven2/bin/mvn --batch-mode --settings /srv/gump/public/workspace/turbine-fulcrum/cache/gump_mvn_settings.xml test
    [Working Directory: /srv/gump/public/workspace/turbine-fulcrum/cache]
    M2_HOME: /opt/maven2
    ---------------------------------------------
    INFO: In DISPOSE, [Cache_Test] fromRemote [false]
    Region Name = Cache_Test
    HitCountRam = 308
    HitCountAux = 0
    ---------------------------LRU Memory Cache
    List Size = 3
    Map Size = 3
    Put Count = 23
    Hit Count = 309
    Miss Count = 1
    [DEBUG] Disposing of container...
    [DEBUG] Disposing all services
    [DEBUG] Decommision the service jcscache
    [DEBUG] Decommisioning the service jcscache
    [DEBUG] Disposable.dispose() for jcscache
    [DEBUG] JCSCacheService stopped.
    [DEBUG] Decommision the service ehcache
    [DEBUG] Decommisioning the service ehcache
    [DEBUG] Disposable.dispose() for ehcache
    [DEBUG] EHCacheService stopped!
    [DEBUG] Decommision the service cache
    [DEBUG] Decommisioning the service cache
    [DEBUG] Disposable.dispose() for cache
    [DEBUG] Disposing the service jcscache
    [DEBUG] Disposing the service ehcache
    [DEBUG] Disposing the service cache
    [DEBUG] All services are disposed
    [INFO] YaffiContainer has been disposed.
    Tests run: 10, Failures: 0, Errors: 0, Skipped: 0, Time elapsed: 142.148 sec

    Results :

    Failed tests:
    testObjectCount(org.apache.fulcrum.cache.JCSCacheTest)

    Tests run: 30, Failures: 1, Errors: 0, Skipped: 0

    [INFO] ------------------------------------------------------------------------
    [ERROR] BUILD FAILURE
    [INFO] ------------------------------------------------------------------------
    [INFO] There are test failures.

    Please refer to /srv/gump/public/workspace/turbine-fulcrum/cache/target/surefire-reports for the individual test results.
    [INFO] ------------------------------------------------------------------------
    [INFO] For more information, run Maven with the -e switch
    [INFO] ------------------------------------------------------------------------
    [INFO] Total time: 6 minutes 56 seconds
    [INFO] Finished at: Fri May 11 07:08:30 UTC 2012
    [INFO] Final Memory: 14M/35M
    [INFO] ------------------------------------------------------------------------
    ---------------------------------------------

    To subscribe to this information via syndicated feeds:
    - RSS: http://vmgump.apache.org/gump/public/turbine-fulcrum/fulcrum-cache-test/rss.xml
    - Atom: http://vmgump.apache.org/gump/public/turbine-fulcrum/fulcrum-cache-test/atom.xml

    ============================== Gump Tracking Only ===
    Produced by Apache Gump(TM) version 2.3.
    Gump Run 13000011052012, vmgump.apache.org:vmgump:13000011052012
    Gump E-mail Identifier (unique within run) #57.

    --
    Apache Gump
    http://gump.apache.org/ [Instance: vmgump]

    ---------------------------------------------------------------------
    To unsubscribe, e-mail: dev-unsubscribe@turbine.apache.org
    For additional commands, e-mail: dev-help@turbine.apache.org
  • Anonymous at May 12, 2012 at 7:15 am
    To whom it may engage...

    This is an automated request, but not an unsolicited one. For
    more information please visit http://gump.apache.org/nagged.html,
    and/or contact the folk at general@gump.apache.org.

    Project fulcrum-cache-test has an issue affecting its community integration.
    This issue affects 1 projects,
    and has been outstanding for 159 runs.
    The current state of this project is 'Failed', with reason 'Build Failed'.
    For reference only, the following projects are affected by this:
    - fulcrum-cache-test : Services Framework


    Full details are available at:
    http://vmgump.apache.org/gump/public/turbine-fulcrum/fulcrum-cache-test/index.html

    That said, some information snippets are provided here.

    The following annotations (debug/informational/warning/error messages) were provided:
    -WARNING- Overriding Maven settings: [/srv/gump/public/workspace/turbine-fulcrum/cache/gump_mvn_settings.xml]
    -DEBUG- (Apache Gump generated) Apache Maven Settings in: /srv/gump/public/workspace/turbine-fulcrum/cache/gump_mvn_settings.xml
    -INFO- Failed with reason build failed
    -DEBUG- Maven POM in: /srv/gump/public/workspace/turbine-fulcrum/cache/pom.xml



    The following work was performed:
    http://vmgump.apache.org/gump/public/turbine-fulcrum/fulcrum-cache-test/gump_work/build_turbine-fulcrum_fulcrum-cache-test.html
    Work Name: build_turbine-fulcrum_fulcrum-cache-test (Type: Build)
    Work ended in a state of : Failed
    Elapsed: 7 mins 1 sec
    Command Line: /opt/maven2/bin/mvn --batch-mode --settings /srv/gump/public/workspace/turbine-fulcrum/cache/gump_mvn_settings.xml test
    [Working Directory: /srv/gump/public/workspace/turbine-fulcrum/cache]
    M2_HOME: /opt/maven2
    ---------------------------------------------
    INFO: In DISPOSE, [Cache_Test] fromRemote [false]
    Region Name = Cache_Test
    HitCountRam = 308
    HitCountAux = 0
    ---------------------------LRU Memory Cache
    List Size = 3
    Map Size = 3
    Put Count = 23
    Hit Count = 309
    Miss Count = 1
    [DEBUG] Disposing of container...
    [DEBUG] Disposing all services
    [DEBUG] Decommision the service jcscache
    [DEBUG] Decommisioning the service jcscache
    [DEBUG] Disposable.dispose() for jcscache
    [DEBUG] JCSCacheService stopped.
    [DEBUG] Decommision the service ehcache
    [DEBUG] Decommisioning the service ehcache
    [DEBUG] Disposable.dispose() for ehcache
    [DEBUG] EHCacheService stopped!
    [DEBUG] Decommision the service cache
    [DEBUG] Decommisioning the service cache
    [DEBUG] Disposable.dispose() for cache
    [DEBUG] Disposing the service jcscache
    [DEBUG] Disposing the service ehcache
    [DEBUG] Disposing the service cache
    [DEBUG] All services are disposed
    [INFO] YaffiContainer has been disposed.
    Tests run: 10, Failures: 0, Errors: 0, Skipped: 0, Time elapsed: 142.185 sec

    Results :

    Failed tests:
    testObjectCount(org.apache.fulcrum.cache.JCSCacheTest)

    Tests run: 30, Failures: 1, Errors: 0, Skipped: 0

    [INFO] ------------------------------------------------------------------------
    [ERROR] BUILD FAILURE
    [INFO] ------------------------------------------------------------------------
    [INFO] There are test failures.

    Please refer to /srv/gump/public/workspace/turbine-fulcrum/cache/target/surefire-reports for the individual test results.
    [INFO] ------------------------------------------------------------------------
    [INFO] For more information, run Maven with the -e switch
    [INFO] ------------------------------------------------------------------------
    [INFO] Total time: 6 minutes 59 seconds
    [INFO] Finished at: Sat May 12 07:14:51 UTC 2012
    [INFO] Final Memory: 14M/35M
    [INFO] ------------------------------------------------------------------------
    ---------------------------------------------

    To subscribe to this information via syndicated feeds:
    - RSS: http://vmgump.apache.org/gump/public/turbine-fulcrum/fulcrum-cache-test/rss.xml
    - Atom: http://vmgump.apache.org/gump/public/turbine-fulcrum/fulcrum-cache-test/atom.xml

    ============================== Gump Tracking Only ===
    Produced by Apache Gump(TM) version 2.3.
    Gump Run 11000012052012, vmgump.apache.org:vmgump:11000012052012
    Gump E-mail Identifier (unique within run) #55.

    --
    Apache Gump
    http://gump.apache.org/ [Instance: vmgump]

    ---------------------------------------------------------------------
    To unsubscribe, e-mail: dev-unsubscribe@turbine.apache.org
    For additional commands, e-mail: dev-help@turbine.apache.org
  • Anonymous at May 13, 2012 at 7:05 am
    To whom it may engage...

    This is an automated request, but not an unsolicited one. For
    more information please visit http://gump.apache.org/nagged.html,
    and/or contact the folk at general@gump.apache.org.

    Project fulcrum-cache-test has an issue affecting its community integration.
    This issue affects 1 projects,
    and has been outstanding for 161 runs.
    The current state of this project is 'Failed', with reason 'Build Failed'.
    For reference only, the following projects are affected by this:
    - fulcrum-cache-test : Services Framework


    Full details are available at:
    http://vmgump.apache.org/gump/public/turbine-fulcrum/fulcrum-cache-test/index.html

    That said, some information snippets are provided here.

    The following annotations (debug/informational/warning/error messages) were provided:
    -WARNING- Overriding Maven settings: [/srv/gump/public/workspace/turbine-fulcrum/cache/gump_mvn_settings.xml]
    -DEBUG- (Apache Gump generated) Apache Maven Settings in: /srv/gump/public/workspace/turbine-fulcrum/cache/gump_mvn_settings.xml
    -INFO- Failed with reason build failed
    -DEBUG- Maven POM in: /srv/gump/public/workspace/turbine-fulcrum/cache/pom.xml



    The following work was performed:
    http://vmgump.apache.org/gump/public/turbine-fulcrum/fulcrum-cache-test/gump_work/build_turbine-fulcrum_fulcrum-cache-test.html
    Work Name: build_turbine-fulcrum_fulcrum-cache-test (Type: Build)
    Work ended in a state of : Failed
    Elapsed: 6 mins 59 secs
    Command Line: /opt/maven2/bin/mvn --batch-mode --settings /srv/gump/public/workspace/turbine-fulcrum/cache/gump_mvn_settings.xml test
    [Working Directory: /srv/gump/public/workspace/turbine-fulcrum/cache]
    M2_HOME: /opt/maven2
    ---------------------------------------------
    [DEBUG] Disposing all services
    [DEBUG] Decommision the service jcscache
    [DEBUG] Decommisioning the service jcscache
    [DEBUG] Disposable.dispose() for jcscache
    May 13, 2012 7:05:04 AM org.apache.jcs.engine.control.CompositeCache dispose
    INFO: In DISPOSE, [Cache_Test] fromRemote [false]
    Region Name = Cache_Test
    HitCountRam = 308
    HitCountAux = 0
    ---------------------------LRU Memory Cache
    List Size = 3
    Map Size = 3
    Put Count = 23
    Hit Count = 309
    Miss Count = 1
    [DEBUG] JCSCacheService stopped.
    [DEBUG] Decommision the service ehcache
    [DEBUG] Decommisioning the service ehcache
    [DEBUG] Disposable.dispose() for ehcache
    [DEBUG] EHCacheService stopped!
    [DEBUG] Decommision the service cache
    [DEBUG] Decommisioning the service cache
    [DEBUG] Disposable.dispose() for cache
    [DEBUG] Disposing the service jcscache
    [DEBUG] Disposing the service ehcache
    [DEBUG] Disposing the service cache
    [DEBUG] All services are disposed
    [INFO] YaffiContainer has been disposed.
    Tests run: 10, Failures: 0, Errors: 0, Skipped: 0, Time elapsed: 142.248 sec

    Results :

    Failed tests:
    testObjectCount(org.apache.fulcrum.cache.JCSCacheTest)

    Tests run: 30, Failures: 1, Errors: 0, Skipped: 0

    [INFO] ------------------------------------------------------------------------
    [ERROR] BUILD FAILURE
    [INFO] ------------------------------------------------------------------------
    [INFO] There are test failures.

    Please refer to /srv/gump/public/workspace/turbine-fulcrum/cache/target/surefire-reports for the individual test results.
    [INFO] ------------------------------------------------------------------------
    [INFO] For more information, run Maven with the -e switch
    [INFO] ------------------------------------------------------------------------
    [INFO] Total time: 6 minutes 58 seconds
    [INFO] Finished at: Sun May 13 07:05:04 UTC 2012
    [INFO] Final Memory: 14M/35M
    [INFO] ------------------------------------------------------------------------
    ---------------------------------------------

    To subscribe to this information via syndicated feeds:
    - RSS: http://vmgump.apache.org/gump/public/turbine-fulcrum/fulcrum-cache-test/rss.xml
    - Atom: http://vmgump.apache.org/gump/public/turbine-fulcrum/fulcrum-cache-test/atom.xml

    ============================== Gump Tracking Only ===
    Produced by Apache Gump(TM) version 2.3.
    Gump Run 14000013052012, vmgump.apache.org:vmgump:14000013052012
    Gump E-mail Identifier (unique within run) #55.

    --
    Apache Gump
    http://gump.apache.org/ [Instance: vmgump]

    ---------------------------------------------------------------------
    To unsubscribe, e-mail: dev-unsubscribe@turbine.apache.org
    For additional commands, e-mail: dev-help@turbine.apache.org
  • Anonymous at May 14, 2012 at 7:01 am
    To whom it may engage...

    This is an automated request, but not an unsolicited one. For
    more information please visit http://gump.apache.org/nagged.html,
    and/or contact the folk at general@gump.apache.org.

    Project fulcrum-cache-test has an issue affecting its community integration.
    This issue affects 1 projects,
    and has been outstanding for 163 runs.
    The current state of this project is 'Failed', with reason 'Build Failed'.
    For reference only, the following projects are affected by this:
    - fulcrum-cache-test : Services Framework


    Full details are available at:
    http://vmgump.apache.org/gump/public/turbine-fulcrum/fulcrum-cache-test/index.html

    That said, some information snippets are provided here.

    The following annotations (debug/informational/warning/error messages) were provided:
    -WARNING- Overriding Maven settings: [/srv/gump/public/workspace/turbine-fulcrum/cache/gump_mvn_settings.xml]
    -DEBUG- (Apache Gump generated) Apache Maven Settings in: /srv/gump/public/workspace/turbine-fulcrum/cache/gump_mvn_settings.xml
    -INFO- Failed with reason build failed
    -DEBUG- Maven POM in: /srv/gump/public/workspace/turbine-fulcrum/cache/pom.xml



    The following work was performed:
    http://vmgump.apache.org/gump/public/turbine-fulcrum/fulcrum-cache-test/gump_work/build_turbine-fulcrum_fulcrum-cache-test.html
    Work Name: build_turbine-fulcrum_fulcrum-cache-test (Type: Build)
    Work ended in a state of : Failed
    Elapsed: 6 mins 59 secs
    Command Line: /opt/maven2/bin/mvn --batch-mode --settings /srv/gump/public/workspace/turbine-fulcrum/cache/gump_mvn_settings.xml test
    [Working Directory: /srv/gump/public/workspace/turbine-fulcrum/cache]
    M2_HOME: /opt/maven2
    ---------------------------------------------
    INFO: In DISPOSE, [Cache_Test] fromRemote [false]
    Region Name = Cache_Test
    HitCountRam = 305
    HitCountAux = 0
    ---------------------------LRU Memory Cache
    List Size = 3
    Map Size = 3
    Put Count = 23
    Hit Count = 306
    Miss Count = 1
    [DEBUG] Disposing of container...
    [DEBUG] Disposing all services
    [DEBUG] Decommision the service jcscache
    [DEBUG] Decommisioning the service jcscache
    [DEBUG] Disposable.dispose() for jcscache
    [DEBUG] JCSCacheService stopped.
    [DEBUG] Decommision the service ehcache
    [DEBUG] Decommisioning the service ehcache
    [DEBUG] Disposable.dispose() for ehcache
    [DEBUG] EHCacheService stopped!
    [DEBUG] Decommision the service cache
    [DEBUG] Decommisioning the service cache
    [DEBUG] Disposable.dispose() for cache
    [DEBUG] Disposing the service jcscache
    [DEBUG] Disposing the service ehcache
    [DEBUG] Disposing the service cache
    [DEBUG] All services are disposed
    [INFO] YaffiContainer has been disposed.
    Tests run: 10, Failures: 0, Errors: 0, Skipped: 0, Time elapsed: 142.303 sec

    Results :

    Failed tests:
    testObjectCount(org.apache.fulcrum.cache.JCSCacheTest)

    Tests run: 30, Failures: 1, Errors: 0, Skipped: 0

    [INFO] ------------------------------------------------------------------------
    [ERROR] BUILD FAILURE
    [INFO] ------------------------------------------------------------------------
    [INFO] There are test failures.

    Please refer to /srv/gump/public/workspace/turbine-fulcrum/cache/target/surefire-reports for the individual test results.
    [INFO] ------------------------------------------------------------------------
    [INFO] For more information, run Maven with the -e switch
    [INFO] ------------------------------------------------------------------------
    [INFO] Total time: 6 minutes 58 seconds
    [INFO] Finished at: Mon May 14 07:01:15 UTC 2012
    [INFO] Final Memory: 14M/35M
    [INFO] ------------------------------------------------------------------------
    ---------------------------------------------

    To subscribe to this information via syndicated feeds:
    - RSS: http://vmgump.apache.org/gump/public/turbine-fulcrum/fulcrum-cache-test/rss.xml
    - Atom: http://vmgump.apache.org/gump/public/turbine-fulcrum/fulcrum-cache-test/atom.xml

    ============================== Gump Tracking Only ===
    Produced by Apache Gump(TM) version 2.3.
    Gump Run 13000014052012, vmgump.apache.org:vmgump:13000014052012
    Gump E-mail Identifier (unique within run) #56.

    --
    Apache Gump
    http://gump.apache.org/ [Instance: vmgump]

    ---------------------------------------------------------------------
    To unsubscribe, e-mail: dev-unsubscribe@turbine.apache.org
    For additional commands, e-mail: dev-help@turbine.apache.org
  • Anonymous at May 15, 2012 at 7:11 am
    To whom it may engage...

    This is an automated request, but not an unsolicited one. For
    more information please visit http://gump.apache.org/nagged.html,
    and/or contact the folk at general@gump.apache.org.

    Project fulcrum-cache-test has an issue affecting its community integration.
    This issue affects 1 projects,
    and has been outstanding for 165 runs.
    The current state of this project is 'Failed', with reason 'Build Failed'.
    For reference only, the following projects are affected by this:
    - fulcrum-cache-test : Services Framework


    Full details are available at:
    http://vmgump.apache.org/gump/public/turbine-fulcrum/fulcrum-cache-test/index.html

    That said, some information snippets are provided here.

    The following annotations (debug/informational/warning/error messages) were provided:
    -WARNING- Overriding Maven settings: [/srv/gump/public/workspace/turbine-fulcrum/cache/gump_mvn_settings.xml]
    -DEBUG- (Apache Gump generated) Apache Maven Settings in: /srv/gump/public/workspace/turbine-fulcrum/cache/gump_mvn_settings.xml
    -INFO- Failed with reason build failed
    -DEBUG- Maven POM in: /srv/gump/public/workspace/turbine-fulcrum/cache/pom.xml



    The following work was performed:
    http://vmgump.apache.org/gump/public/turbine-fulcrum/fulcrum-cache-test/gump_work/build_turbine-fulcrum_fulcrum-cache-test.html
    Work Name: build_turbine-fulcrum_fulcrum-cache-test (Type: Build)
    Work ended in a state of : Failed
    Elapsed: 6 mins 57 secs
    Command Line: /opt/maven2/bin/mvn --batch-mode --settings /srv/gump/public/workspace/turbine-fulcrum/cache/gump_mvn_settings.xml test
    [Working Directory: /srv/gump/public/workspace/turbine-fulcrum/cache]
    M2_HOME: /opt/maven2
    ---------------------------------------------
    [DEBUG] Disposing all services
    [DEBUG] Decommision the service jcscache
    [DEBUG] Decommisioning the service jcscache
    [DEBUG] Disposable.dispose() for jcscache
    May 15, 2012 7:11:10 AM org.apache.jcs.engine.control.CompositeCache dispose
    INFO: In DISPOSE, [Cache_Test] fromRemote [false]
    Region Name = Cache_Test
    HitCountRam = 305
    HitCountAux = 0
    ---------------------------LRU Memory Cache
    List Size = 3
    Map Size = 3
    Put Count = 23
    Hit Count = 306
    Miss Count = 1
    [DEBUG] JCSCacheService stopped.
    [DEBUG] Decommision the service ehcache
    [DEBUG] Decommisioning the service ehcache
    [DEBUG] Disposable.dispose() for ehcache
    [DEBUG] EHCacheService stopped!
    [DEBUG] Decommision the service cache
    [DEBUG] Decommisioning the service cache
    [DEBUG] Disposable.dispose() for cache
    [DEBUG] Disposing the service jcscache
    [DEBUG] Disposing the service ehcache
    [DEBUG] Disposing the service cache
    [DEBUG] All services are disposed
    [INFO] YaffiContainer has been disposed.
    Tests run: 10, Failures: 0, Errors: 0, Skipped: 0, Time elapsed: 142.153 sec

    Results :

    Failed tests:
    testObjectCount(org.apache.fulcrum.cache.JCSCacheTest)

    Tests run: 30, Failures: 1, Errors: 0, Skipped: 0

    [INFO] ------------------------------------------------------------------------
    [ERROR] BUILD FAILURE
    [INFO] ------------------------------------------------------------------------
    [INFO] There are test failures.

    Please refer to /srv/gump/public/workspace/turbine-fulcrum/cache/target/surefire-reports for the individual test results.
    [INFO] ------------------------------------------------------------------------
    [INFO] For more information, run Maven with the -e switch
    [INFO] ------------------------------------------------------------------------
    [INFO] Total time: 6 minutes 56 seconds
    [INFO] Finished at: Tue May 15 07:11:10 UTC 2012
    [INFO] Final Memory: 14M/35M
    [INFO] ------------------------------------------------------------------------
    ---------------------------------------------

    To subscribe to this information via syndicated feeds:
    - RSS: http://vmgump.apache.org/gump/public/turbine-fulcrum/fulcrum-cache-test/rss.xml
    - Atom: http://vmgump.apache.org/gump/public/turbine-fulcrum/fulcrum-cache-test/atom.xml

    ============================== Gump Tracking Only ===
    Produced by Apache Gump(TM) version 2.3.
    Gump Run 12000015052012, vmgump.apache.org:vmgump:12000015052012
    Gump E-mail Identifier (unique within run) #55.

    --
    Apache Gump
    http://gump.apache.org/ [Instance: vmgump]

    ---------------------------------------------------------------------
    To unsubscribe, e-mail: dev-unsubscribe@turbine.apache.org
    For additional commands, e-mail: dev-help@turbine.apache.org
  • Anonymous at May 16, 2012 at 7:08 am
    To whom it may engage...

    This is an automated request, but not an unsolicited one. For
    more information please visit http://gump.apache.org/nagged.html,
    and/or contact the folk at general@gump.apache.org.

    Project fulcrum-cache-test has an issue affecting its community integration.
    This issue affects 1 projects,
    and has been outstanding for 167 runs.
    The current state of this project is 'Failed', with reason 'Build Failed'.
    For reference only, the following projects are affected by this:
    - fulcrum-cache-test : Services Framework


    Full details are available at:
    http://vmgump.apache.org/gump/public/turbine-fulcrum/fulcrum-cache-test/index.html

    That said, some information snippets are provided here.

    The following annotations (debug/informational/warning/error messages) were provided:
    -WARNING- Overriding Maven settings: [/srv/gump/public/workspace/turbine-fulcrum/cache/gump_mvn_settings.xml]
    -DEBUG- (Apache Gump generated) Apache Maven Settings in: /srv/gump/public/workspace/turbine-fulcrum/cache/gump_mvn_settings.xml
    -INFO- Failed with reason build failed
    -DEBUG- Maven POM in: /srv/gump/public/workspace/turbine-fulcrum/cache/pom.xml



    The following work was performed:
    http://vmgump.apache.org/gump/public/turbine-fulcrum/fulcrum-cache-test/gump_work/build_turbine-fulcrum_fulcrum-cache-test.html
    Work Name: build_turbine-fulcrum_fulcrum-cache-test (Type: Build)
    Work ended in a state of : Failed
    Elapsed: 6 mins 59 secs
    Command Line: /opt/maven2/bin/mvn --batch-mode --settings /srv/gump/public/workspace/turbine-fulcrum/cache/gump_mvn_settings.xml test
    [Working Directory: /srv/gump/public/workspace/turbine-fulcrum/cache]
    M2_HOME: /opt/maven2
    ---------------------------------------------
    INFO: In DISPOSE, [Cache_Test] fromRemote [false]
    Region Name = Cache_Test
    HitCountRam = 308
    HitCountAux = 0
    ---------------------------LRU Memory Cache
    List Size = 3
    Map Size = 3
    Put Count = 23
    Hit Count = 309
    Miss Count = 1
    [DEBUG] Disposing of container...
    [DEBUG] Disposing all services
    [DEBUG] Decommision the service jcscache
    [DEBUG] Decommisioning the service jcscache
    [DEBUG] Disposable.dispose() for jcscache
    [DEBUG] JCSCacheService stopped.
    [DEBUG] Decommision the service ehcache
    [DEBUG] Decommisioning the service ehcache
    [DEBUG] Disposable.dispose() for ehcache
    [DEBUG] EHCacheService stopped!
    [DEBUG] Decommision the service cache
    [DEBUG] Decommisioning the service cache
    [DEBUG] Disposable.dispose() for cache
    [DEBUG] Disposing the service jcscache
    [DEBUG] Disposing the service ehcache
    [DEBUG] Disposing the service cache
    [DEBUG] All services are disposed
    [INFO] YaffiContainer has been disposed.
    Tests run: 10, Failures: 0, Errors: 0, Skipped: 0, Time elapsed: 142.152 sec

    Results :

    Failed tests:
    testObjectCount(org.apache.fulcrum.cache.JCSCacheTest)

    Tests run: 30, Failures: 1, Errors: 0, Skipped: 0

    [INFO] ------------------------------------------------------------------------
    [ERROR] BUILD FAILURE
    [INFO] ------------------------------------------------------------------------
    [INFO] There are test failures.

    Please refer to /srv/gump/public/workspace/turbine-fulcrum/cache/target/surefire-reports for the individual test results.
    [INFO] ------------------------------------------------------------------------
    [INFO] For more information, run Maven with the -e switch
    [INFO] ------------------------------------------------------------------------
    [INFO] Total time: 6 minutes 58 seconds
    [INFO] Finished at: Wed May 16 07:07:24 UTC 2012
    [INFO] Final Memory: 14M/35M
    [INFO] ------------------------------------------------------------------------
    ---------------------------------------------

    To subscribe to this information via syndicated feeds:
    - RSS: http://vmgump.apache.org/gump/public/turbine-fulcrum/fulcrum-cache-test/rss.xml
    - Atom: http://vmgump.apache.org/gump/public/turbine-fulcrum/fulcrum-cache-test/atom.xml

    ============================== Gump Tracking Only ===
    Produced by Apache Gump(TM) version 2.3.
    Gump Run 10000016052012, vmgump.apache.org:vmgump:10000016052012
    Gump E-mail Identifier (unique within run) #55.

    --
    Apache Gump
    http://gump.apache.org/ [Instance: vmgump]

    ---------------------------------------------------------------------
    To unsubscribe, e-mail: dev-unsubscribe@turbine.apache.org
    For additional commands, e-mail: dev-help@turbine.apache.org
  • Anonymous at May 17, 2012 at 7:08 am
    To whom it may engage...

    This is an automated request, but not an unsolicited one. For
    more information please visit http://gump.apache.org/nagged.html,
    and/or contact the folk at general@gump.apache.org.

    Project fulcrum-cache-test has an issue affecting its community integration.
    This issue affects 1 projects,
    and has been outstanding for 169 runs.
    The current state of this project is 'Failed', with reason 'Build Failed'.
    For reference only, the following projects are affected by this:
    - fulcrum-cache-test : Services Framework


    Full details are available at:
    http://vmgump.apache.org/gump/public/turbine-fulcrum/fulcrum-cache-test/index.html

    That said, some information snippets are provided here.

    The following annotations (debug/informational/warning/error messages) were provided:
    -WARNING- Overriding Maven settings: [/srv/gump/public/workspace/turbine-fulcrum/cache/gump_mvn_settings.xml]
    -DEBUG- (Apache Gump generated) Apache Maven Settings in: /srv/gump/public/workspace/turbine-fulcrum/cache/gump_mvn_settings.xml
    -INFO- Failed with reason build failed
    -DEBUG- Maven POM in: /srv/gump/public/workspace/turbine-fulcrum/cache/pom.xml



    The following work was performed:
    http://vmgump.apache.org/gump/public/turbine-fulcrum/fulcrum-cache-test/gump_work/build_turbine-fulcrum_fulcrum-cache-test.html
    Work Name: build_turbine-fulcrum_fulcrum-cache-test (Type: Build)
    Work ended in a state of : Failed
    Elapsed: 6 mins 57 secs
    Command Line: /opt/maven2/bin/mvn --batch-mode --settings /srv/gump/public/workspace/turbine-fulcrum/cache/gump_mvn_settings.xml test
    [Working Directory: /srv/gump/public/workspace/turbine-fulcrum/cache]
    M2_HOME: /opt/maven2
    ---------------------------------------------
    May 17, 2012 7:07:43 AM org.apache.jcs.engine.control.CompositeCache dispose
    INFO: In DISPOSE, [Cache_Test] fromRemote [false]
    Region Name = Cache_Test
    HitCountRam = 308
    HitCountAux = 0
    ---------------------------LRU Memory Cache
    List Size = 3
    Map Size = 3
    Put Count = 23
    Hit Count = 309
    Miss Count = 1
    [DEBUG] Disposing all services
    [DEBUG] Decommision the service jcscache
    [DEBUG] Decommisioning the service jcscache
    [DEBUG] Disposable.dispose() for jcscache
    [DEBUG] JCSCacheService stopped.
    [DEBUG] Decommision the service ehcache
    [DEBUG] Decommisioning the service ehcache
    [DEBUG] Disposable.dispose() for ehcache
    [DEBUG] EHCacheService stopped!
    [DEBUG] Decommision the service cache
    [DEBUG] Decommisioning the service cache
    [DEBUG] Disposable.dispose() for cache
    [DEBUG] Disposing the service jcscache
    [DEBUG] Disposing the service ehcache
    [DEBUG] Disposing the service cache
    [DEBUG] All services are disposed
    [INFO] YaffiContainer has been disposed.
    Tests run: 10, Failures: 0, Errors: 0, Skipped: 0, Time elapsed: 142.153 sec

    Results :

    Failed tests:
    testObjectCount(org.apache.fulcrum.cache.JCSCacheTest)

    Tests run: 30, Failures: 1, Errors: 0, Skipped: 0

    [INFO] ------------------------------------------------------------------------
    [ERROR] BUILD FAILURE
    [INFO] ------------------------------------------------------------------------
    [INFO] There are test failures.

    Please refer to /srv/gump/public/workspace/turbine-fulcrum/cache/target/surefire-reports for the individual test results.
    [INFO] ------------------------------------------------------------------------
    [INFO] For more information, run Maven with the -e switch
    [INFO] ------------------------------------------------------------------------
    [INFO] Total time: 6 minutes 56 seconds
    [INFO] Finished at: Thu May 17 07:07:43 UTC 2012
    [INFO] Final Memory: 14M/35M
    [INFO] ------------------------------------------------------------------------
    ---------------------------------------------

    To subscribe to this information via syndicated feeds:
    - RSS: http://vmgump.apache.org/gump/public/turbine-fulcrum/fulcrum-cache-test/rss.xml
    - Atom: http://vmgump.apache.org/gump/public/turbine-fulcrum/fulcrum-cache-test/atom.xml

    ============================== Gump Tracking Only ===
    Produced by Apache Gump(TM) version 2.3.
    Gump Run 12000017052012, vmgump.apache.org:vmgump:12000017052012
    Gump E-mail Identifier (unique within run) #57.

    --
    Apache Gump
    http://gump.apache.org/ [Instance: vmgump]

    ---------------------------------------------------------------------
    To unsubscribe, e-mail: dev-unsubscribe@turbine.apache.org
    For additional commands, e-mail: dev-help@turbine.apache.org
  • Anonymous at May 18, 2012 at 6:57 am
    To whom it may engage...

    This is an automated request, but not an unsolicited one. For
    more information please visit http://gump.apache.org/nagged.html,
    and/or contact the folk at general@gump.apache.org.

    Project fulcrum-cache-test has an issue affecting its community integration.
    This issue affects 1 projects,
    and has been outstanding for 171 runs.
    The current state of this project is 'Failed', with reason 'Build Failed'.
    For reference only, the following projects are affected by this:
    - fulcrum-cache-test : Services Framework


    Full details are available at:
    http://vmgump.apache.org/gump/public/turbine-fulcrum/fulcrum-cache-test/index.html

    That said, some information snippets are provided here.

    The following annotations (debug/informational/warning/error messages) were provided:
    -WARNING- Overriding Maven settings: [/srv/gump/public/workspace/turbine-fulcrum/cache/gump_mvn_settings.xml]
    -DEBUG- (Apache Gump generated) Apache Maven Settings in: /srv/gump/public/workspace/turbine-fulcrum/cache/gump_mvn_settings.xml
    -INFO- Failed with reason build failed
    -DEBUG- Maven POM in: /srv/gump/public/workspace/turbine-fulcrum/cache/pom.xml



    The following work was performed:
    http://vmgump.apache.org/gump/public/turbine-fulcrum/fulcrum-cache-test/gump_work/build_turbine-fulcrum_fulcrum-cache-test.html
    Work Name: build_turbine-fulcrum_fulcrum-cache-test (Type: Build)
    Work ended in a state of : Failed
    Elapsed: 7 mins
    Command Line: /opt/maven2/bin/mvn --batch-mode --settings /srv/gump/public/workspace/turbine-fulcrum/cache/gump_mvn_settings.xml test
    [Working Directory: /srv/gump/public/workspace/turbine-fulcrum/cache]
    M2_HOME: /opt/maven2
    ---------------------------------------------
    INFO: In DISPOSE, [Cache_Test] fromRemote [false]
    Region Name = Cache_Test
    HitCountRam = 305
    HitCountAux = 0
    ---------------------------LRU Memory Cache
    List Size = 3
    Map Size = 3
    Put Count = 23
    Hit Count = 306
    Miss Count = 1
    [DEBUG] Disposing of container...
    [DEBUG] Disposing all services
    [DEBUG] Decommision the service jcscache
    [DEBUG] Decommisioning the service jcscache
    [DEBUG] Disposable.dispose() for jcscache
    [DEBUG] JCSCacheService stopped.
    [DEBUG] Decommision the service ehcache
    [DEBUG] Decommisioning the service ehcache
    [DEBUG] Disposable.dispose() for ehcache
    [DEBUG] EHCacheService stopped!
    [DEBUG] Decommision the service cache
    [DEBUG] Decommisioning the service cache
    [DEBUG] Disposable.dispose() for cache
    [DEBUG] Disposing the service jcscache
    [DEBUG] Disposing the service ehcache
    [DEBUG] Disposing the service cache
    [DEBUG] All services are disposed
    [INFO] YaffiContainer has been disposed.
    Tests run: 10, Failures: 0, Errors: 0, Skipped: 0, Time elapsed: 142.558 sec

    Results :

    Failed tests:
    testObjectCount(org.apache.fulcrum.cache.JCSCacheTest)

    Tests run: 30, Failures: 1, Errors: 0, Skipped: 0

    [INFO] ------------------------------------------------------------------------
    [ERROR] BUILD FAILURE
    [INFO] ------------------------------------------------------------------------
    [INFO] There are test failures.

    Please refer to /srv/gump/public/workspace/turbine-fulcrum/cache/target/surefire-reports for the individual test results.
    [INFO] ------------------------------------------------------------------------
    [INFO] For more information, run Maven with the -e switch
    [INFO] ------------------------------------------------------------------------
    [INFO] Total time: 6 minutes 58 seconds
    [INFO] Finished at: Fri May 18 06:56:32 UTC 2012
    [INFO] Final Memory: 14M/35M
    [INFO] ------------------------------------------------------------------------
    ---------------------------------------------

    To subscribe to this information via syndicated feeds:
    - RSS: http://vmgump.apache.org/gump/public/turbine-fulcrum/fulcrum-cache-test/rss.xml
    - Atom: http://vmgump.apache.org/gump/public/turbine-fulcrum/fulcrum-cache-test/atom.xml

    ============================== Gump Tracking Only ===
    Produced by Apache Gump(TM) version 2.3.
    Gump Run 11000018052012, vmgump.apache.org:vmgump:11000018052012
    Gump E-mail Identifier (unique within run) #56.

    --
    Apache Gump
    http://gump.apache.org/ [Instance: vmgump]

    ---------------------------------------------------------------------
    To unsubscribe, e-mail: dev-unsubscribe@turbine.apache.org
    For additional commands, e-mail: dev-help@turbine.apache.org
  • Anonymous at May 19, 2012 at 7:03 am
    To whom it may engage...

    This is an automated request, but not an unsolicited one. For
    more information please visit http://gump.apache.org/nagged.html,
    and/or contact the folk at general@gump.apache.org.

    Project fulcrum-cache-test has an issue affecting its community integration.
    This issue affects 1 projects,
    and has been outstanding for 173 runs.
    The current state of this project is 'Failed', with reason 'Build Failed'.
    For reference only, the following projects are affected by this:
    - fulcrum-cache-test : Services Framework


    Full details are available at:
    http://vmgump.apache.org/gump/public/turbine-fulcrum/fulcrum-cache-test/index.html

    That said, some information snippets are provided here.

    The following annotations (debug/informational/warning/error messages) were provided:
    -WARNING- Overriding Maven settings: [/srv/gump/public/workspace/turbine-fulcrum/cache/gump_mvn_settings.xml]
    -DEBUG- (Apache Gump generated) Apache Maven Settings in: /srv/gump/public/workspace/turbine-fulcrum/cache/gump_mvn_settings.xml
    -INFO- Failed with reason build failed
    -DEBUG- Maven POM in: /srv/gump/public/workspace/turbine-fulcrum/cache/pom.xml



    The following work was performed:
    http://vmgump.apache.org/gump/public/turbine-fulcrum/fulcrum-cache-test/gump_work/build_turbine-fulcrum_fulcrum-cache-test.html
    Work Name: build_turbine-fulcrum_fulcrum-cache-test (Type: Build)
    Work ended in a state of : Failed
    Elapsed: 7 mins
    Command Line: /opt/maven2/bin/mvn --batch-mode --settings /srv/gump/public/workspace/turbine-fulcrum/cache/gump_mvn_settings.xml test
    [Working Directory: /srv/gump/public/workspace/turbine-fulcrum/cache]
    M2_HOME: /opt/maven2
    ---------------------------------------------
    INFO: In DISPOSE, [Cache_Test] fromRemote [false]
    Region Name = Cache_Test
    HitCountRam = 308
    HitCountAux = 0
    ---------------------------LRU Memory Cache
    List Size = 3
    Map Size = 3
    Put Count = 23
    Hit Count = 309
    Miss Count = 1
    [DEBUG] Disposing of container...
    [DEBUG] Disposing all services
    [DEBUG] Decommision the service jcscache
    [DEBUG] Decommisioning the service jcscache
    [DEBUG] Disposable.dispose() for jcscache
    [DEBUG] JCSCacheService stopped.
    [DEBUG] Decommision the service ehcache
    [DEBUG] Decommisioning the service ehcache
    [DEBUG] Disposable.dispose() for ehcache
    [DEBUG] EHCacheService stopped!
    [DEBUG] Decommision the service cache
    [DEBUG] Decommisioning the service cache
    [DEBUG] Disposable.dispose() for cache
    [DEBUG] Disposing the service jcscache
    [DEBUG] Disposing the service ehcache
    [DEBUG] Disposing the service cache
    [DEBUG] All services are disposed
    [INFO] YaffiContainer has been disposed.
    Tests run: 10, Failures: 0, Errors: 0, Skipped: 0, Time elapsed: 142.175 sec

    Results :

    Failed tests:
    testObjectCount(org.apache.fulcrum.cache.JCSCacheTest)

    Tests run: 30, Failures: 1, Errors: 0, Skipped: 0

    [INFO] ------------------------------------------------------------------------
    [ERROR] BUILD FAILURE
    [INFO] ------------------------------------------------------------------------
    [INFO] There are test failures.

    Please refer to /srv/gump/public/workspace/turbine-fulcrum/cache/target/surefire-reports for the individual test results.
    [INFO] ------------------------------------------------------------------------
    [INFO] For more information, run Maven with the -e switch
    [INFO] ------------------------------------------------------------------------
    [INFO] Total time: 6 minutes 58 seconds
    [INFO] Finished at: Sat May 19 07:03:13 UTC 2012
    [INFO] Final Memory: 14M/35M
    [INFO] ------------------------------------------------------------------------
    ---------------------------------------------

    To subscribe to this information via syndicated feeds:
    - RSS: http://vmgump.apache.org/gump/public/turbine-fulcrum/fulcrum-cache-test/rss.xml
    - Atom: http://vmgump.apache.org/gump/public/turbine-fulcrum/fulcrum-cache-test/atom.xml

    ============================== Gump Tracking Only ===
    Produced by Apache Gump(TM) version 2.3.
    Gump Run 20000019052012, vmgump.apache.org:vmgump:20000019052012
    Gump E-mail Identifier (unique within run) #58.

    --
    Apache Gump
    http://gump.apache.org/ [Instance: vmgump]

    ---------------------------------------------------------------------
    To unsubscribe, e-mail: dev-unsubscribe@turbine.apache.org
    For additional commands, e-mail: dev-help@turbine.apache.org
  • Anonymous at May 20, 2012 at 7:04 am
    To whom it may engage...

    This is an automated request, but not an unsolicited one. For
    more information please visit http://gump.apache.org/nagged.html,
    and/or contact the folk at general@gump.apache.org.

    Project fulcrum-cache-test has an issue affecting its community integration.
    This issue affects 1 projects,
    and has been outstanding for 175 runs.
    The current state of this project is 'Failed', with reason 'Build Failed'.
    For reference only, the following projects are affected by this:
    - fulcrum-cache-test : Services Framework


    Full details are available at:
    http://vmgump.apache.org/gump/public/turbine-fulcrum/fulcrum-cache-test/index.html

    That said, some information snippets are provided here.

    The following annotations (debug/informational/warning/error messages) were provided:
    -WARNING- Overriding Maven settings: [/srv/gump/public/workspace/turbine-fulcrum/cache/gump_mvn_settings.xml]
    -DEBUG- (Apache Gump generated) Apache Maven Settings in: /srv/gump/public/workspace/turbine-fulcrum/cache/gump_mvn_settings.xml
    -INFO- Failed with reason build failed
    -DEBUG- Maven POM in: /srv/gump/public/workspace/turbine-fulcrum/cache/pom.xml



    The following work was performed:
    http://vmgump.apache.org/gump/public/turbine-fulcrum/fulcrum-cache-test/gump_work/build_turbine-fulcrum_fulcrum-cache-test.html
    Work Name: build_turbine-fulcrum_fulcrum-cache-test (Type: Build)
    Work ended in a state of : Failed
    Elapsed: 7 mins 2 secs
    Command Line: /opt/maven2/bin/mvn --batch-mode --settings /srv/gump/public/workspace/turbine-fulcrum/cache/gump_mvn_settings.xml test
    [Working Directory: /srv/gump/public/workspace/turbine-fulcrum/cache]
    M2_HOME: /opt/maven2
    ---------------------------------------------
    INFO: In DISPOSE, [Cache_Test] fromRemote [false]
    Region Name = Cache_Test
    HitCountRam = 308
    HitCountAux = 0
    ---------------------------LRU Memory Cache
    List Size = 3
    Map Size = 3
    Put Count = 23
    Hit Count = 309
    Miss Count = 1
    [DEBUG] Disposing of container...
    [DEBUG] Disposing all services
    [DEBUG] Decommision the service jcscache
    [DEBUG] Decommisioning the service jcscache
    [DEBUG] Disposable.dispose() for jcscache
    [DEBUG] JCSCacheService stopped.
    [DEBUG] Decommision the service ehcache
    [DEBUG] Decommisioning the service ehcache
    [DEBUG] Disposable.dispose() for ehcache
    [DEBUG] EHCacheService stopped!
    [DEBUG] Decommision the service cache
    [DEBUG] Decommisioning the service cache
    [DEBUG] Disposable.dispose() for cache
    [DEBUG] Disposing the service jcscache
    [DEBUG] Disposing the service ehcache
    [DEBUG] Disposing the service cache
    [DEBUG] All services are disposed
    [INFO] YaffiContainer has been disposed.
    Tests run: 10, Failures: 0, Errors: 0, Skipped: 0, Time elapsed: 142.204 sec

    Results :

    Failed tests:
    testObjectCount(org.apache.fulcrum.cache.JCSCacheTest)

    Tests run: 30, Failures: 1, Errors: 0, Skipped: 0

    [INFO] ------------------------------------------------------------------------
    [ERROR] BUILD FAILURE
    [INFO] ------------------------------------------------------------------------
    [INFO] There are test failures.

    Please refer to /srv/gump/public/workspace/turbine-fulcrum/cache/target/surefire-reports for the individual test results.
    [INFO] ------------------------------------------------------------------------
    [INFO] For more information, run Maven with the -e switch
    [INFO] ------------------------------------------------------------------------
    [INFO] Total time: 7 minutes
    [INFO] Finished at: Sun May 20 07:03:35 UTC 2012
    [INFO] Final Memory: 14M/35M
    [INFO] ------------------------------------------------------------------------
    ---------------------------------------------

    To subscribe to this information via syndicated feeds:
    - RSS: http://vmgump.apache.org/gump/public/turbine-fulcrum/fulcrum-cache-test/rss.xml
    - Atom: http://vmgump.apache.org/gump/public/turbine-fulcrum/fulcrum-cache-test/atom.xml

    ============================== Gump Tracking Only ===
    Produced by Apache Gump(TM) version 2.3.
    Gump Run 12000020052012, vmgump.apache.org:vmgump:12000020052012
    Gump E-mail Identifier (unique within run) #58.

    --
    Apache Gump
    http://gump.apache.org/ [Instance: vmgump]

    ---------------------------------------------------------------------
    To unsubscribe, e-mail: dev-unsubscribe@turbine.apache.org
    For additional commands, e-mail: dev-help@turbine.apache.org
  • Anonymous at May 21, 2012 at 7:21 am
    To whom it may engage...

    This is an automated request, but not an unsolicited one. For
    more information please visit http://gump.apache.org/nagged.html,
    and/or contact the folk at general@gump.apache.org.

    Project fulcrum-cache-test has an issue affecting its community integration.
    This issue affects 1 projects,
    and has been outstanding for 177 runs.
    The current state of this project is 'Failed', with reason 'Build Failed'.
    For reference only, the following projects are affected by this:
    - fulcrum-cache-test : Services Framework


    Full details are available at:
    http://vmgump.apache.org/gump/public/turbine-fulcrum/fulcrum-cache-test/index.html

    That said, some information snippets are provided here.

    The following annotations (debug/informational/warning/error messages) were provided:
    -WARNING- Overriding Maven settings: [/srv/gump/public/workspace/turbine-fulcrum/cache/gump_mvn_settings.xml]
    -DEBUG- (Apache Gump generated) Apache Maven Settings in: /srv/gump/public/workspace/turbine-fulcrum/cache/gump_mvn_settings.xml
    -INFO- Failed with reason build failed
    -DEBUG- Maven POM in: /srv/gump/public/workspace/turbine-fulcrum/cache/pom.xml



    The following work was performed:
    http://vmgump.apache.org/gump/public/turbine-fulcrum/fulcrum-cache-test/gump_work/build_turbine-fulcrum_fulcrum-cache-test.html
    Work Name: build_turbine-fulcrum_fulcrum-cache-test (Type: Build)
    Work ended in a state of : Failed
    Elapsed: 6 mins 58 secs
    Command Line: /opt/maven2/bin/mvn --batch-mode --settings /srv/gump/public/workspace/turbine-fulcrum/cache/gump_mvn_settings.xml test
    [Working Directory: /srv/gump/public/workspace/turbine-fulcrum/cache]
    M2_HOME: /opt/maven2
    ---------------------------------------------
    [DEBUG] Disposing all services
    [DEBUG] Decommision the service jcscache
    [DEBUG] Decommisioning the service jcscache
    [DEBUG] Disposable.dispose() for jcscache
    May 21, 2012 7:20:30 AM org.apache.jcs.engine.control.CompositeCache dispose
    INFO: In DISPOSE, [Cache_Test] fromRemote [false]
    Region Name = Cache_Test
    HitCountRam = 308
    HitCountAux = 0
    ---------------------------LRU Memory Cache
    List Size = 3
    Map Size = 3
    Put Count = 23
    Hit Count = 309
    Miss Count = 1
    [DEBUG] JCSCacheService stopped.
    [DEBUG] Decommision the service ehcache
    [DEBUG] Decommisioning the service ehcache
    [DEBUG] Disposable.dispose() for ehcache
    [DEBUG] EHCacheService stopped!
    [DEBUG] Decommision the service cache
    [DEBUG] Decommisioning the service cache
    [DEBUG] Disposable.dispose() for cache
    [DEBUG] Disposing the service jcscache
    [DEBUG] Disposing the service ehcache
    [DEBUG] Disposing the service cache
    [DEBUG] All services are disposed
    [INFO] YaffiContainer has been disposed.
    Tests run: 10, Failures: 0, Errors: 0, Skipped: 0, Time elapsed: 142.173 sec

    Results :

    Failed tests:
    testObjectCount(org.apache.fulcrum.cache.JCSCacheTest)

    Tests run: 30, Failures: 1, Errors: 0, Skipped: 0

    [INFO] ------------------------------------------------------------------------
    [ERROR] BUILD FAILURE
    [INFO] ------------------------------------------------------------------------
    [INFO] There are test failures.

    Please refer to /srv/gump/public/workspace/turbine-fulcrum/cache/target/surefire-reports for the individual test results.
    [INFO] ------------------------------------------------------------------------
    [INFO] For more information, run Maven with the -e switch
    [INFO] ------------------------------------------------------------------------
    [INFO] Total time: 6 minutes 57 seconds
    [INFO] Finished at: Mon May 21 07:20:30 UTC 2012
    [INFO] Final Memory: 14M/35M
    [INFO] ------------------------------------------------------------------------
    ---------------------------------------------

    To subscribe to this information via syndicated feeds:
    - RSS: http://vmgump.apache.org/gump/public/turbine-fulcrum/fulcrum-cache-test/rss.xml
    - Atom: http://vmgump.apache.org/gump/public/turbine-fulcrum/fulcrum-cache-test/atom.xml

    ============================== Gump Tracking Only ===
    Produced by Apache Gump(TM) version 2.3.
    Gump Run 21030021052012, vmgump.apache.org:vmgump:21030021052012
    Gump E-mail Identifier (unique within run) #56.

    --
    Apache Gump
    http://gump.apache.org/ [Instance: vmgump]

    ---------------------------------------------------------------------
    To unsubscribe, e-mail: dev-unsubscribe@turbine.apache.org
    For additional commands, e-mail: dev-help@turbine.apache.org

Related Discussions

Discussion Navigation
viewthread | post
Discussion Overview
groupdev @
categoriesturbine
postedMay 1, '12 at 7:11a
activeMay 21, '12 at 7:21a
posts21
users1
websiteturbine.apache.org

1 user in discussion

Anonymous: 21 posts

People

Translate

site design / logo © 2018 Grokbase