FAQ
To whom it may engage...

This is an automated request, but not an unsolicited one. For
more information please visit http://gump.apache.org/nagged.html,
and/or contact the folk at general@gump.apache.org.

Project fulcrum-cache-test has an issue affecting its community integration.
This issue affects 1 projects,
and has been outstanding for 79 runs.
The current state of this project is 'Failed', with reason 'Build Failed'.
For reference only, the following projects are affected by this:
- fulcrum-cache-test : Services Framework


Full details are available at:
http://vmgump.apache.org/gump/public/turbine-fulcrum/fulcrum-cache-test/index.html

That said, some information snippets are provided here.

The following annotations (debug/informational/warning/error messages) were provided:
-WARNING- Overriding Maven settings: [/srv/gump/public/workspace/turbine-fulcrum/cache/gump_mvn_settings.xml]
-DEBUG- (Apache Gump generated) Apache Maven Settings in: /srv/gump/public/workspace/turbine-fulcrum/cache/gump_mvn_settings.xml
-INFO- Failed with reason build failed
-DEBUG- Maven POM in: /srv/gump/public/workspace/turbine-fulcrum/cache/pom.xml



The following work was performed:
http://vmgump.apache.org/gump/public/turbine-fulcrum/fulcrum-cache-test/gump_work/build_turbine-fulcrum_fulcrum-cache-test.html
Work Name: build_turbine-fulcrum_fulcrum-cache-test (Type: Build)
Work ended in a state of : Failed
Elapsed: 6 mins 55 secs
Command Line: /opt/maven2/bin/mvn --batch-mode --settings /srv/gump/public/workspace/turbine-fulcrum/cache/gump_mvn_settings.xml test
[Working Directory: /srv/gump/public/workspace/turbine-fulcrum/cache]
M2_HOME: /opt/maven2
---------------------------------------------
[DEBUG] Disposing all services
[DEBUG] Decommision the service jcscache
[DEBUG] Decommisioning the service jcscache
[DEBUG] Disposable.dispose() for jcscache
[DEBUG] JCSCacheService stopped.
[DEBUG] Decommision the service ehcache
[DEBUG] Decommisioning the service ehcache
[DEBUG] Disposable.dispose() for ehcache
Apr 1, 2012 6:33:56 AM org.apache.jcs.engine.control.CompositeCache dispose
INFO: In DISPOSE, [Cache_Test] fromRemote [false]
Region Name = Cache_Test
HitCountRam = 308
HitCountAux = 0
---------------------------LRU Memory Cache
List Size = 3
Map Size = 3
Put Count = 23
Hit Count = 309
Miss Count = 1
[DEBUG] EHCacheService stopped!
[DEBUG] Decommision the service cache
[DEBUG] Decommisioning the service cache
[DEBUG] Disposable.dispose() for cache
[DEBUG] Disposing the service jcscache
[DEBUG] Disposing the service ehcache
[DEBUG] Disposing the service cache
[DEBUG] All services are disposed
[INFO] YaffiContainer has been disposed.
Tests run: 10, Failures: 0, Errors: 0, Skipped: 0, Time elapsed: 142.163 sec

Results :

Failed tests:
testObjectCount(org.apache.fulcrum.cache.JCSCacheTest)

Tests run: 30, Failures: 1, Errors: 0, Skipped: 0

[INFO] ------------------------------------------------------------------------
[ERROR] BUILD FAILURE
[INFO] ------------------------------------------------------------------------
[INFO] There are test failures.

Please refer to /srv/gump/public/workspace/turbine-fulcrum/cache/target/surefire-reports for the individual test results.
[INFO] ------------------------------------------------------------------------
[INFO] For more information, run Maven with the -e switch
[INFO] ------------------------------------------------------------------------
[INFO] Total time: 6 minutes 54 seconds
[INFO] Finished at: Sun Apr 01 06:33:56 UTC 2012
[INFO] Final Memory: 14M/35M
[INFO] ------------------------------------------------------------------------
---------------------------------------------

To subscribe to this information via syndicated feeds:
- RSS: http://vmgump.apache.org/gump/public/turbine-fulcrum/fulcrum-cache-test/rss.xml
- Atom: http://vmgump.apache.org/gump/public/turbine-fulcrum/fulcrum-cache-test/atom.xml

============================== Gump Tracking Only ===
Produced by Apache Gump(TM) version 2.3.
Gump Run 13000001042012, vmgump.apache.org:vmgump:13000001042012
Gump E-mail Identifier (unique within run) #37.

--
Apache Gump
http://gump.apache.org/ [Instance: vmgump]

---------------------------------------------------------------------
To unsubscribe, e-mail: dev-unsubscribe@turbine.apache.org
For additional commands, e-mail: dev-help@turbine.apache.org

Search Discussions

  • Anonymous at Apr 2, 2012 at 7:33 am
    To whom it may engage...

    This is an automated request, but not an unsolicited one. For
    more information please visit http://gump.apache.org/nagged.html,
    and/or contact the folk at general@gump.apache.org.

    Project fulcrum-cache-test has an issue affecting its community integration.
    This issue affects 1 projects,
    and has been outstanding for 81 runs.
    The current state of this project is 'Failed', with reason 'Build Failed'.
    For reference only, the following projects are affected by this:
    - fulcrum-cache-test : Services Framework


    Full details are available at:
    http://vmgump.apache.org/gump/public/turbine-fulcrum/fulcrum-cache-test/index.html

    That said, some information snippets are provided here.

    The following annotations (debug/informational/warning/error messages) were provided:
    -WARNING- Overriding Maven settings: [/srv/gump/public/workspace/turbine-fulcrum/cache/gump_mvn_settings.xml]
    -DEBUG- (Apache Gump generated) Apache Maven Settings in: /srv/gump/public/workspace/turbine-fulcrum/cache/gump_mvn_settings.xml
    -INFO- Failed with reason build failed
    -DEBUG- Maven POM in: /srv/gump/public/workspace/turbine-fulcrum/cache/pom.xml



    The following work was performed:
    http://vmgump.apache.org/gump/public/turbine-fulcrum/fulcrum-cache-test/gump_work/build_turbine-fulcrum_fulcrum-cache-test.html
    Work Name: build_turbine-fulcrum_fulcrum-cache-test (Type: Build)
    Work ended in a state of : Failed
    Elapsed: 6 mins 55 secs
    Command Line: /opt/maven2/bin/mvn --batch-mode --settings /srv/gump/public/workspace/turbine-fulcrum/cache/gump_mvn_settings.xml test
    [Working Directory: /srv/gump/public/workspace/turbine-fulcrum/cache]
    M2_HOME: /opt/maven2
    ---------------------------------------------
    [DEBUG] Disposing all services
    [DEBUG] Decommision the service jcscache
    [DEBUG] Decommisioning the service jcscache
    [DEBUG] Disposable.dispose() for jcscache
    Apr 2, 2012 7:32:53 AM org.apache.jcs.engine.control.CompositeCache dispose
    INFO: In DISPOSE, [Cache_Test] fromRemote [false]
    Region Name = Cache_Test
    HitCountRam = 308
    HitCountAux = 0
    ---------------------------LRU Memory Cache
    List Size = 3
    Map Size = 3
    Put Count = 23
    Hit Count = 309
    Miss Count = 1
    [DEBUG] JCSCacheService stopped.
    [DEBUG] Decommision the service ehcache
    [DEBUG] Decommisioning the service ehcache
    [DEBUG] Disposable.dispose() for ehcache
    [DEBUG] EHCacheService stopped!
    [DEBUG] Decommision the service cache
    [DEBUG] Decommisioning the service cache
    [DEBUG] Disposable.dispose() for cache
    [DEBUG] Disposing the service jcscache
    [DEBUG] Disposing the service ehcache
    [DEBUG] Disposing the service cache
    [DEBUG] All services are disposed
    [INFO] YaffiContainer has been disposed.
    Tests run: 10, Failures: 0, Errors: 0, Skipped: 0, Time elapsed: 142.161 sec

    Results :

    Failed tests:
    testObjectCount(org.apache.fulcrum.cache.JCSCacheTest)

    Tests run: 30, Failures: 1, Errors: 0, Skipped: 0

    [INFO] ------------------------------------------------------------------------
    [ERROR] BUILD FAILURE
    [INFO] ------------------------------------------------------------------------
    [INFO] There are test failures.

    Please refer to /srv/gump/public/workspace/turbine-fulcrum/cache/target/surefire-reports for the individual test results.
    [INFO] ------------------------------------------------------------------------
    [INFO] For more information, run Maven with the -e switch
    [INFO] ------------------------------------------------------------------------
    [INFO] Total time: 6 minutes 54 seconds
    [INFO] Finished at: Mon Apr 02 07:32:54 UTC 2012
    [INFO] Final Memory: 14M/35M
    [INFO] ------------------------------------------------------------------------
    ---------------------------------------------

    To subscribe to this information via syndicated feeds:
    - RSS: http://vmgump.apache.org/gump/public/turbine-fulcrum/fulcrum-cache-test/rss.xml
    - Atom: http://vmgump.apache.org/gump/public/turbine-fulcrum/fulcrum-cache-test/atom.xml

    ============================== Gump Tracking Only ===
    Produced by Apache Gump(TM) version 2.3.
    Gump Run 12000002042012, vmgump.apache.org:vmgump:12000002042012
    Gump E-mail Identifier (unique within run) #43.

    --
    Apache Gump
    http://gump.apache.org/ [Instance: vmgump]

    ---------------------------------------------------------------------
    To unsubscribe, e-mail: dev-unsubscribe@turbine.apache.org
    For additional commands, e-mail: dev-help@turbine.apache.org
  • Anonymous at Apr 3, 2012 at 8:28 am
    To whom it may engage...

    This is an automated request, but not an unsolicited one. For
    more information please visit http://gump.apache.org/nagged.html,
    and/or contact the folk at general@gump.apache.org.

    Project fulcrum-cache-test has an issue affecting its community integration.
    This issue affects 1 projects,
    and has been outstanding for 83 runs.
    The current state of this project is 'Failed', with reason 'Build Failed'.
    For reference only, the following projects are affected by this:
    - fulcrum-cache-test : Services Framework


    Full details are available at:
    http://vmgump.apache.org/gump/public/turbine-fulcrum/fulcrum-cache-test/index.html

    That said, some information snippets are provided here.

    The following annotations (debug/informational/warning/error messages) were provided:
    -WARNING- Overriding Maven settings: [/srv/gump/public/workspace/turbine-fulcrum/cache/gump_mvn_settings.xml]
    -DEBUG- (Apache Gump generated) Apache Maven Settings in: /srv/gump/public/workspace/turbine-fulcrum/cache/gump_mvn_settings.xml
    -INFO- Failed with reason build failed
    -DEBUG- Maven POM in: /srv/gump/public/workspace/turbine-fulcrum/cache/pom.xml



    The following work was performed:
    http://vmgump.apache.org/gump/public/turbine-fulcrum/fulcrum-cache-test/gump_work/build_turbine-fulcrum_fulcrum-cache-test.html
    Work Name: build_turbine-fulcrum_fulcrum-cache-test (Type: Build)
    Work ended in a state of : Failed
    Elapsed: 6 mins 55 secs
    Command Line: /opt/maven2/bin/mvn --batch-mode --settings /srv/gump/public/workspace/turbine-fulcrum/cache/gump_mvn_settings.xml test
    [Working Directory: /srv/gump/public/workspace/turbine-fulcrum/cache]
    M2_HOME: /opt/maven2
    ---------------------------------------------
    INFO: In DISPOSE, [Cache_Test] fromRemote [false]
    Region Name = Cache_Test
    HitCountRam = 308
    HitCountAux = 0
    ---------------------------LRU Memory Cache
    List Size = 3
    Map Size = 3
    Put Count = 23
    Hit Count = 309
    Miss Count = 1
    [DEBUG] Disposing of container...
    [DEBUG] Disposing all services
    [DEBUG] Decommision the service jcscache
    [DEBUG] Decommisioning the service jcscache
    [DEBUG] Disposable.dispose() for jcscache
    [DEBUG] JCSCacheService stopped.
    [DEBUG] Decommision the service ehcache
    [DEBUG] Decommisioning the service ehcache
    [DEBUG] Disposable.dispose() for ehcache
    [DEBUG] EHCacheService stopped!
    [DEBUG] Decommision the service cache
    [DEBUG] Decommisioning the service cache
    [DEBUG] Disposable.dispose() for cache
    [DEBUG] Disposing the service jcscache
    [DEBUG] Disposing the service ehcache
    [DEBUG] Disposing the service cache
    [DEBUG] All services are disposed
    [INFO] YaffiContainer has been disposed.
    Tests run: 10, Failures: 0, Errors: 0, Skipped: 0, Time elapsed: 142.14 sec

    Results :

    Failed tests:
    testObjectCount(org.apache.fulcrum.cache.JCSCacheTest)

    Tests run: 30, Failures: 1, Errors: 0, Skipped: 0

    [INFO] ------------------------------------------------------------------------
    [ERROR] BUILD FAILURE
    [INFO] ------------------------------------------------------------------------
    [INFO] There are test failures.

    Please refer to /srv/gump/public/workspace/turbine-fulcrum/cache/target/surefire-reports for the individual test results.
    [INFO] ------------------------------------------------------------------------
    [INFO] For more information, run Maven with the -e switch
    [INFO] ------------------------------------------------------------------------
    [INFO] Total time: 6 minutes 54 seconds
    [INFO] Finished at: Tue Apr 03 08:28:21 UTC 2012
    [INFO] Final Memory: 14M/35M
    [INFO] ------------------------------------------------------------------------
    ---------------------------------------------

    To subscribe to this information via syndicated feeds:
    - RSS: http://vmgump.apache.org/gump/public/turbine-fulcrum/fulcrum-cache-test/rss.xml
    - Atom: http://vmgump.apache.org/gump/public/turbine-fulcrum/fulcrum-cache-test/atom.xml

    ============================== Gump Tracking Only ===
    Produced by Apache Gump(TM) version 2.3.
    Gump Run 12000003042012, vmgump.apache.org:vmgump:12000003042012
    Gump E-mail Identifier (unique within run) #43.

    --
    Apache Gump
    http://gump.apache.org/ [Instance: vmgump]

    ---------------------------------------------------------------------
    To unsubscribe, e-mail: dev-unsubscribe@turbine.apache.org
    For additional commands, e-mail: dev-help@turbine.apache.org
  • Anonymous at Apr 4, 2012 at 7:29 am
    To whom it may engage...

    This is an automated request, but not an unsolicited one. For
    more information please visit http://gump.apache.org/nagged.html,
    and/or contact the folk at general@gump.apache.org.

    Project fulcrum-cache-test has an issue affecting its community integration.
    This issue affects 1 projects,
    and has been outstanding for 85 runs.
    The current state of this project is 'Failed', with reason 'Build Failed'.
    For reference only, the following projects are affected by this:
    - fulcrum-cache-test : Services Framework


    Full details are available at:
    http://vmgump.apache.org/gump/public/turbine-fulcrum/fulcrum-cache-test/index.html

    That said, some information snippets are provided here.

    The following annotations (debug/informational/warning/error messages) were provided:
    -WARNING- Overriding Maven settings: [/srv/gump/public/workspace/turbine-fulcrum/cache/gump_mvn_settings.xml]
    -DEBUG- (Apache Gump generated) Apache Maven Settings in: /srv/gump/public/workspace/turbine-fulcrum/cache/gump_mvn_settings.xml
    -INFO- Failed with reason build failed
    -DEBUG- Maven POM in: /srv/gump/public/workspace/turbine-fulcrum/cache/pom.xml



    The following work was performed:
    http://vmgump.apache.org/gump/public/turbine-fulcrum/fulcrum-cache-test/gump_work/build_turbine-fulcrum_fulcrum-cache-test.html
    Work Name: build_turbine-fulcrum_fulcrum-cache-test (Type: Build)
    Work ended in a state of : Failed
    Elapsed: 6 mins 55 secs
    Command Line: /opt/maven2/bin/mvn --batch-mode --settings /srv/gump/public/workspace/turbine-fulcrum/cache/gump_mvn_settings.xml test
    [Working Directory: /srv/gump/public/workspace/turbine-fulcrum/cache]
    M2_HOME: /opt/maven2
    ---------------------------------------------
    INFO: In DISPOSE, [Cache_Test] fromRemote [false]
    Region Name = Cache_Test
    HitCountRam = 308
    HitCountAux = 0
    ---------------------------LRU Memory Cache
    List Size = 3
    Map Size = 3
    Put Count = 23
    Hit Count = 309
    Miss Count = 1
    [DEBUG] Disposing of container...
    [DEBUG] Disposing all services
    [DEBUG] Decommision the service jcscache
    [DEBUG] Decommisioning the service jcscache
    [DEBUG] Disposable.dispose() for jcscache
    [DEBUG] JCSCacheService stopped.
    [DEBUG] Decommision the service ehcache
    [DEBUG] Decommisioning the service ehcache
    [DEBUG] Disposable.dispose() for ehcache
    [DEBUG] EHCacheService stopped!
    [DEBUG] Decommision the service cache
    [DEBUG] Decommisioning the service cache
    [DEBUG] Disposable.dispose() for cache
    [DEBUG] Disposing the service jcscache
    [DEBUG] Disposing the service ehcache
    [DEBUG] Disposing the service cache
    [DEBUG] All services are disposed
    [INFO] YaffiContainer has been disposed.
    Tests run: 10, Failures: 0, Errors: 0, Skipped: 0, Time elapsed: 142.156 sec

    Results :

    Failed tests:
    testObjectCount(org.apache.fulcrum.cache.JCSCacheTest)

    Tests run: 30, Failures: 1, Errors: 0, Skipped: 0

    [INFO] ------------------------------------------------------------------------
    [ERROR] BUILD FAILURE
    [INFO] ------------------------------------------------------------------------
    [INFO] There are test failures.

    Please refer to /srv/gump/public/workspace/turbine-fulcrum/cache/target/surefire-reports for the individual test results.
    [INFO] ------------------------------------------------------------------------
    [INFO] For more information, run Maven with the -e switch
    [INFO] ------------------------------------------------------------------------
    [INFO] Total time: 6 minutes 54 seconds
    [INFO] Finished at: Wed Apr 04 07:29:12 UTC 2012
    [INFO] Final Memory: 14M/35M
    [INFO] ------------------------------------------------------------------------
    ---------------------------------------------

    To subscribe to this information via syndicated feeds:
    - RSS: http://vmgump.apache.org/gump/public/turbine-fulcrum/fulcrum-cache-test/rss.xml
    - Atom: http://vmgump.apache.org/gump/public/turbine-fulcrum/fulcrum-cache-test/atom.xml

    ============================== Gump Tracking Only ===
    Produced by Apache Gump(TM) version 2.3.
    Gump Run 13000004042012, vmgump.apache.org:vmgump:13000004042012
    Gump E-mail Identifier (unique within run) #43.

    --
    Apache Gump
    http://gump.apache.org/ [Instance: vmgump]

    ---------------------------------------------------------------------
    To unsubscribe, e-mail: dev-unsubscribe@turbine.apache.org
    For additional commands, e-mail: dev-help@turbine.apache.org
  • Anonymous at Apr 5, 2012 at 7:30 am
    To whom it may engage...

    This is an automated request, but not an unsolicited one. For
    more information please visit http://gump.apache.org/nagged.html,
    and/or contact the folk at general@gump.apache.org.

    Project fulcrum-cache-test has an issue affecting its community integration.
    This issue affects 1 projects,
    and has been outstanding for 87 runs.
    The current state of this project is 'Failed', with reason 'Build Failed'.
    For reference only, the following projects are affected by this:
    - fulcrum-cache-test : Services Framework


    Full details are available at:
    http://vmgump.apache.org/gump/public/turbine-fulcrum/fulcrum-cache-test/index.html

    That said, some information snippets are provided here.

    The following annotations (debug/informational/warning/error messages) were provided:
    -WARNING- Overriding Maven settings: [/srv/gump/public/workspace/turbine-fulcrum/cache/gump_mvn_settings.xml]
    -DEBUG- (Apache Gump generated) Apache Maven Settings in: /srv/gump/public/workspace/turbine-fulcrum/cache/gump_mvn_settings.xml
    -INFO- Failed with reason build failed
    -DEBUG- Maven POM in: /srv/gump/public/workspace/turbine-fulcrum/cache/pom.xml



    The following work was performed:
    http://vmgump.apache.org/gump/public/turbine-fulcrum/fulcrum-cache-test/gump_work/build_turbine-fulcrum_fulcrum-cache-test.html
    Work Name: build_turbine-fulcrum_fulcrum-cache-test (Type: Build)
    Work ended in a state of : Failed
    Elapsed: 6 mins 56 secs
    Command Line: /opt/maven2/bin/mvn --batch-mode --settings /srv/gump/public/workspace/turbine-fulcrum/cache/gump_mvn_settings.xml test
    [Working Directory: /srv/gump/public/workspace/turbine-fulcrum/cache]
    M2_HOME: /opt/maven2
    ---------------------------------------------
    INFO: In DISPOSE, [Cache_Test] fromRemote [false]
    Region Name = Cache_Test
    HitCountRam = 308
    HitCountAux = 0
    ---------------------------LRU Memory Cache
    List Size = 3
    Map Size = 3
    Put Count = 23
    Hit Count = 309
    Miss Count = 1
    [DEBUG] Disposing of container...
    [DEBUG] Disposing all services
    [DEBUG] Decommision the service jcscache
    [DEBUG] Decommisioning the service jcscache
    [DEBUG] Disposable.dispose() for jcscache
    [DEBUG] JCSCacheService stopped.
    [DEBUG] Decommision the service ehcache
    [DEBUG] Decommisioning the service ehcache
    [DEBUG] Disposable.dispose() for ehcache
    [DEBUG] EHCacheService stopped!
    [DEBUG] Decommision the service cache
    [DEBUG] Decommisioning the service cache
    [DEBUG] Disposable.dispose() for cache
    [DEBUG] Disposing the service jcscache
    [DEBUG] Disposing the service ehcache
    [DEBUG] Disposing the service cache
    [DEBUG] All services are disposed
    [INFO] YaffiContainer has been disposed.
    Tests run: 10, Failures: 0, Errors: 0, Skipped: 0, Time elapsed: 142.157 sec

    Results :

    Failed tests:
    testObjectCount(org.apache.fulcrum.cache.JCSCacheTest)

    Tests run: 30, Failures: 1, Errors: 0, Skipped: 0

    [INFO] ------------------------------------------------------------------------
    [ERROR] BUILD FAILURE
    [INFO] ------------------------------------------------------------------------
    [INFO] There are test failures.

    Please refer to /srv/gump/public/workspace/turbine-fulcrum/cache/target/surefire-reports for the individual test results.
    [INFO] ------------------------------------------------------------------------
    [INFO] For more information, run Maven with the -e switch
    [INFO] ------------------------------------------------------------------------
    [INFO] Total time: 6 minutes 55 seconds
    [INFO] Finished at: Thu Apr 05 07:29:53 UTC 2012
    [INFO] Final Memory: 14M/35M
    [INFO] ------------------------------------------------------------------------
    ---------------------------------------------

    To subscribe to this information via syndicated feeds:
    - RSS: http://vmgump.apache.org/gump/public/turbine-fulcrum/fulcrum-cache-test/rss.xml
    - Atom: http://vmgump.apache.org/gump/public/turbine-fulcrum/fulcrum-cache-test/atom.xml

    ============================== Gump Tracking Only ===
    Produced by Apache Gump(TM) version 2.3.
    Gump Run 11000005042012, vmgump.apache.org:vmgump:11000005042012
    Gump E-mail Identifier (unique within run) #45.

    --
    Apache Gump
    http://gump.apache.org/ [Instance: vmgump]

    ---------------------------------------------------------------------
    To unsubscribe, e-mail: dev-unsubscribe@turbine.apache.org
    For additional commands, e-mail: dev-help@turbine.apache.org
  • Anonymous at Apr 6, 2012 at 7:03 am
    To whom it may engage...

    This is an automated request, but not an unsolicited one. For
    more information please visit http://gump.apache.org/nagged.html,
    and/or contact the folk at general@gump.apache.org.

    Project fulcrum-cache-test has an issue affecting its community integration.
    This issue affects 1 projects,
    and has been outstanding for 89 runs.
    The current state of this project is 'Failed', with reason 'Build Failed'.
    For reference only, the following projects are affected by this:
    - fulcrum-cache-test : Services Framework


    Full details are available at:
    http://vmgump.apache.org/gump/public/turbine-fulcrum/fulcrum-cache-test/index.html

    That said, some information snippets are provided here.

    The following annotations (debug/informational/warning/error messages) were provided:
    -WARNING- Overriding Maven settings: [/srv/gump/public/workspace/turbine-fulcrum/cache/gump_mvn_settings.xml]
    -DEBUG- (Apache Gump generated) Apache Maven Settings in: /srv/gump/public/workspace/turbine-fulcrum/cache/gump_mvn_settings.xml
    -INFO- Failed with reason build failed
    -DEBUG- Maven POM in: /srv/gump/public/workspace/turbine-fulcrum/cache/pom.xml



    The following work was performed:
    http://vmgump.apache.org/gump/public/turbine-fulcrum/fulcrum-cache-test/gump_work/build_turbine-fulcrum_fulcrum-cache-test.html
    Work Name: build_turbine-fulcrum_fulcrum-cache-test (Type: Build)
    Work ended in a state of : Failed
    Elapsed: 6 mins 56 secs
    Command Line: /opt/maven2/bin/mvn --batch-mode --settings /srv/gump/public/workspace/turbine-fulcrum/cache/gump_mvn_settings.xml test
    [Working Directory: /srv/gump/public/workspace/turbine-fulcrum/cache]
    M2_HOME: /opt/maven2
    ---------------------------------------------
    [DEBUG] Disposing all services
    [DEBUG] Decommision the service jcscache
    [DEBUG] Decommisioning the service jcscache
    [DEBUG] Disposable.dispose() for jcscache
    Apr 6, 2012 7:02:44 AM org.apache.jcs.engine.control.CompositeCache dispose
    INFO: In DISPOSE, [Cache_Test] fromRemote [false]
    Region Name = Cache_Test
    HitCountRam = 308
    HitCountAux = 0
    ---------------------------LRU Memory Cache
    List Size = 3
    Map Size = 3
    Put Count = 23
    Hit Count = 309
    Miss Count = 1
    [DEBUG] JCSCacheService stopped.
    [DEBUG] Decommision the service ehcache
    [DEBUG] Decommisioning the service ehcache
    [DEBUG] Disposable.dispose() for ehcache
    [DEBUG] EHCacheService stopped!
    [DEBUG] Decommision the service cache
    [DEBUG] Decommisioning the service cache
    [DEBUG] Disposable.dispose() for cache
    [DEBUG] Disposing the service jcscache
    [DEBUG] Disposing the service ehcache
    [DEBUG] Disposing the service cache
    [DEBUG] All services are disposed
    [INFO] YaffiContainer has been disposed.
    Tests run: 10, Failures: 0, Errors: 0, Skipped: 0, Time elapsed: 142.169 sec

    Results :

    Failed tests:
    testObjectCount(org.apache.fulcrum.cache.JCSCacheTest)

    Tests run: 30, Failures: 1, Errors: 0, Skipped: 0

    [INFO] ------------------------------------------------------------------------
    [ERROR] BUILD FAILURE
    [INFO] ------------------------------------------------------------------------
    [INFO] There are test failures.

    Please refer to /srv/gump/public/workspace/turbine-fulcrum/cache/target/surefire-reports for the individual test results.
    [INFO] ------------------------------------------------------------------------
    [INFO] For more information, run Maven with the -e switch
    [INFO] ------------------------------------------------------------------------
    [INFO] Total time: 6 minutes 55 seconds
    [INFO] Finished at: Fri Apr 06 07:02:44 UTC 2012
    [INFO] Final Memory: 14M/35M
    [INFO] ------------------------------------------------------------------------
    ---------------------------------------------

    To subscribe to this information via syndicated feeds:
    - RSS: http://vmgump.apache.org/gump/public/turbine-fulcrum/fulcrum-cache-test/rss.xml
    - Atom: http://vmgump.apache.org/gump/public/turbine-fulcrum/fulcrum-cache-test/atom.xml

    ============================== Gump Tracking Only ===
    Produced by Apache Gump(TM) version 2.3.
    Gump Run 11000006042012, vmgump.apache.org:vmgump:11000006042012
    Gump E-mail Identifier (unique within run) #52.

    --
    Apache Gump
    http://gump.apache.org/ [Instance: vmgump]

    ---------------------------------------------------------------------
    To unsubscribe, e-mail: dev-unsubscribe@turbine.apache.org
    For additional commands, e-mail: dev-help@turbine.apache.org
  • Anonymous at Apr 7, 2012 at 7:25 am
    To whom it may engage...

    This is an automated request, but not an unsolicited one. For
    more information please visit http://gump.apache.org/nagged.html,
    and/or contact the folk at general@gump.apache.org.

    Project fulcrum-cache-test has an issue affecting its community integration.
    This issue affects 1 projects,
    and has been outstanding for 91 runs.
    The current state of this project is 'Failed', with reason 'Build Failed'.
    For reference only, the following projects are affected by this:
    - fulcrum-cache-test : Services Framework


    Full details are available at:
    http://vmgump.apache.org/gump/public/turbine-fulcrum/fulcrum-cache-test/index.html

    That said, some information snippets are provided here.

    The following annotations (debug/informational/warning/error messages) were provided:
    -WARNING- Overriding Maven settings: [/srv/gump/public/workspace/turbine-fulcrum/cache/gump_mvn_settings.xml]
    -DEBUG- (Apache Gump generated) Apache Maven Settings in: /srv/gump/public/workspace/turbine-fulcrum/cache/gump_mvn_settings.xml
    -INFO- Failed with reason build failed
    -DEBUG- Maven POM in: /srv/gump/public/workspace/turbine-fulcrum/cache/pom.xml



    The following work was performed:
    http://vmgump.apache.org/gump/public/turbine-fulcrum/fulcrum-cache-test/gump_work/build_turbine-fulcrum_fulcrum-cache-test.html
    Work Name: build_turbine-fulcrum_fulcrum-cache-test (Type: Build)
    Work ended in a state of : Failed
    Elapsed: 6 mins 55 secs
    Command Line: /opt/maven2/bin/mvn --batch-mode --settings /srv/gump/public/workspace/turbine-fulcrum/cache/gump_mvn_settings.xml test
    [Working Directory: /srv/gump/public/workspace/turbine-fulcrum/cache]
    M2_HOME: /opt/maven2
    ---------------------------------------------
    INFO: In DISPOSE, [Cache_Test] fromRemote [false]
    Region Name = Cache_Test
    HitCountRam = 308
    HitCountAux = 0
    ---------------------------LRU Memory Cache
    List Size = 3
    Map Size = 3
    Put Count = 23
    Hit Count = 309
    Miss Count = 1
    [DEBUG] Disposing of container...
    [DEBUG] Disposing all services
    [DEBUG] Decommision the service jcscache
    [DEBUG] Decommisioning the service jcscache
    [DEBUG] Disposable.dispose() for jcscache
    [DEBUG] JCSCacheService stopped.
    [DEBUG] Decommision the service ehcache
    [DEBUG] Decommisioning the service ehcache
    [DEBUG] Disposable.dispose() for ehcache
    [DEBUG] EHCacheService stopped!
    [DEBUG] Decommision the service cache
    [DEBUG] Decommisioning the service cache
    [DEBUG] Disposable.dispose() for cache
    [DEBUG] Disposing the service jcscache
    [DEBUG] Disposing the service ehcache
    [DEBUG] Disposing the service cache
    [DEBUG] All services are disposed
    [INFO] YaffiContainer has been disposed.
    Tests run: 10, Failures: 0, Errors: 0, Skipped: 0, Time elapsed: 142.146 sec

    Results :

    Failed tests:
    testObjectCount(org.apache.fulcrum.cache.JCSCacheTest)

    Tests run: 30, Failures: 1, Errors: 0, Skipped: 0

    [INFO] ------------------------------------------------------------------------
    [ERROR] BUILD FAILURE
    [INFO] ------------------------------------------------------------------------
    [INFO] There are test failures.

    Please refer to /srv/gump/public/workspace/turbine-fulcrum/cache/target/surefire-reports for the individual test results.
    [INFO] ------------------------------------------------------------------------
    [INFO] For more information, run Maven with the -e switch
    [INFO] ------------------------------------------------------------------------
    [INFO] Total time: 6 minutes 54 seconds
    [INFO] Finished at: Sat Apr 07 07:24:17 UTC 2012
    [INFO] Final Memory: 14M/35M
    [INFO] ------------------------------------------------------------------------
    ---------------------------------------------

    To subscribe to this information via syndicated feeds:
    - RSS: http://vmgump.apache.org/gump/public/turbine-fulcrum/fulcrum-cache-test/rss.xml
    - Atom: http://vmgump.apache.org/gump/public/turbine-fulcrum/fulcrum-cache-test/atom.xml

    ============================== Gump Tracking Only ===
    Produced by Apache Gump(TM) version 2.3.
    Gump Run 14000007042012, vmgump.apache.org:vmgump:14000007042012
    Gump E-mail Identifier (unique within run) #47.

    --
    Apache Gump
    http://gump.apache.org/ [Instance: vmgump]

    ---------------------------------------------------------------------
    To unsubscribe, e-mail: dev-unsubscribe@turbine.apache.org
    For additional commands, e-mail: dev-help@turbine.apache.org
  • Anonymous at Apr 8, 2012 at 8:18 am
    To whom it may engage...

    This is an automated request, but not an unsolicited one. For
    more information please visit http://gump.apache.org/nagged.html,
    and/or contact the folk at general@gump.apache.org.

    Project fulcrum-cache-test has an issue affecting its community integration.
    This issue affects 1 projects,
    and has been outstanding for 93 runs.
    The current state of this project is 'Failed', with reason 'Build Failed'.
    For reference only, the following projects are affected by this:
    - fulcrum-cache-test : Services Framework


    Full details are available at:
    http://vmgump.apache.org/gump/public/turbine-fulcrum/fulcrum-cache-test/index.html

    That said, some information snippets are provided here.

    The following annotations (debug/informational/warning/error messages) were provided:
    -WARNING- Overriding Maven settings: [/srv/gump/public/workspace/turbine-fulcrum/cache/gump_mvn_settings.xml]
    -DEBUG- (Apache Gump generated) Apache Maven Settings in: /srv/gump/public/workspace/turbine-fulcrum/cache/gump_mvn_settings.xml
    -INFO- Failed with reason build failed
    -DEBUG- Maven POM in: /srv/gump/public/workspace/turbine-fulcrum/cache/pom.xml



    The following work was performed:
    http://vmgump.apache.org/gump/public/turbine-fulcrum/fulcrum-cache-test/gump_work/build_turbine-fulcrum_fulcrum-cache-test.html
    Work Name: build_turbine-fulcrum_fulcrum-cache-test (Type: Build)
    Work ended in a state of : Failed
    Elapsed: 6 mins 55 secs
    Command Line: /opt/maven2/bin/mvn --batch-mode --settings /srv/gump/public/workspace/turbine-fulcrum/cache/gump_mvn_settings.xml test
    [Working Directory: /srv/gump/public/workspace/turbine-fulcrum/cache]
    M2_HOME: /opt/maven2
    ---------------------------------------------
    INFO: In DISPOSE, [Cache_Test] fromRemote [false]
    Region Name = Cache_Test
    HitCountRam = 308
    HitCountAux = 0
    ---------------------------LRU Memory Cache
    List Size = 3
    Map Size = 3
    Put Count = 23
    Hit Count = 309
    Miss Count = 1
    [DEBUG] Disposing of container...
    [DEBUG] Disposing all services
    [DEBUG] Decommision the service jcscache
    [DEBUG] Decommisioning the service jcscache
    [DEBUG] Disposable.dispose() for jcscache
    [DEBUG] JCSCacheService stopped.
    [DEBUG] Decommision the service ehcache
    [DEBUG] Decommisioning the service ehcache
    [DEBUG] Disposable.dispose() for ehcache
    [DEBUG] EHCacheService stopped!
    [DEBUG] Decommision the service cache
    [DEBUG] Decommisioning the service cache
    [DEBUG] Disposable.dispose() for cache
    [DEBUG] Disposing the service jcscache
    [DEBUG] Disposing the service ehcache
    [DEBUG] Disposing the service cache
    [DEBUG] All services are disposed
    [INFO] YaffiContainer has been disposed.
    Tests run: 10, Failures: 0, Errors: 0, Skipped: 0, Time elapsed: 142.146 sec

    Results :

    Failed tests:
    testObjectCount(org.apache.fulcrum.cache.JCSCacheTest)

    Tests run: 30, Failures: 1, Errors: 0, Skipped: 0

    [INFO] ------------------------------------------------------------------------
    [ERROR] BUILD FAILURE
    [INFO] ------------------------------------------------------------------------
    [INFO] There are test failures.

    Please refer to /srv/gump/public/workspace/turbine-fulcrum/cache/target/surefire-reports for the individual test results.
    [INFO] ------------------------------------------------------------------------
    [INFO] For more information, run Maven with the -e switch
    [INFO] ------------------------------------------------------------------------
    [INFO] Total time: 6 minutes 54 seconds
    [INFO] Finished at: Sun Apr 08 08:17:47 UTC 2012
    [INFO] Final Memory: 14M/35M
    [INFO] ------------------------------------------------------------------------
    ---------------------------------------------

    To subscribe to this information via syndicated feeds:
    - RSS: http://vmgump.apache.org/gump/public/turbine-fulcrum/fulcrum-cache-test/rss.xml
    - Atom: http://vmgump.apache.org/gump/public/turbine-fulcrum/fulcrum-cache-test/atom.xml

    ============================== Gump Tracking Only ===
    Produced by Apache Gump(TM) version 2.3.
    Gump Run 12000008042012, vmgump.apache.org:vmgump:12000008042012
    Gump E-mail Identifier (unique within run) #44.

    --
    Apache Gump
    http://gump.apache.org/ [Instance: vmgump]

    ---------------------------------------------------------------------
    To unsubscribe, e-mail: dev-unsubscribe@turbine.apache.org
    For additional commands, e-mail: dev-help@turbine.apache.org
  • Anonymous at Apr 9, 2012 at 7:55 am
    To whom it may engage...

    This is an automated request, but not an unsolicited one. For
    more information please visit http://gump.apache.org/nagged.html,
    and/or contact the folk at general@gump.apache.org.

    Project fulcrum-cache-test has an issue affecting its community integration.
    This issue affects 1 projects,
    and has been outstanding for 95 runs.
    The current state of this project is 'Failed', with reason 'Build Failed'.
    For reference only, the following projects are affected by this:
    - fulcrum-cache-test : Services Framework


    Full details are available at:
    http://vmgump.apache.org/gump/public/turbine-fulcrum/fulcrum-cache-test/index.html

    That said, some information snippets are provided here.

    The following annotations (debug/informational/warning/error messages) were provided:
    -WARNING- Overriding Maven settings: [/srv/gump/public/workspace/turbine-fulcrum/cache/gump_mvn_settings.xml]
    -DEBUG- (Apache Gump generated) Apache Maven Settings in: /srv/gump/public/workspace/turbine-fulcrum/cache/gump_mvn_settings.xml
    -INFO- Failed with reason build failed
    -DEBUG- Maven POM in: /srv/gump/public/workspace/turbine-fulcrum/cache/pom.xml



    The following work was performed:
    http://vmgump.apache.org/gump/public/turbine-fulcrum/fulcrum-cache-test/gump_work/build_turbine-fulcrum_fulcrum-cache-test.html
    Work Name: build_turbine-fulcrum_fulcrum-cache-test (Type: Build)
    Work ended in a state of : Failed
    Elapsed: 6 mins 55 secs
    Command Line: /opt/maven2/bin/mvn --batch-mode --settings /srv/gump/public/workspace/turbine-fulcrum/cache/gump_mvn_settings.xml test
    [Working Directory: /srv/gump/public/workspace/turbine-fulcrum/cache]
    M2_HOME: /opt/maven2
    ---------------------------------------------
    INFO: In DISPOSE, [Cache_Test] fromRemote [false]
    Region Name = Cache_Test
    HitCountRam = 308
    HitCountAux = 0
    ---------------------------LRU Memory Cache
    List Size = 3
    Map Size = 3
    Put Count = 23
    Hit Count = 309
    Miss Count = 1
    [DEBUG] Disposing of container...
    [DEBUG] Disposing all services
    [DEBUG] Decommision the service jcscache
    [DEBUG] Decommisioning the service jcscache
    [DEBUG] Disposable.dispose() for jcscache
    [DEBUG] JCSCacheService stopped.
    [DEBUG] Decommision the service ehcache
    [DEBUG] Decommisioning the service ehcache
    [DEBUG] Disposable.dispose() for ehcache
    [DEBUG] EHCacheService stopped!
    [DEBUG] Decommision the service cache
    [DEBUG] Decommisioning the service cache
    [DEBUG] Disposable.dispose() for cache
    [DEBUG] Disposing the service jcscache
    [DEBUG] Disposing the service ehcache
    [DEBUG] Disposing the service cache
    [DEBUG] All services are disposed
    [INFO] YaffiContainer has been disposed.
    Tests run: 10, Failures: 0, Errors: 0, Skipped: 0, Time elapsed: 142.164 sec

    Results :

    Failed tests:
    testObjectCount(org.apache.fulcrum.cache.JCSCacheTest)

    Tests run: 30, Failures: 1, Errors: 0, Skipped: 0

    [INFO] ------------------------------------------------------------------------
    [ERROR] BUILD FAILURE
    [INFO] ------------------------------------------------------------------------
    [INFO] There are test failures.

    Please refer to /srv/gump/public/workspace/turbine-fulcrum/cache/target/surefire-reports for the individual test results.
    [INFO] ------------------------------------------------------------------------
    [INFO] For more information, run Maven with the -e switch
    [INFO] ------------------------------------------------------------------------
    [INFO] Total time: 6 minutes 54 seconds
    [INFO] Finished at: Mon Apr 09 07:55:17 UTC 2012
    [INFO] Final Memory: 14M/35M
    [INFO] ------------------------------------------------------------------------
    ---------------------------------------------

    To subscribe to this information via syndicated feeds:
    - RSS: http://vmgump.apache.org/gump/public/turbine-fulcrum/fulcrum-cache-test/rss.xml
    - Atom: http://vmgump.apache.org/gump/public/turbine-fulcrum/fulcrum-cache-test/atom.xml

    ============================== Gump Tracking Only ===
    Produced by Apache Gump(TM) version 2.3.
    Gump Run 12000009042012, vmgump.apache.org:vmgump:12000009042012
    Gump E-mail Identifier (unique within run) #42.

    --
    Apache Gump
    http://gump.apache.org/ [Instance: vmgump]

    ---------------------------------------------------------------------
    To unsubscribe, e-mail: dev-unsubscribe@turbine.apache.org
    For additional commands, e-mail: dev-help@turbine.apache.org
  • Anonymous at Apr 10, 2012 at 7:23 am
    To whom it may engage...

    This is an automated request, but not an unsolicited one. For
    more information please visit http://gump.apache.org/nagged.html,
    and/or contact the folk at general@gump.apache.org.

    Project fulcrum-cache-test has an issue affecting its community integration.
    This issue affects 1 projects,
    and has been outstanding for 97 runs.
    The current state of this project is 'Failed', with reason 'Build Failed'.
    For reference only, the following projects are affected by this:
    - fulcrum-cache-test : Services Framework


    Full details are available at:
    http://vmgump.apache.org/gump/public/turbine-fulcrum/fulcrum-cache-test/index.html

    That said, some information snippets are provided here.

    The following annotations (debug/informational/warning/error messages) were provided:
    -WARNING- Overriding Maven settings: [/srv/gump/public/workspace/turbine-fulcrum/cache/gump_mvn_settings.xml]
    -DEBUG- (Apache Gump generated) Apache Maven Settings in: /srv/gump/public/workspace/turbine-fulcrum/cache/gump_mvn_settings.xml
    -INFO- Failed with reason build failed
    -DEBUG- Maven POM in: /srv/gump/public/workspace/turbine-fulcrum/cache/pom.xml



    The following work was performed:
    http://vmgump.apache.org/gump/public/turbine-fulcrum/fulcrum-cache-test/gump_work/build_turbine-fulcrum_fulcrum-cache-test.html
    Work Name: build_turbine-fulcrum_fulcrum-cache-test (Type: Build)
    Work ended in a state of : Failed
    Elapsed: 6 mins 55 secs
    Command Line: /opt/maven2/bin/mvn --batch-mode --settings /srv/gump/public/workspace/turbine-fulcrum/cache/gump_mvn_settings.xml test
    [Working Directory: /srv/gump/public/workspace/turbine-fulcrum/cache]
    M2_HOME: /opt/maven2
    ---------------------------------------------
    INFO: In DISPOSE, [Cache_Test] fromRemote [false]
    Region Name = Cache_Test
    HitCountRam = 308
    HitCountAux = 0
    ---------------------------LRU Memory Cache
    List Size = 3
    Map Size = 3
    Put Count = 23
    Hit Count = 309
    Miss Count = 1
    [DEBUG] Disposing of container...
    [DEBUG] Disposing all services
    [DEBUG] Decommision the service jcscache
    [DEBUG] Decommisioning the service jcscache
    [DEBUG] Disposable.dispose() for jcscache
    [DEBUG] JCSCacheService stopped.
    [DEBUG] Decommision the service ehcache
    [DEBUG] Decommisioning the service ehcache
    [DEBUG] Disposable.dispose() for ehcache
    [DEBUG] EHCacheService stopped!
    [DEBUG] Decommision the service cache
    [DEBUG] Decommisioning the service cache
    [DEBUG] Disposable.dispose() for cache
    [DEBUG] Disposing the service jcscache
    [DEBUG] Disposing the service ehcache
    [DEBUG] Disposing the service cache
    [DEBUG] All services are disposed
    [INFO] YaffiContainer has been disposed.
    Tests run: 10, Failures: 0, Errors: 0, Skipped: 0, Time elapsed: 142.16 sec

    Results :

    Failed tests:
    testObjectCount(org.apache.fulcrum.cache.JCSCacheTest)

    Tests run: 30, Failures: 1, Errors: 0, Skipped: 0

    [INFO] ------------------------------------------------------------------------
    [ERROR] BUILD FAILURE
    [INFO] ------------------------------------------------------------------------
    [INFO] There are test failures.

    Please refer to /srv/gump/public/workspace/turbine-fulcrum/cache/target/surefire-reports for the individual test results.
    [INFO] ------------------------------------------------------------------------
    [INFO] For more information, run Maven with the -e switch
    [INFO] ------------------------------------------------------------------------
    [INFO] Total time: 6 minutes 54 seconds
    [INFO] Finished at: Tue Apr 10 07:22:51 UTC 2012
    [INFO] Final Memory: 14M/35M
    [INFO] ------------------------------------------------------------------------
    ---------------------------------------------

    To subscribe to this information via syndicated feeds:
    - RSS: http://vmgump.apache.org/gump/public/turbine-fulcrum/fulcrum-cache-test/rss.xml
    - Atom: http://vmgump.apache.org/gump/public/turbine-fulcrum/fulcrum-cache-test/atom.xml

    ============================== Gump Tracking Only ===
    Produced by Apache Gump(TM) version 2.3.
    Gump Run 11000010042012, vmgump.apache.org:vmgump:11000010042012
    Gump E-mail Identifier (unique within run) #41.

    --
    Apache Gump
    http://gump.apache.org/ [Instance: vmgump]

    ---------------------------------------------------------------------
    To unsubscribe, e-mail: dev-unsubscribe@turbine.apache.org
    For additional commands, e-mail: dev-help@turbine.apache.org
  • Anonymous at Apr 11, 2012 at 7:45 am
    To whom it may engage...

    This is an automated request, but not an unsolicited one. For
    more information please visit http://gump.apache.org/nagged.html,
    and/or contact the folk at general@gump.apache.org.

    Project fulcrum-cache-test has an issue affecting its community integration.
    This issue affects 1 projects,
    and has been outstanding for 99 runs.
    The current state of this project is 'Failed', with reason 'Build Failed'.
    For reference only, the following projects are affected by this:
    - fulcrum-cache-test : Services Framework


    Full details are available at:
    http://vmgump.apache.org/gump/public/turbine-fulcrum/fulcrum-cache-test/index.html

    That said, some information snippets are provided here.

    The following annotations (debug/informational/warning/error messages) were provided:
    -WARNING- Overriding Maven settings: [/srv/gump/public/workspace/turbine-fulcrum/cache/gump_mvn_settings.xml]
    -DEBUG- (Apache Gump generated) Apache Maven Settings in: /srv/gump/public/workspace/turbine-fulcrum/cache/gump_mvn_settings.xml
    -INFO- Failed with reason build failed
    -DEBUG- Maven POM in: /srv/gump/public/workspace/turbine-fulcrum/cache/pom.xml



    The following work was performed:
    http://vmgump.apache.org/gump/public/turbine-fulcrum/fulcrum-cache-test/gump_work/build_turbine-fulcrum_fulcrum-cache-test.html
    Work Name: build_turbine-fulcrum_fulcrum-cache-test (Type: Build)
    Work ended in a state of : Failed
    Elapsed: 6 mins 55 secs
    Command Line: /opt/maven2/bin/mvn --batch-mode --settings /srv/gump/public/workspace/turbine-fulcrum/cache/gump_mvn_settings.xml test
    [Working Directory: /srv/gump/public/workspace/turbine-fulcrum/cache]
    M2_HOME: /opt/maven2
    ---------------------------------------------
    [DEBUG] Disposing all services
    [DEBUG] Decommision the service jcscache
    Apr 11, 2012 7:44:37 AM org.apache.jcs.engine.control.CompositeCache dispose
    INFO: In DISPOSE, [Cache_Test] fromRemote [false]
    Region Name = Cache_Test
    HitCountRam = 308
    HitCountAux = 0
    ---------------------------LRU Memory Cache
    List Size = 3
    Map Size = 3
    Put Count = 23
    Hit Count = 309
    Miss Count = 1
    [DEBUG] Decommisioning the service jcscache
    [DEBUG] Disposable.dispose() for jcscache
    [DEBUG] JCSCacheService stopped.
    [DEBUG] Decommision the service ehcache
    [DEBUG] Decommisioning the service ehcache
    [DEBUG] Disposable.dispose() for ehcache
    [DEBUG] EHCacheService stopped!
    [DEBUG] Decommision the service cache
    [DEBUG] Decommisioning the service cache
    [DEBUG] Disposable.dispose() for cache
    [DEBUG] Disposing the service jcscache
    [DEBUG] Disposing the service ehcache
    [DEBUG] Disposing the service cache
    [DEBUG] All services are disposed
    [INFO] YaffiContainer has been disposed.
    Tests run: 10, Failures: 0, Errors: 0, Skipped: 0, Time elapsed: 142.163 sec

    Results :

    Failed tests:
    testObjectCount(org.apache.fulcrum.cache.JCSCacheTest)

    Tests run: 30, Failures: 1, Errors: 0, Skipped: 0

    [INFO] ------------------------------------------------------------------------
    [ERROR] BUILD FAILURE
    [INFO] ------------------------------------------------------------------------
    [INFO] There are test failures.

    Please refer to /srv/gump/public/workspace/turbine-fulcrum/cache/target/surefire-reports for the individual test results.
    [INFO] ------------------------------------------------------------------------
    [INFO] For more information, run Maven with the -e switch
    [INFO] ------------------------------------------------------------------------
    [INFO] Total time: 6 minutes 54 seconds
    [INFO] Finished at: Wed Apr 11 07:44:37 UTC 2012
    [INFO] Final Memory: 14M/35M
    [INFO] ------------------------------------------------------------------------
    ---------------------------------------------

    To subscribe to this information via syndicated feeds:
    - RSS: http://vmgump.apache.org/gump/public/turbine-fulcrum/fulcrum-cache-test/rss.xml
    - Atom: http://vmgump.apache.org/gump/public/turbine-fulcrum/fulcrum-cache-test/atom.xml

    ============================== Gump Tracking Only ===
    Produced by Apache Gump(TM) version 2.3.
    Gump Run 12000011042012, vmgump.apache.org:vmgump:12000011042012
    Gump E-mail Identifier (unique within run) #45.

    --
    Apache Gump
    http://gump.apache.org/ [Instance: vmgump]

    ---------------------------------------------------------------------
    To unsubscribe, e-mail: dev-unsubscribe@turbine.apache.org
    For additional commands, e-mail: dev-help@turbine.apache.org
  • Anonymous at Apr 12, 2012 at 6:33 am
    To whom it may engage...

    This is an automated request, but not an unsolicited one. For
    more information please visit http://gump.apache.org/nagged.html,
    and/or contact the folk at general@gump.apache.org.

    Project fulcrum-cache-test has an issue affecting its community integration.
    This issue affects 1 projects,
    and has been outstanding for 101 runs.
    The current state of this project is 'Failed', with reason 'Build Failed'.
    For reference only, the following projects are affected by this:
    - fulcrum-cache-test : Services Framework


    Full details are available at:
    http://vmgump.apache.org/gump/public/turbine-fulcrum/fulcrum-cache-test/index.html

    That said, some information snippets are provided here.

    The following annotations (debug/informational/warning/error messages) were provided:
    -WARNING- Overriding Maven settings: [/srv/gump/public/workspace/turbine-fulcrum/cache/gump_mvn_settings.xml]
    -DEBUG- (Apache Gump generated) Apache Maven Settings in: /srv/gump/public/workspace/turbine-fulcrum/cache/gump_mvn_settings.xml
    -INFO- Failed with reason build failed
    -DEBUG- Maven POM in: /srv/gump/public/workspace/turbine-fulcrum/cache/pom.xml



    The following work was performed:
    http://vmgump.apache.org/gump/public/turbine-fulcrum/fulcrum-cache-test/gump_work/build_turbine-fulcrum_fulcrum-cache-test.html
    Work Name: build_turbine-fulcrum_fulcrum-cache-test (Type: Build)
    Work ended in a state of : Failed
    Elapsed: 6 mins 55 secs
    Command Line: /opt/maven2/bin/mvn --batch-mode --settings /srv/gump/public/workspace/turbine-fulcrum/cache/gump_mvn_settings.xml test
    [Working Directory: /srv/gump/public/workspace/turbine-fulcrum/cache]
    M2_HOME: /opt/maven2
    ---------------------------------------------
    INFO: In DISPOSE, [Cache_Test] fromRemote [false]
    Region Name = Cache_Test
    HitCountRam = 308
    HitCountAux = 0
    ---------------------------LRU Memory Cache
    List Size = 3
    Map Size = 3
    Put Count = 23
    Hit Count = 309
    Miss Count = 1
    [DEBUG] Disposing of container...
    [DEBUG] Disposing all services
    [DEBUG] Decommision the service jcscache
    [DEBUG] Decommisioning the service jcscache
    [DEBUG] Disposable.dispose() for jcscache
    [DEBUG] JCSCacheService stopped.
    [DEBUG] Decommision the service ehcache
    [DEBUG] Decommisioning the service ehcache
    [DEBUG] Disposable.dispose() for ehcache
    [DEBUG] EHCacheService stopped!
    [DEBUG] Decommision the service cache
    [DEBUG] Decommisioning the service cache
    [DEBUG] Disposable.dispose() for cache
    [DEBUG] Disposing the service jcscache
    [DEBUG] Disposing the service ehcache
    [DEBUG] Disposing the service cache
    [DEBUG] All services are disposed
    [INFO] YaffiContainer has been disposed.
    Tests run: 10, Failures: 0, Errors: 0, Skipped: 0, Time elapsed: 142.172 sec

    Results :

    Failed tests:
    testObjectCount(org.apache.fulcrum.cache.JCSCacheTest)

    Tests run: 30, Failures: 1, Errors: 0, Skipped: 0

    [INFO] ------------------------------------------------------------------------
    [ERROR] BUILD FAILURE
    [INFO] ------------------------------------------------------------------------
    [INFO] There are test failures.

    Please refer to /srv/gump/public/workspace/turbine-fulcrum/cache/target/surefire-reports for the individual test results.
    [INFO] ------------------------------------------------------------------------
    [INFO] For more information, run Maven with the -e switch
    [INFO] ------------------------------------------------------------------------
    [INFO] Total time: 6 minutes 54 seconds
    [INFO] Finished at: Thu Apr 12 06:32:57 UTC 2012
    [INFO] Final Memory: 14M/35M
    [INFO] ------------------------------------------------------------------------
    ---------------------------------------------

    To subscribe to this information via syndicated feeds:
    - RSS: http://vmgump.apache.org/gump/public/turbine-fulcrum/fulcrum-cache-test/rss.xml
    - Atom: http://vmgump.apache.org/gump/public/turbine-fulcrum/fulcrum-cache-test/atom.xml

    ============================== Gump Tracking Only ===
    Produced by Apache Gump(TM) version 2.3.
    Gump Run 11000012042012, vmgump.apache.org:vmgump:11000012042012
    Gump E-mail Identifier (unique within run) #41.

    --
    Apache Gump
    http://gump.apache.org/ [Instance: vmgump]

    ---------------------------------------------------------------------
    To unsubscribe, e-mail: dev-unsubscribe@turbine.apache.org
    For additional commands, e-mail: dev-help@turbine.apache.org
  • Anonymous at Apr 13, 2012 at 6:33 am
    To whom it may engage...

    This is an automated request, but not an unsolicited one. For
    more information please visit http://gump.apache.org/nagged.html,
    and/or contact the folk at general@gump.apache.org.

    Project fulcrum-cache-test has an issue affecting its community integration.
    This issue affects 1 projects,
    and has been outstanding for 103 runs.
    The current state of this project is 'Failed', with reason 'Build Failed'.
    For reference only, the following projects are affected by this:
    - fulcrum-cache-test : Services Framework


    Full details are available at:
    http://vmgump.apache.org/gump/public/turbine-fulcrum/fulcrum-cache-test/index.html

    That said, some information snippets are provided here.

    The following annotations (debug/informational/warning/error messages) were provided:
    -WARNING- Overriding Maven settings: [/srv/gump/public/workspace/turbine-fulcrum/cache/gump_mvn_settings.xml]
    -DEBUG- (Apache Gump generated) Apache Maven Settings in: /srv/gump/public/workspace/turbine-fulcrum/cache/gump_mvn_settings.xml
    -INFO- Failed with reason build failed
    -DEBUG- Maven POM in: /srv/gump/public/workspace/turbine-fulcrum/cache/pom.xml



    The following work was performed:
    http://vmgump.apache.org/gump/public/turbine-fulcrum/fulcrum-cache-test/gump_work/build_turbine-fulcrum_fulcrum-cache-test.html
    Work Name: build_turbine-fulcrum_fulcrum-cache-test (Type: Build)
    Work ended in a state of : Failed
    Elapsed: 6 mins 55 secs
    Command Line: /opt/maven2/bin/mvn --batch-mode --settings /srv/gump/public/workspace/turbine-fulcrum/cache/gump_mvn_settings.xml test
    [Working Directory: /srv/gump/public/workspace/turbine-fulcrum/cache]
    M2_HOME: /opt/maven2
    ---------------------------------------------
    INFO: In DISPOSE, [Cache_Test] fromRemote [false]
    Region Name = Cache_Test
    HitCountRam = 308
    HitCountAux = 0
    ---------------------------LRU Memory Cache
    List Size = 3
    Map Size = 3
    Put Count = 23
    Hit Count = 309
    Miss Count = 1
    [DEBUG] Disposing of container...
    [DEBUG] Disposing all services
    [DEBUG] Decommision the service jcscache
    [DEBUG] Decommisioning the service jcscache
    [DEBUG] Disposable.dispose() for jcscache
    [DEBUG] JCSCacheService stopped.
    [DEBUG] Decommision the service ehcache
    [DEBUG] Decommisioning the service ehcache
    [DEBUG] Disposable.dispose() for ehcache
    [DEBUG] EHCacheService stopped!
    [DEBUG] Decommision the service cache
    [DEBUG] Decommisioning the service cache
    [DEBUG] Disposable.dispose() for cache
    [DEBUG] Disposing the service jcscache
    [DEBUG] Disposing the service ehcache
    [DEBUG] Disposing the service cache
    [DEBUG] All services are disposed
    [INFO] YaffiContainer has been disposed.
    Tests run: 10, Failures: 0, Errors: 0, Skipped: 0, Time elapsed: 142.163 sec

    Results :

    Failed tests:
    testObjectCount(org.apache.fulcrum.cache.JCSCacheTest)

    Tests run: 30, Failures: 1, Errors: 0, Skipped: 0

    [INFO] ------------------------------------------------------------------------
    [ERROR] BUILD FAILURE
    [INFO] ------------------------------------------------------------------------
    [INFO] There are test failures.

    Please refer to /srv/gump/public/workspace/turbine-fulcrum/cache/target/surefire-reports for the individual test results.
    [INFO] ------------------------------------------------------------------------
    [INFO] For more information, run Maven with the -e switch
    [INFO] ------------------------------------------------------------------------
    [INFO] Total time: 6 minutes 54 seconds
    [INFO] Finished at: Fri Apr 13 06:32:49 UTC 2012
    [INFO] Final Memory: 14M/35M
    [INFO] ------------------------------------------------------------------------
    ---------------------------------------------

    To subscribe to this information via syndicated feeds:
    - RSS: http://vmgump.apache.org/gump/public/turbine-fulcrum/fulcrum-cache-test/rss.xml
    - Atom: http://vmgump.apache.org/gump/public/turbine-fulcrum/fulcrum-cache-test/atom.xml

    ============================== Gump Tracking Only ===
    Produced by Apache Gump(TM) version 2.3.
    Gump Run 12000013042012, vmgump.apache.org:vmgump:12000013042012
    Gump E-mail Identifier (unique within run) #42.

    --
    Apache Gump
    http://gump.apache.org/ [Instance: vmgump]

    ---------------------------------------------------------------------
    To unsubscribe, e-mail: dev-unsubscribe@turbine.apache.org
    For additional commands, e-mail: dev-help@turbine.apache.org
  • Anonymous at Apr 14, 2012 at 6:30 am
    To whom it may engage...

    This is an automated request, but not an unsolicited one. For
    more information please visit http://gump.apache.org/nagged.html,
    and/or contact the folk at general@gump.apache.org.

    Project fulcrum-cache-test has an issue affecting its community integration.
    This issue affects 1 projects,
    and has been outstanding for 105 runs.
    The current state of this project is 'Failed', with reason 'Build Failed'.
    For reference only, the following projects are affected by this:
    - fulcrum-cache-test : Services Framework


    Full details are available at:
    http://vmgump.apache.org/gump/public/turbine-fulcrum/fulcrum-cache-test/index.html

    That said, some information snippets are provided here.

    The following annotations (debug/informational/warning/error messages) were provided:
    -WARNING- Overriding Maven settings: [/srv/gump/public/workspace/turbine-fulcrum/cache/gump_mvn_settings.xml]
    -DEBUG- (Apache Gump generated) Apache Maven Settings in: /srv/gump/public/workspace/turbine-fulcrum/cache/gump_mvn_settings.xml
    -INFO- Failed with reason build failed
    -DEBUG- Maven POM in: /srv/gump/public/workspace/turbine-fulcrum/cache/pom.xml



    The following work was performed:
    http://vmgump.apache.org/gump/public/turbine-fulcrum/fulcrum-cache-test/gump_work/build_turbine-fulcrum_fulcrum-cache-test.html
    Work Name: build_turbine-fulcrum_fulcrum-cache-test (Type: Build)
    Work ended in a state of : Failed
    Elapsed: 6 mins 55 secs
    Command Line: /opt/maven2/bin/mvn --batch-mode --settings /srv/gump/public/workspace/turbine-fulcrum/cache/gump_mvn_settings.xml test
    [Working Directory: /srv/gump/public/workspace/turbine-fulcrum/cache]
    M2_HOME: /opt/maven2
    ---------------------------------------------
    [DEBUG] Disposing all services
    [DEBUG] Decommision the service jcscache
    [DEBUG] Decommisioning the service jcscache
    [DEBUG] Disposable.dispose() for jcscache
    Apr 14, 2012 6:29:45 AM org.apache.jcs.engine.control.CompositeCache dispose
    INFO: In DISPOSE, [Cache_Test] fromRemote [false]
    Region Name = Cache_Test
    HitCountRam = 308
    HitCountAux = 0
    ---------------------------LRU Memory Cache
    List Size = 3
    Map Size = 3
    Put Count = 23
    Hit Count = 309
    Miss Count = 1
    [DEBUG] JCSCacheService stopped.
    [DEBUG] Decommision the service ehcache
    [DEBUG] Decommisioning the service ehcache
    [DEBUG] Disposable.dispose() for ehcache
    [DEBUG] EHCacheService stopped!
    [DEBUG] Decommision the service cache
    [DEBUG] Decommisioning the service cache
    [DEBUG] Disposable.dispose() for cache
    [DEBUG] Disposing the service jcscache
    [DEBUG] Disposing the service ehcache
    [DEBUG] Disposing the service cache
    [DEBUG] All services are disposed
    [INFO] YaffiContainer has been disposed.
    Tests run: 10, Failures: 0, Errors: 0, Skipped: 0, Time elapsed: 142.16 sec

    Results :

    Failed tests:
    testObjectCount(org.apache.fulcrum.cache.JCSCacheTest)

    Tests run: 30, Failures: 1, Errors: 0, Skipped: 0

    [INFO] ------------------------------------------------------------------------
    [ERROR] BUILD FAILURE
    [INFO] ------------------------------------------------------------------------
    [INFO] There are test failures.

    Please refer to /srv/gump/public/workspace/turbine-fulcrum/cache/target/surefire-reports for the individual test results.
    [INFO] ------------------------------------------------------------------------
    [INFO] For more information, run Maven with the -e switch
    [INFO] ------------------------------------------------------------------------
    [INFO] Total time: 6 minutes 54 seconds
    [INFO] Finished at: Sat Apr 14 06:29:45 UTC 2012
    [INFO] Final Memory: 14M/35M
    [INFO] ------------------------------------------------------------------------
    ---------------------------------------------

    To subscribe to this information via syndicated feeds:
    - RSS: http://vmgump.apache.org/gump/public/turbine-fulcrum/fulcrum-cache-test/rss.xml
    - Atom: http://vmgump.apache.org/gump/public/turbine-fulcrum/fulcrum-cache-test/atom.xml

    ============================== Gump Tracking Only ===
    Produced by Apache Gump(TM) version 2.3.
    Gump Run 13000014042012, vmgump.apache.org:vmgump:13000014042012
    Gump E-mail Identifier (unique within run) #40.

    --
    Apache Gump
    http://gump.apache.org/ [Instance: vmgump]

    ---------------------------------------------------------------------
    To unsubscribe, e-mail: dev-unsubscribe@turbine.apache.org
    For additional commands, e-mail: dev-help@turbine.apache.org
  • Anonymous at Apr 15, 2012 at 6:37 am
    To whom it may engage...

    This is an automated request, but not an unsolicited one. For
    more information please visit http://gump.apache.org/nagged.html,
    and/or contact the folk at general@gump.apache.org.

    Project fulcrum-cache-test has an issue affecting its community integration.
    This issue affects 1 projects,
    and has been outstanding for 107 runs.
    The current state of this project is 'Failed', with reason 'Build Failed'.
    For reference only, the following projects are affected by this:
    - fulcrum-cache-test : Services Framework


    Full details are available at:
    http://vmgump.apache.org/gump/public/turbine-fulcrum/fulcrum-cache-test/index.html

    That said, some information snippets are provided here.

    The following annotations (debug/informational/warning/error messages) were provided:
    -WARNING- Overriding Maven settings: [/srv/gump/public/workspace/turbine-fulcrum/cache/gump_mvn_settings.xml]
    -DEBUG- (Apache Gump generated) Apache Maven Settings in: /srv/gump/public/workspace/turbine-fulcrum/cache/gump_mvn_settings.xml
    -INFO- Failed with reason build failed
    -DEBUG- Maven POM in: /srv/gump/public/workspace/turbine-fulcrum/cache/pom.xml



    The following work was performed:
    http://vmgump.apache.org/gump/public/turbine-fulcrum/fulcrum-cache-test/gump_work/build_turbine-fulcrum_fulcrum-cache-test.html
    Work Name: build_turbine-fulcrum_fulcrum-cache-test (Type: Build)
    Work ended in a state of : Failed
    Elapsed: 6 mins 56 secs
    Command Line: /opt/maven2/bin/mvn --batch-mode --settings /srv/gump/public/workspace/turbine-fulcrum/cache/gump_mvn_settings.xml test
    [Working Directory: /srv/gump/public/workspace/turbine-fulcrum/cache]
    M2_HOME: /opt/maven2
    ---------------------------------------------
    [DEBUG] Disposing all services
    [DEBUG] Decommision the service jcscache
    [DEBUG] Decommisioning the service jcscache
    [DEBUG] Disposable.dispose() for jcscache
    Apr 15, 2012 6:37:08 AM org.apache.jcs.engine.control.CompositeCache dispose
    INFO: In DISPOSE, [Cache_Test] fromRemote [false]
    Region Name = Cache_Test
    HitCountRam = 308
    HitCountAux = 0
    ---------------------------LRU Memory Cache
    List Size = 3
    Map Size = 3
    Put Count = 23
    Hit Count = 309
    Miss Count = 1
    [DEBUG] JCSCacheService stopped.
    [DEBUG] Decommision the service ehcache
    [DEBUG] Decommisioning the service ehcache
    [DEBUG] Disposable.dispose() for ehcache
    [DEBUG] EHCacheService stopped!
    [DEBUG] Decommision the service cache
    [DEBUG] Decommisioning the service cache
    [DEBUG] Disposable.dispose() for cache
    [DEBUG] Disposing the service jcscache
    [DEBUG] Disposing the service ehcache
    [DEBUG] Disposing the service cache
    [DEBUG] All services are disposed
    [INFO] YaffiContainer has been disposed.
    Tests run: 10, Failures: 0, Errors: 0, Skipped: 0, Time elapsed: 142.163 sec

    Results :

    Failed tests:
    testObjectCount(org.apache.fulcrum.cache.JCSCacheTest)

    Tests run: 30, Failures: 1, Errors: 0, Skipped: 0

    [INFO] ------------------------------------------------------------------------
    [ERROR] BUILD FAILURE
    [INFO] ------------------------------------------------------------------------
    [INFO] There are test failures.

    Please refer to /srv/gump/public/workspace/turbine-fulcrum/cache/target/surefire-reports for the individual test results.
    [INFO] ------------------------------------------------------------------------
    [INFO] For more information, run Maven with the -e switch
    [INFO] ------------------------------------------------------------------------
    [INFO] Total time: 6 minutes 54 seconds
    [INFO] Finished at: Sun Apr 15 06:37:08 UTC 2012
    [INFO] Final Memory: 14M/35M
    [INFO] ------------------------------------------------------------------------
    ---------------------------------------------

    To subscribe to this information via syndicated feeds:
    - RSS: http://vmgump.apache.org/gump/public/turbine-fulcrum/fulcrum-cache-test/rss.xml
    - Atom: http://vmgump.apache.org/gump/public/turbine-fulcrum/fulcrum-cache-test/atom.xml

    ============================== Gump Tracking Only ===
    Produced by Apache Gump(TM) version 2.3.
    Gump Run 11000015042012, vmgump.apache.org:vmgump:11000015042012
    Gump E-mail Identifier (unique within run) #39.

    --
    Apache Gump
    http://gump.apache.org/ [Instance: vmgump]

    ---------------------------------------------------------------------
    To unsubscribe, e-mail: dev-unsubscribe@turbine.apache.org
    For additional commands, e-mail: dev-help@turbine.apache.org
  • Anonymous at Apr 16, 2012 at 6:06 am
    To whom it may engage...

    This is an automated request, but not an unsolicited one. For
    more information please visit http://gump.apache.org/nagged.html,
    and/or contact the folk at general@gump.apache.org.

    Project fulcrum-cache-test has an issue affecting its community integration.
    This issue affects 1 projects,
    and has been outstanding for 109 runs.
    The current state of this project is 'Failed', with reason 'Build Failed'.
    For reference only, the following projects are affected by this:
    - fulcrum-cache-test : Services Framework


    Full details are available at:
    http://vmgump.apache.org/gump/public/turbine-fulcrum/fulcrum-cache-test/index.html

    That said, some information snippets are provided here.

    The following annotations (debug/informational/warning/error messages) were provided:
    -WARNING- Overriding Maven settings: [/srv/gump/public/workspace/turbine-fulcrum/cache/gump_mvn_settings.xml]
    -DEBUG- (Apache Gump generated) Apache Maven Settings in: /srv/gump/public/workspace/turbine-fulcrum/cache/gump_mvn_settings.xml
    -INFO- Failed with reason build failed
    -DEBUG- Maven POM in: /srv/gump/public/workspace/turbine-fulcrum/cache/pom.xml



    The following work was performed:
    http://vmgump.apache.org/gump/public/turbine-fulcrum/fulcrum-cache-test/gump_work/build_turbine-fulcrum_fulcrum-cache-test.html
    Work Name: build_turbine-fulcrum_fulcrum-cache-test (Type: Build)
    Work ended in a state of : Failed
    Elapsed: 6 mins 55 secs
    Command Line: /opt/maven2/bin/mvn --batch-mode --settings /srv/gump/public/workspace/turbine-fulcrum/cache/gump_mvn_settings.xml test
    [Working Directory: /srv/gump/public/workspace/turbine-fulcrum/cache]
    M2_HOME: /opt/maven2
    ---------------------------------------------
    [DEBUG] Disposing all services
    [DEBUG] Decommision the service jcscache
    [DEBUG] Decommisioning the service jcscache
    [DEBUG] Disposable.dispose() for jcscache
    Apr 16, 2012 6:06:26 AM org.apache.jcs.engine.control.CompositeCache dispose
    INFO: In DISPOSE, [Cache_Test] fromRemote [false]
    Region Name = Cache_Test
    HitCountRam = 308
    HitCountAux = 0
    ---------------------------LRU Memory Cache
    List Size = 3
    Map Size = 3
    Put Count = 23
    Hit Count = 309
    Miss Count = 1
    [DEBUG] JCSCacheService stopped.
    [DEBUG] Decommision the service ehcache
    [DEBUG] Decommisioning the service ehcache
    [DEBUG] Disposable.dispose() for ehcache
    [DEBUG] EHCacheService stopped!
    [DEBUG] Decommision the service cache
    [DEBUG] Decommisioning the service cache
    [DEBUG] Disposable.dispose() for cache
    [DEBUG] Disposing the service jcscache
    [DEBUG] Disposing the service ehcache
    [DEBUG] Disposing the service cache
    [DEBUG] All services are disposed
    [INFO] YaffiContainer has been disposed.
    Tests run: 10, Failures: 0, Errors: 0, Skipped: 0, Time elapsed: 142.156 sec

    Results :

    Failed tests:
    testObjectCount(org.apache.fulcrum.cache.JCSCacheTest)

    Tests run: 30, Failures: 1, Errors: 0, Skipped: 0

    [INFO] ------------------------------------------------------------------------
    [ERROR] BUILD FAILURE
    [INFO] ------------------------------------------------------------------------
    [INFO] There are test failures.

    Please refer to /srv/gump/public/workspace/turbine-fulcrum/cache/target/surefire-reports for the individual test results.
    [INFO] ------------------------------------------------------------------------
    [INFO] For more information, run Maven with the -e switch
    [INFO] ------------------------------------------------------------------------
    [INFO] Total time: 6 minutes 54 seconds
    [INFO] Finished at: Mon Apr 16 06:06:26 UTC 2012
    [INFO] Final Memory: 14M/35M
    [INFO] ------------------------------------------------------------------------
    ---------------------------------------------

    To subscribe to this information via syndicated feeds:
    - RSS: http://vmgump.apache.org/gump/public/turbine-fulcrum/fulcrum-cache-test/rss.xml
    - Atom: http://vmgump.apache.org/gump/public/turbine-fulcrum/fulcrum-cache-test/atom.xml

    ============================== Gump Tracking Only ===
    Produced by Apache Gump(TM) version 2.3.
    Gump Run 13000016042012, vmgump.apache.org:vmgump:13000016042012
    Gump E-mail Identifier (unique within run) #36.

    --
    Apache Gump
    http://gump.apache.org/ [Instance: vmgump]

    ---------------------------------------------------------------------
    To unsubscribe, e-mail: dev-unsubscribe@turbine.apache.org
    For additional commands, e-mail: dev-help@turbine.apache.org
  • Anonymous at Apr 17, 2012 at 6:24 am
    To whom it may engage...

    This is an automated request, but not an unsolicited one. For
    more information please visit http://gump.apache.org/nagged.html,
    and/or contact the folk at general@gump.apache.org.

    Project fulcrum-cache-test has an issue affecting its community integration.
    This issue affects 1 projects,
    and has been outstanding for 111 runs.
    The current state of this project is 'Failed', with reason 'Build Failed'.
    For reference only, the following projects are affected by this:
    - fulcrum-cache-test : Services Framework


    Full details are available at:
    http://vmgump.apache.org/gump/public/turbine-fulcrum/fulcrum-cache-test/index.html

    That said, some information snippets are provided here.

    The following annotations (debug/informational/warning/error messages) were provided:
    -WARNING- Overriding Maven settings: [/srv/gump/public/workspace/turbine-fulcrum/cache/gump_mvn_settings.xml]
    -DEBUG- (Apache Gump generated) Apache Maven Settings in: /srv/gump/public/workspace/turbine-fulcrum/cache/gump_mvn_settings.xml
    -INFO- Failed with reason build failed
    -DEBUG- Maven POM in: /srv/gump/public/workspace/turbine-fulcrum/cache/pom.xml



    The following work was performed:
    http://vmgump.apache.org/gump/public/turbine-fulcrum/fulcrum-cache-test/gump_work/build_turbine-fulcrum_fulcrum-cache-test.html
    Work Name: build_turbine-fulcrum_fulcrum-cache-test (Type: Build)
    Work ended in a state of : Failed
    Elapsed: 6 mins 55 secs
    Command Line: /opt/maven2/bin/mvn --batch-mode --settings /srv/gump/public/workspace/turbine-fulcrum/cache/gump_mvn_settings.xml test
    [Working Directory: /srv/gump/public/workspace/turbine-fulcrum/cache]
    M2_HOME: /opt/maven2
    ---------------------------------------------
    INFO: In DISPOSE, [Cache_Test] fromRemote [false]
    Region Name = Cache_Test
    HitCountRam = 308
    HitCountAux = 0
    ---------------------------LRU Memory Cache
    List Size = 3
    Map Size = 3
    Put Count = 23
    Hit Count = 309
    Miss Count = 1
    [DEBUG] Disposing of container...
    [DEBUG] Disposing all services
    [DEBUG] Decommision the service jcscache
    [DEBUG] Decommisioning the service jcscache
    [DEBUG] Disposable.dispose() for jcscache
    [DEBUG] JCSCacheService stopped.
    [DEBUG] Decommision the service ehcache
    [DEBUG] Decommisioning the service ehcache
    [DEBUG] Disposable.dispose() for ehcache
    [DEBUG] EHCacheService stopped!
    [DEBUG] Decommision the service cache
    [DEBUG] Decommisioning the service cache
    [DEBUG] Disposable.dispose() for cache
    [DEBUG] Disposing the service jcscache
    [DEBUG] Disposing the service ehcache
    [DEBUG] Disposing the service cache
    [DEBUG] All services are disposed
    [INFO] YaffiContainer has been disposed.
    Tests run: 10, Failures: 0, Errors: 0, Skipped: 0, Time elapsed: 142.156 sec

    Results :

    Failed tests:
    testObjectCount(org.apache.fulcrum.cache.JCSCacheTest)

    Tests run: 30, Failures: 1, Errors: 0, Skipped: 0

    [INFO] ------------------------------------------------------------------------
    [ERROR] BUILD FAILURE
    [INFO] ------------------------------------------------------------------------
    [INFO] There are test failures.

    Please refer to /srv/gump/public/workspace/turbine-fulcrum/cache/target/surefire-reports for the individual test results.
    [INFO] ------------------------------------------------------------------------
    [INFO] For more information, run Maven with the -e switch
    [INFO] ------------------------------------------------------------------------
    [INFO] Total time: 6 minutes 54 seconds
    [INFO] Finished at: Tue Apr 17 06:24:25 UTC 2012
    [INFO] Final Memory: 14M/35M
    [INFO] ------------------------------------------------------------------------
    ---------------------------------------------

    To subscribe to this information via syndicated feeds:
    - RSS: http://vmgump.apache.org/gump/public/turbine-fulcrum/fulcrum-cache-test/rss.xml
    - Atom: http://vmgump.apache.org/gump/public/turbine-fulcrum/fulcrum-cache-test/atom.xml

    ============================== Gump Tracking Only ===
    Produced by Apache Gump(TM) version 2.3.
    Gump Run 12000017042012, vmgump.apache.org:vmgump:12000017042012
    Gump E-mail Identifier (unique within run) #35.

    --
    Apache Gump
    http://gump.apache.org/ [Instance: vmgump]

    ---------------------------------------------------------------------
    To unsubscribe, e-mail: dev-unsubscribe@turbine.apache.org
    For additional commands, e-mail: dev-help@turbine.apache.org
  • Anonymous at Apr 18, 2012 at 6:29 am
    To whom it may engage...

    This is an automated request, but not an unsolicited one. For
    more information please visit http://gump.apache.org/nagged.html,
    and/or contact the folk at general@gump.apache.org.

    Project fulcrum-cache-test has an issue affecting its community integration.
    This issue affects 1 projects,
    and has been outstanding for 113 runs.
    The current state of this project is 'Failed', with reason 'Build Failed'.
    For reference only, the following projects are affected by this:
    - fulcrum-cache-test : Services Framework


    Full details are available at:
    http://vmgump.apache.org/gump/public/turbine-fulcrum/fulcrum-cache-test/index.html

    That said, some information snippets are provided here.

    The following annotations (debug/informational/warning/error messages) were provided:
    -WARNING- Overriding Maven settings: [/srv/gump/public/workspace/turbine-fulcrum/cache/gump_mvn_settings.xml]
    -DEBUG- (Apache Gump generated) Apache Maven Settings in: /srv/gump/public/workspace/turbine-fulcrum/cache/gump_mvn_settings.xml
    -INFO- Failed with reason build failed
    -DEBUG- Maven POM in: /srv/gump/public/workspace/turbine-fulcrum/cache/pom.xml



    The following work was performed:
    http://vmgump.apache.org/gump/public/turbine-fulcrum/fulcrum-cache-test/gump_work/build_turbine-fulcrum_fulcrum-cache-test.html
    Work Name: build_turbine-fulcrum_fulcrum-cache-test (Type: Build)
    Work ended in a state of : Failed
    Elapsed: 6 mins 55 secs
    Command Line: /opt/maven2/bin/mvn --batch-mode --settings /srv/gump/public/workspace/turbine-fulcrum/cache/gump_mvn_settings.xml test
    [Working Directory: /srv/gump/public/workspace/turbine-fulcrum/cache]
    M2_HOME: /opt/maven2
    ---------------------------------------------
    Apr 18, 2012 6:29:03 AM org.apache.jcs.engine.control.CompositeCache dispose
    INFO: In DISPOSE, [Cache_Test] fromRemote [false]
    Region Name = Cache_Test
    HitCountRam = 308
    HitCountAux = 0
    ---------------------------LRU Memory Cache
    List Size = 3
    Map Size = 3
    Put Count = 23
    Hit Count = 309
    Miss Count = 1
    [DEBUG] Disposing all services
    [DEBUG] Decommision the service jcscache
    [DEBUG] Decommisioning the service jcscache
    [DEBUG] Disposable.dispose() for jcscache
    [DEBUG] JCSCacheService stopped.
    [DEBUG] Decommision the service ehcache
    [DEBUG] Decommisioning the service ehcache
    [DEBUG] Disposable.dispose() for ehcache
    [DEBUG] EHCacheService stopped!
    [DEBUG] Decommision the service cache
    [DEBUG] Decommisioning the service cache
    [DEBUG] Disposable.dispose() for cache
    [DEBUG] Disposing the service jcscache
    [DEBUG] Disposing the service ehcache
    [DEBUG] Disposing the service cache
    [DEBUG] All services are disposed
    [INFO] YaffiContainer has been disposed.
    Tests run: 10, Failures: 0, Errors: 0, Skipped: 0, Time elapsed: 142.162 sec

    Results :

    Failed tests:
    testObjectCount(org.apache.fulcrum.cache.JCSCacheTest)

    Tests run: 30, Failures: 1, Errors: 0, Skipped: 0

    [INFO] ------------------------------------------------------------------------
    [ERROR] BUILD FAILURE
    [INFO] ------------------------------------------------------------------------
    [INFO] There are test failures.

    Please refer to /srv/gump/public/workspace/turbine-fulcrum/cache/target/surefire-reports for the individual test results.
    [INFO] ------------------------------------------------------------------------
    [INFO] For more information, run Maven with the -e switch
    [INFO] ------------------------------------------------------------------------
    [INFO] Total time: 6 minutes 54 seconds
    [INFO] Finished at: Wed Apr 18 06:29:03 UTC 2012
    [INFO] Final Memory: 14M/35M
    [INFO] ------------------------------------------------------------------------
    ---------------------------------------------

    To subscribe to this information via syndicated feeds:
    - RSS: http://vmgump.apache.org/gump/public/turbine-fulcrum/fulcrum-cache-test/rss.xml
    - Atom: http://vmgump.apache.org/gump/public/turbine-fulcrum/fulcrum-cache-test/atom.xml

    ============================== Gump Tracking Only ===
    Produced by Apache Gump(TM) version 2.3.
    Gump Run 14000018042012, vmgump.apache.org:vmgump:14000018042012
    Gump E-mail Identifier (unique within run) #36.

    --
    Apache Gump
    http://gump.apache.org/ [Instance: vmgump]

    ---------------------------------------------------------------------
    To unsubscribe, e-mail: dev-unsubscribe@turbine.apache.org
    For additional commands, e-mail: dev-help@turbine.apache.org
  • Anonymous at Apr 19, 2012 at 6:19 am
    To whom it may engage...

    This is an automated request, but not an unsolicited one. For
    more information please visit http://gump.apache.org/nagged.html,
    and/or contact the folk at general@gump.apache.org.

    Project fulcrum-cache-test has an issue affecting its community integration.
    This issue affects 1 projects,
    and has been outstanding for 115 runs.
    The current state of this project is 'Failed', with reason 'Build Failed'.
    For reference only, the following projects are affected by this:
    - fulcrum-cache-test : Services Framework


    Full details are available at:
    http://vmgump.apache.org/gump/public/turbine-fulcrum/fulcrum-cache-test/index.html

    That said, some information snippets are provided here.

    The following annotations (debug/informational/warning/error messages) were provided:
    -WARNING- Overriding Maven settings: [/srv/gump/public/workspace/turbine-fulcrum/cache/gump_mvn_settings.xml]
    -DEBUG- (Apache Gump generated) Apache Maven Settings in: /srv/gump/public/workspace/turbine-fulcrum/cache/gump_mvn_settings.xml
    -INFO- Failed with reason build failed
    -DEBUG- Maven POM in: /srv/gump/public/workspace/turbine-fulcrum/cache/pom.xml



    The following work was performed:
    http://vmgump.apache.org/gump/public/turbine-fulcrum/fulcrum-cache-test/gump_work/build_turbine-fulcrum_fulcrum-cache-test.html
    Work Name: build_turbine-fulcrum_fulcrum-cache-test (Type: Build)
    Work ended in a state of : Failed
    Elapsed: 6 mins 55 secs
    Command Line: /opt/maven2/bin/mvn --batch-mode --settings /srv/gump/public/workspace/turbine-fulcrum/cache/gump_mvn_settings.xml test
    [Working Directory: /srv/gump/public/workspace/turbine-fulcrum/cache]
    M2_HOME: /opt/maven2
    ---------------------------------------------
    INFO: In DISPOSE, [Cache_Test] fromRemote [false]
    Region Name = Cache_Test
    HitCountRam = 308
    HitCountAux = 0
    ---------------------------LRU Memory Cache
    List Size = 3
    Map Size = 3
    Put Count = 23
    Hit Count = 309
    Miss Count = 1
    [DEBUG] Disposing of container...
    [DEBUG] Disposing all services
    [DEBUG] Decommision the service jcscache
    [DEBUG] Decommisioning the service jcscache
    [DEBUG] Disposable.dispose() for jcscache
    [DEBUG] JCSCacheService stopped.
    [DEBUG] Decommision the service ehcache
    [DEBUG] Decommisioning the service ehcache
    [DEBUG] Disposable.dispose() for ehcache
    [DEBUG] EHCacheService stopped!
    [DEBUG] Decommision the service cache
    [DEBUG] Decommisioning the service cache
    [DEBUG] Disposable.dispose() for cache
    [DEBUG] Disposing the service jcscache
    [DEBUG] Disposing the service ehcache
    [DEBUG] Disposing the service cache
    [DEBUG] All services are disposed
    [INFO] YaffiContainer has been disposed.
    Tests run: 10, Failures: 0, Errors: 0, Skipped: 0, Time elapsed: 142.171 sec

    Results :

    Failed tests:
    testObjectCount(org.apache.fulcrum.cache.JCSCacheTest)

    Tests run: 30, Failures: 1, Errors: 0, Skipped: 0

    [INFO] ------------------------------------------------------------------------
    [ERROR] BUILD FAILURE
    [INFO] ------------------------------------------------------------------------
    [INFO] There are test failures.

    Please refer to /srv/gump/public/workspace/turbine-fulcrum/cache/target/surefire-reports for the individual test results.
    [INFO] ------------------------------------------------------------------------
    [INFO] For more information, run Maven with the -e switch
    [INFO] ------------------------------------------------------------------------
    [INFO] Total time: 6 minutes 54 seconds
    [INFO] Finished at: Thu Apr 19 06:19:00 UTC 2012
    [INFO] Final Memory: 14M/35M
    [INFO] ------------------------------------------------------------------------
    ---------------------------------------------

    To subscribe to this information via syndicated feeds:
    - RSS: http://vmgump.apache.org/gump/public/turbine-fulcrum/fulcrum-cache-test/rss.xml
    - Atom: http://vmgump.apache.org/gump/public/turbine-fulcrum/fulcrum-cache-test/atom.xml

    ============================== Gump Tracking Only ===
    Produced by Apache Gump(TM) version 2.3.
    Gump Run 11000019042012, vmgump.apache.org:vmgump:11000019042012
    Gump E-mail Identifier (unique within run) #35.

    --
    Apache Gump
    http://gump.apache.org/ [Instance: vmgump]

    ---------------------------------------------------------------------
    To unsubscribe, e-mail: dev-unsubscribe@turbine.apache.org
    For additional commands, e-mail: dev-help@turbine.apache.org
  • Anonymous at Apr 20, 2012 at 6:01 am
    To whom it may engage...

    This is an automated request, but not an unsolicited one. For
    more information please visit http://gump.apache.org/nagged.html,
    and/or contact the folk at general@gump.apache.org.

    Project fulcrum-cache-test has an issue affecting its community integration.
    This issue affects 1 projects,
    and has been outstanding for 117 runs.
    The current state of this project is 'Failed', with reason 'Build Failed'.
    For reference only, the following projects are affected by this:
    - fulcrum-cache-test : Services Framework


    Full details are available at:
    http://vmgump.apache.org/gump/public/turbine-fulcrum/fulcrum-cache-test/index.html

    That said, some information snippets are provided here.

    The following annotations (debug/informational/warning/error messages) were provided:
    -WARNING- Overriding Maven settings: [/srv/gump/public/workspace/turbine-fulcrum/cache/gump_mvn_settings.xml]
    -DEBUG- (Apache Gump generated) Apache Maven Settings in: /srv/gump/public/workspace/turbine-fulcrum/cache/gump_mvn_settings.xml
    -INFO- Failed with reason build failed
    -DEBUG- Maven POM in: /srv/gump/public/workspace/turbine-fulcrum/cache/pom.xml



    The following work was performed:
    http://vmgump.apache.org/gump/public/turbine-fulcrum/fulcrum-cache-test/gump_work/build_turbine-fulcrum_fulcrum-cache-test.html
    Work Name: build_turbine-fulcrum_fulcrum-cache-test (Type: Build)
    Work ended in a state of : Failed
    Elapsed: 6 mins 55 secs
    Command Line: /opt/maven2/bin/mvn --batch-mode --settings /srv/gump/public/workspace/turbine-fulcrum/cache/gump_mvn_settings.xml test
    [Working Directory: /srv/gump/public/workspace/turbine-fulcrum/cache]
    M2_HOME: /opt/maven2
    ---------------------------------------------
    [DEBUG] Disposing all services
    [DEBUG] Decommision the service jcscache
    [DEBUG] Decommisioning the service jcscache
    [DEBUG] Disposable.dispose() for jcscache
    Apr 20, 2012 6:01:16 AM org.apache.jcs.engine.control.CompositeCache dispose
    INFO: In DISPOSE, [Cache_Test] fromRemote [false]
    Region Name = Cache_Test
    HitCountRam = 308
    HitCountAux = 0
    ---------------------------LRU Memory Cache
    List Size = 3
    Map Size = 3
    Put Count = 23
    Hit Count = 309
    Miss Count = 1
    [DEBUG] JCSCacheService stopped.
    [DEBUG] Decommision the service ehcache
    [DEBUG] Decommisioning the service ehcache
    [DEBUG] Disposable.dispose() for ehcache
    [DEBUG] EHCacheService stopped!
    [DEBUG] Decommision the service cache
    [DEBUG] Decommisioning the service cache
    [DEBUG] Disposable.dispose() for cache
    [DEBUG] Disposing the service jcscache
    [DEBUG] Disposing the service ehcache
    [DEBUG] Disposing the service cache
    [DEBUG] All services are disposed
    [INFO] YaffiContainer has been disposed.
    Tests run: 10, Failures: 0, Errors: 0, Skipped: 0, Time elapsed: 142.137 sec

    Results :

    Failed tests:
    testObjectCount(org.apache.fulcrum.cache.JCSCacheTest)

    Tests run: 30, Failures: 1, Errors: 0, Skipped: 0

    [INFO] ------------------------------------------------------------------------
    [ERROR] BUILD FAILURE
    [INFO] ------------------------------------------------------------------------
    [INFO] There are test failures.

    Please refer to /srv/gump/public/workspace/turbine-fulcrum/cache/target/surefire-reports for the individual test results.
    [INFO] ------------------------------------------------------------------------
    [INFO] For more information, run Maven with the -e switch
    [INFO] ------------------------------------------------------------------------
    [INFO] Total time: 6 minutes 54 seconds
    [INFO] Finished at: Fri Apr 20 06:01:16 UTC 2012
    [INFO] Final Memory: 14M/35M
    [INFO] ------------------------------------------------------------------------
    ---------------------------------------------

    To subscribe to this information via syndicated feeds:
    - RSS: http://vmgump.apache.org/gump/public/turbine-fulcrum/fulcrum-cache-test/rss.xml
    - Atom: http://vmgump.apache.org/gump/public/turbine-fulcrum/fulcrum-cache-test/atom.xml

    ============================== Gump Tracking Only ===
    Produced by Apache Gump(TM) version 2.3.
    Gump Run 13000020042012, vmgump.apache.org:vmgump:13000020042012
    Gump E-mail Identifier (unique within run) #42.

    --
    Apache Gump
    http://gump.apache.org/ [Instance: vmgump]

    ---------------------------------------------------------------------
    To unsubscribe, e-mail: dev-unsubscribe@turbine.apache.org
    For additional commands, e-mail: dev-help@turbine.apache.org
  • Anonymous at Apr 21, 2012 at 6:02 am
    To whom it may engage...

    This is an automated request, but not an unsolicited one. For
    more information please visit http://gump.apache.org/nagged.html,
    and/or contact the folk at general@gump.apache.org.

    Project fulcrum-cache-test has an issue affecting its community integration.
    This issue affects 1 projects,
    and has been outstanding for 119 runs.
    The current state of this project is 'Failed', with reason 'Build Failed'.
    For reference only, the following projects are affected by this:
    - fulcrum-cache-test : Services Framework


    Full details are available at:
    http://vmgump.apache.org/gump/public/turbine-fulcrum/fulcrum-cache-test/index.html

    That said, some information snippets are provided here.

    The following annotations (debug/informational/warning/error messages) were provided:
    -WARNING- Overriding Maven settings: [/srv/gump/public/workspace/turbine-fulcrum/cache/gump_mvn_settings.xml]
    -DEBUG- (Apache Gump generated) Apache Maven Settings in: /srv/gump/public/workspace/turbine-fulcrum/cache/gump_mvn_settings.xml
    -INFO- Failed with reason build failed
    -DEBUG- Maven POM in: /srv/gump/public/workspace/turbine-fulcrum/cache/pom.xml



    The following work was performed:
    http://vmgump.apache.org/gump/public/turbine-fulcrum/fulcrum-cache-test/gump_work/build_turbine-fulcrum_fulcrum-cache-test.html
    Work Name: build_turbine-fulcrum_fulcrum-cache-test (Type: Build)
    Work ended in a state of : Failed
    Elapsed: 6 mins 55 secs
    Command Line: /opt/maven2/bin/mvn --batch-mode --settings /srv/gump/public/workspace/turbine-fulcrum/cache/gump_mvn_settings.xml test
    [Working Directory: /srv/gump/public/workspace/turbine-fulcrum/cache]
    M2_HOME: /opt/maven2
    ---------------------------------------------
    INFO: In DISPOSE, [Cache_Test] fromRemote [false]
    Region Name = Cache_Test
    HitCountRam = 308
    HitCountAux = 0
    ---------------------------LRU Memory Cache
    List Size = 3
    Map Size = 3
    Put Count = 23
    Hit Count = 309
    Miss Count = 1
    [DEBUG] Disposing of container...
    [DEBUG] Disposing all services
    [DEBUG] Decommision the service jcscache
    [DEBUG] Decommisioning the service jcscache
    [DEBUG] Disposable.dispose() for jcscache
    [DEBUG] JCSCacheService stopped.
    [DEBUG] Decommision the service ehcache
    [DEBUG] Decommisioning the service ehcache
    [DEBUG] Disposable.dispose() for ehcache
    [DEBUG] EHCacheService stopped!
    [DEBUG] Decommision the service cache
    [DEBUG] Decommisioning the service cache
    [DEBUG] Disposable.dispose() for cache
    [DEBUG] Disposing the service jcscache
    [DEBUG] Disposing the service ehcache
    [DEBUG] Disposing the service cache
    [DEBUG] All services are disposed
    [INFO] YaffiContainer has been disposed.
    Tests run: 10, Failures: 0, Errors: 0, Skipped: 0, Time elapsed: 142.154 sec

    Results :

    Failed tests:
    testObjectCount(org.apache.fulcrum.cache.JCSCacheTest)

    Tests run: 30, Failures: 1, Errors: 0, Skipped: 0

    [INFO] ------------------------------------------------------------------------
    [ERROR] BUILD FAILURE
    [INFO] ------------------------------------------------------------------------
    [INFO] There are test failures.

    Please refer to /srv/gump/public/workspace/turbine-fulcrum/cache/target/surefire-reports for the individual test results.
    [INFO] ------------------------------------------------------------------------
    [INFO] For more information, run Maven with the -e switch
    [INFO] ------------------------------------------------------------------------
    [INFO] Total time: 6 minutes 54 seconds
    [INFO] Finished at: Sat Apr 21 06:01:34 UTC 2012
    [INFO] Final Memory: 14M/35M
    [INFO] ------------------------------------------------------------------------
    ---------------------------------------------

    To subscribe to this information via syndicated feeds:
    - RSS: http://vmgump.apache.org/gump/public/turbine-fulcrum/fulcrum-cache-test/rss.xml
    - Atom: http://vmgump.apache.org/gump/public/turbine-fulcrum/fulcrum-cache-test/atom.xml

    ============================== Gump Tracking Only ===
    Produced by Apache Gump(TM) version 2.3.
    Gump Run 12000021042012, vmgump.apache.org:vmgump:12000021042012
    Gump E-mail Identifier (unique within run) #40.

    --
    Apache Gump
    http://gump.apache.org/ [Instance: vmgump]

    ---------------------------------------------------------------------
    To unsubscribe, e-mail: dev-unsubscribe@turbine.apache.org
    For additional commands, e-mail: dev-help@turbine.apache.org
  • Anonymous at Apr 22, 2012 at 6:05 am
    To whom it may engage...

    This is an automated request, but not an unsolicited one. For
    more information please visit http://gump.apache.org/nagged.html,
    and/or contact the folk at general@gump.apache.org.

    Project fulcrum-cache-test has an issue affecting its community integration.
    This issue affects 1 projects,
    and has been outstanding for 121 runs.
    The current state of this project is 'Failed', with reason 'Build Failed'.
    For reference only, the following projects are affected by this:
    - fulcrum-cache-test : Services Framework


    Full details are available at:
    http://vmgump.apache.org/gump/public/turbine-fulcrum/fulcrum-cache-test/index.html

    That said, some information snippets are provided here.

    The following annotations (debug/informational/warning/error messages) were provided:
    -WARNING- Overriding Maven settings: [/srv/gump/public/workspace/turbine-fulcrum/cache/gump_mvn_settings.xml]
    -DEBUG- (Apache Gump generated) Apache Maven Settings in: /srv/gump/public/workspace/turbine-fulcrum/cache/gump_mvn_settings.xml
    -INFO- Failed with reason build failed
    -DEBUG- Maven POM in: /srv/gump/public/workspace/turbine-fulcrum/cache/pom.xml



    The following work was performed:
    http://vmgump.apache.org/gump/public/turbine-fulcrum/fulcrum-cache-test/gump_work/build_turbine-fulcrum_fulcrum-cache-test.html
    Work Name: build_turbine-fulcrum_fulcrum-cache-test (Type: Build)
    Work ended in a state of : Failed
    Elapsed: 6 mins 55 secs
    Command Line: /opt/maven2/bin/mvn --batch-mode --settings /srv/gump/public/workspace/turbine-fulcrum/cache/gump_mvn_settings.xml test
    [Working Directory: /srv/gump/public/workspace/turbine-fulcrum/cache]
    M2_HOME: /opt/maven2
    ---------------------------------------------
    INFO: In DISPOSE, [Cache_Test] fromRemote [false]
    Region Name = Cache_Test
    HitCountRam = 308
    HitCountAux = 0
    ---------------------------LRU Memory Cache
    List Size = 3
    Map Size = 3
    Put Count = 23
    Hit Count = 309
    Miss Count = 1
    [DEBUG] Disposing of container...
    [DEBUG] Disposing all services
    [DEBUG] Decommision the service jcscache
    [DEBUG] Decommisioning the service jcscache
    [DEBUG] Disposable.dispose() for jcscache
    [DEBUG] JCSCacheService stopped.
    [DEBUG] Decommision the service ehcache
    [DEBUG] Decommisioning the service ehcache
    [DEBUG] Disposable.dispose() for ehcache
    [DEBUG] EHCacheService stopped!
    [DEBUG] Decommision the service cache
    [DEBUG] Decommisioning the service cache
    [DEBUG] Disposable.dispose() for cache
    [DEBUG] Disposing the service jcscache
    [DEBUG] Disposing the service ehcache
    [DEBUG] Disposing the service cache
    [DEBUG] All services are disposed
    [INFO] YaffiContainer has been disposed.
    Tests run: 10, Failures: 0, Errors: 0, Skipped: 0, Time elapsed: 142.158 sec

    Results :

    Failed tests:
    testObjectCount(org.apache.fulcrum.cache.JCSCacheTest)

    Tests run: 30, Failures: 1, Errors: 0, Skipped: 0

    [INFO] ------------------------------------------------------------------------
    [ERROR] BUILD FAILURE
    [INFO] ------------------------------------------------------------------------
    [INFO] There are test failures.

    Please refer to /srv/gump/public/workspace/turbine-fulcrum/cache/target/surefire-reports for the individual test results.
    [INFO] ------------------------------------------------------------------------
    [INFO] For more information, run Maven with the -e switch
    [INFO] ------------------------------------------------------------------------
    [INFO] Total time: 6 minutes 54 seconds
    [INFO] Finished at: Sun Apr 22 06:04:32 UTC 2012
    [INFO] Final Memory: 14M/35M
    [INFO] ------------------------------------------------------------------------
    ---------------------------------------------

    To subscribe to this information via syndicated feeds:
    - RSS: http://vmgump.apache.org/gump/public/turbine-fulcrum/fulcrum-cache-test/rss.xml
    - Atom: http://vmgump.apache.org/gump/public/turbine-fulcrum/fulcrum-cache-test/atom.xml

    ============================== Gump Tracking Only ===
    Produced by Apache Gump(TM) version 2.3.
    Gump Run 13000022042012, vmgump.apache.org:vmgump:13000022042012
    Gump E-mail Identifier (unique within run) #40.

    --
    Apache Gump
    http://gump.apache.org/ [Instance: vmgump]

    ---------------------------------------------------------------------
    To unsubscribe, e-mail: dev-unsubscribe@turbine.apache.org
    For additional commands, e-mail: dev-help@turbine.apache.org
  • Anonymous at Apr 23, 2012 at 6:32 am
    To whom it may engage...

    This is an automated request, but not an unsolicited one. For
    more information please visit http://gump.apache.org/nagged.html,
    and/or contact the folk at general@gump.apache.org.

    Project fulcrum-cache-test has an issue affecting its community integration.
    This issue affects 1 projects,
    and has been outstanding for 123 runs.
    The current state of this project is 'Failed', with reason 'Build Failed'.
    For reference only, the following projects are affected by this:
    - fulcrum-cache-test : Services Framework


    Full details are available at:
    http://vmgump.apache.org/gump/public/turbine-fulcrum/fulcrum-cache-test/index.html

    That said, some information snippets are provided here.

    The following annotations (debug/informational/warning/error messages) were provided:
    -WARNING- Overriding Maven settings: [/srv/gump/public/workspace/turbine-fulcrum/cache/gump_mvn_settings.xml]
    -DEBUG- (Apache Gump generated) Apache Maven Settings in: /srv/gump/public/workspace/turbine-fulcrum/cache/gump_mvn_settings.xml
    -INFO- Failed with reason build failed
    -DEBUG- Maven POM in: /srv/gump/public/workspace/turbine-fulcrum/cache/pom.xml



    The following work was performed:
    http://vmgump.apache.org/gump/public/turbine-fulcrum/fulcrum-cache-test/gump_work/build_turbine-fulcrum_fulcrum-cache-test.html
    Work Name: build_turbine-fulcrum_fulcrum-cache-test (Type: Build)
    Work ended in a state of : Failed
    Elapsed: 6 mins 55 secs
    Command Line: /opt/maven2/bin/mvn --batch-mode --settings /srv/gump/public/workspace/turbine-fulcrum/cache/gump_mvn_settings.xml test
    [Working Directory: /srv/gump/public/workspace/turbine-fulcrum/cache]
    M2_HOME: /opt/maven2
    ---------------------------------------------
    INFO: In DISPOSE, [Cache_Test] fromRemote [false]
    Region Name = Cache_Test
    HitCountRam = 308
    HitCountAux = 0
    ---------------------------LRU Memory Cache
    List Size = 3
    Map Size = 3
    Put Count = 23
    Hit Count = 309
    Miss Count = 1
    [DEBUG] Disposing of container...
    [DEBUG] Disposing all services
    [DEBUG] Decommision the service jcscache
    [DEBUG] Decommisioning the service jcscache
    [DEBUG] Disposable.dispose() for jcscache
    [DEBUG] JCSCacheService stopped.
    [DEBUG] Decommision the service ehcache
    [DEBUG] Decommisioning the service ehcache
    [DEBUG] Disposable.dispose() for ehcache
    [DEBUG] EHCacheService stopped!
    [DEBUG] Decommision the service cache
    [DEBUG] Decommisioning the service cache
    [DEBUG] Disposable.dispose() for cache
    [DEBUG] Disposing the service jcscache
    [DEBUG] Disposing the service ehcache
    [DEBUG] Disposing the service cache
    [DEBUG] All services are disposed
    [INFO] YaffiContainer has been disposed.
    Tests run: 10, Failures: 0, Errors: 0, Skipped: 0, Time elapsed: 142.157 sec

    Results :

    Failed tests:
    testObjectCount(org.apache.fulcrum.cache.JCSCacheTest)

    Tests run: 30, Failures: 1, Errors: 0, Skipped: 0

    [INFO] ------------------------------------------------------------------------
    [ERROR] BUILD FAILURE
    [INFO] ------------------------------------------------------------------------
    [INFO] There are test failures.

    Please refer to /srv/gump/public/workspace/turbine-fulcrum/cache/target/surefire-reports for the individual test results.
    [INFO] ------------------------------------------------------------------------
    [INFO] For more information, run Maven with the -e switch
    [INFO] ------------------------------------------------------------------------
    [INFO] Total time: 6 minutes 54 seconds
    [INFO] Finished at: Mon Apr 23 06:31:43 UTC 2012
    [INFO] Final Memory: 14M/35M
    [INFO] ------------------------------------------------------------------------
    ---------------------------------------------

    To subscribe to this information via syndicated feeds:
    - RSS: http://vmgump.apache.org/gump/public/turbine-fulcrum/fulcrum-cache-test/rss.xml
    - Atom: http://vmgump.apache.org/gump/public/turbine-fulcrum/fulcrum-cache-test/atom.xml

    ============================== Gump Tracking Only ===
    Produced by Apache Gump(TM) version 2.3.
    Gump Run 13000023042012, vmgump.apache.org:vmgump:13000023042012
    Gump E-mail Identifier (unique within run) #43.

    --
    Apache Gump
    http://gump.apache.org/ [Instance: vmgump]

    ---------------------------------------------------------------------
    To unsubscribe, e-mail: dev-unsubscribe@turbine.apache.org
    For additional commands, e-mail: dev-help@turbine.apache.org
  • Anonymous at Apr 24, 2012 at 6:24 am
    To whom it may engage...

    This is an automated request, but not an unsolicited one. For
    more information please visit http://gump.apache.org/nagged.html,
    and/or contact the folk at general@gump.apache.org.

    Project fulcrum-cache-test has an issue affecting its community integration.
    This issue affects 1 projects,
    and has been outstanding for 125 runs.
    The current state of this project is 'Failed', with reason 'Build Failed'.
    For reference only, the following projects are affected by this:
    - fulcrum-cache-test : Services Framework


    Full details are available at:
    http://vmgump.apache.org/gump/public/turbine-fulcrum/fulcrum-cache-test/index.html

    That said, some information snippets are provided here.

    The following annotations (debug/informational/warning/error messages) were provided:
    -WARNING- Overriding Maven settings: [/srv/gump/public/workspace/turbine-fulcrum/cache/gump_mvn_settings.xml]
    -DEBUG- (Apache Gump generated) Apache Maven Settings in: /srv/gump/public/workspace/turbine-fulcrum/cache/gump_mvn_settings.xml
    -INFO- Failed with reason build failed
    -DEBUG- Maven POM in: /srv/gump/public/workspace/turbine-fulcrum/cache/pom.xml



    The following work was performed:
    http://vmgump.apache.org/gump/public/turbine-fulcrum/fulcrum-cache-test/gump_work/build_turbine-fulcrum_fulcrum-cache-test.html
    Work Name: build_turbine-fulcrum_fulcrum-cache-test (Type: Build)
    Work ended in a state of : Failed
    Elapsed: 6 mins 56 secs
    Command Line: /opt/maven2/bin/mvn --batch-mode --settings /srv/gump/public/workspace/turbine-fulcrum/cache/gump_mvn_settings.xml test
    [Working Directory: /srv/gump/public/workspace/turbine-fulcrum/cache]
    M2_HOME: /opt/maven2
    ---------------------------------------------
    [DEBUG] Disposing all services
    [DEBUG] Decommision the service jcscache
    [DEBUG] Decommisioning the service jcscache
    [DEBUG] Disposable.dispose() for jcscache
    Apr 24, 2012 6:24:25 AM org.apache.jcs.engine.control.CompositeCache dispose
    INFO: In DISPOSE, [Cache_Test] fromRemote [false]
    Region Name = Cache_Test
    HitCountRam = 308
    HitCountAux = 0
    ---------------------------LRU Memory Cache
    List Size = 3
    Map Size = 3
    Put Count = 23
    Hit Count = 309
    Miss Count = 1
    [DEBUG] JCSCacheService stopped.
    [DEBUG] Decommision the service ehcache
    [DEBUG] Decommisioning the service ehcache
    [DEBUG] Disposable.dispose() for ehcache
    [DEBUG] EHCacheService stopped!
    [DEBUG] Decommision the service cache
    [DEBUG] Decommisioning the service cache
    [DEBUG] Disposable.dispose() for cache
    [DEBUG] Disposing the service jcscache
    [DEBUG] Disposing the service ehcache
    [DEBUG] Disposing the service cache
    [DEBUG] All services are disposed
    [INFO] YaffiContainer has been disposed.
    Tests run: 10, Failures: 0, Errors: 0, Skipped: 0, Time elapsed: 142.143 sec

    Results :

    Failed tests:
    testObjectCount(org.apache.fulcrum.cache.JCSCacheTest)

    Tests run: 30, Failures: 1, Errors: 0, Skipped: 0

    [INFO] ------------------------------------------------------------------------
    [ERROR] BUILD FAILURE
    [INFO] ------------------------------------------------------------------------
    [INFO] There are test failures.

    Please refer to /srv/gump/public/workspace/turbine-fulcrum/cache/target/surefire-reports for the individual test results.
    [INFO] ------------------------------------------------------------------------
    [INFO] For more information, run Maven with the -e switch
    [INFO] ------------------------------------------------------------------------
    [INFO] Total time: 6 minutes 54 seconds
    [INFO] Finished at: Tue Apr 24 06:24:25 UTC 2012
    [INFO] Final Memory: 14M/35M
    [INFO] ------------------------------------------------------------------------
    ---------------------------------------------

    To subscribe to this information via syndicated feeds:
    - RSS: http://vmgump.apache.org/gump/public/turbine-fulcrum/fulcrum-cache-test/rss.xml
    - Atom: http://vmgump.apache.org/gump/public/turbine-fulcrum/fulcrum-cache-test/atom.xml

    ============================== Gump Tracking Only ===
    Produced by Apache Gump(TM) version 2.3.
    Gump Run 12000024042012, vmgump.apache.org:vmgump:12000024042012
    Gump E-mail Identifier (unique within run) #47.

    --
    Apache Gump
    http://gump.apache.org/ [Instance: vmgump]

    ---------------------------------------------------------------------
    To unsubscribe, e-mail: dev-unsubscribe@turbine.apache.org
    For additional commands, e-mail: dev-help@turbine.apache.org
  • Anonymous at Apr 25, 2012 at 6:24 am
    To whom it may engage...

    This is an automated request, but not an unsolicited one. For
    more information please visit http://gump.apache.org/nagged.html,
    and/or contact the folk at general@gump.apache.org.

    Project fulcrum-cache-test has an issue affecting its community integration.
    This issue affects 1 projects,
    and has been outstanding for 127 runs.
    The current state of this project is 'Failed', with reason 'Build Failed'.
    For reference only, the following projects are affected by this:
    - fulcrum-cache-test : Services Framework


    Full details are available at:
    http://vmgump.apache.org/gump/public/turbine-fulcrum/fulcrum-cache-test/index.html

    That said, some information snippets are provided here.

    The following annotations (debug/informational/warning/error messages) were provided:
    -WARNING- Overriding Maven settings: [/srv/gump/public/workspace/turbine-fulcrum/cache/gump_mvn_settings.xml]
    -DEBUG- (Apache Gump generated) Apache Maven Settings in: /srv/gump/public/workspace/turbine-fulcrum/cache/gump_mvn_settings.xml
    -INFO- Failed with reason build failed
    -DEBUG- Maven POM in: /srv/gump/public/workspace/turbine-fulcrum/cache/pom.xml



    The following work was performed:
    http://vmgump.apache.org/gump/public/turbine-fulcrum/fulcrum-cache-test/gump_work/build_turbine-fulcrum_fulcrum-cache-test.html
    Work Name: build_turbine-fulcrum_fulcrum-cache-test (Type: Build)
    Work ended in a state of : Failed
    Elapsed: 6 mins 55 secs
    Command Line: /opt/maven2/bin/mvn --batch-mode --settings /srv/gump/public/workspace/turbine-fulcrum/cache/gump_mvn_settings.xml test
    [Working Directory: /srv/gump/public/workspace/turbine-fulcrum/cache]
    M2_HOME: /opt/maven2
    ---------------------------------------------
    [DEBUG] Disposing all services
    [DEBUG] Decommision the service jcscache
    [DEBUG] Decommisioning the service jcscache
    Apr 25, 2012 6:23:40 AM org.apache.jcs.engine.control.CompositeCache dispose
    INFO: In DISPOSE, [Cache_Test] fromRemote [false]
    Region Name = Cache_Test
    HitCountRam = 308
    HitCountAux = 0
    ---------------------------LRU Memory Cache
    List Size = 3
    Map Size = 3
    Put Count = 23
    Hit Count = 309
    Miss Count = 1
    [DEBUG] Disposable.dispose() for jcscache
    [DEBUG] JCSCacheService stopped.
    [DEBUG] Decommision the service ehcache
    [DEBUG] Decommisioning the service ehcache
    [DEBUG] Disposable.dispose() for ehcache
    [DEBUG] EHCacheService stopped!
    [DEBUG] Decommision the service cache
    [DEBUG] Decommisioning the service cache
    [DEBUG] Disposable.dispose() for cache
    [DEBUG] Disposing the service jcscache
    [DEBUG] Disposing the service ehcache
    [DEBUG] Disposing the service cache
    [DEBUG] All services are disposed
    [INFO] YaffiContainer has been disposed.
    Tests run: 10, Failures: 0, Errors: 0, Skipped: 0, Time elapsed: 142.137 sec

    Results :

    Failed tests:
    testObjectCount(org.apache.fulcrum.cache.JCSCacheTest)

    Tests run: 30, Failures: 1, Errors: 0, Skipped: 0

    [INFO] ------------------------------------------------------------------------
    [ERROR] BUILD FAILURE
    [INFO] ------------------------------------------------------------------------
    [INFO] There are test failures.

    Please refer to /srv/gump/public/workspace/turbine-fulcrum/cache/target/surefire-reports for the individual test results.
    [INFO] ------------------------------------------------------------------------
    [INFO] For more information, run Maven with the -e switch
    [INFO] ------------------------------------------------------------------------
    [INFO] Total time: 6 minutes 54 seconds
    [INFO] Finished at: Wed Apr 25 06:23:40 UTC 2012
    [INFO] Final Memory: 14M/35M
    [INFO] ------------------------------------------------------------------------
    ---------------------------------------------

    To subscribe to this information via syndicated feeds:
    - RSS: http://vmgump.apache.org/gump/public/turbine-fulcrum/fulcrum-cache-test/rss.xml
    - Atom: http://vmgump.apache.org/gump/public/turbine-fulcrum/fulcrum-cache-test/atom.xml

    ============================== Gump Tracking Only ===
    Produced by Apache Gump(TM) version 2.3.
    Gump Run 12000025042012, vmgump.apache.org:vmgump:12000025042012
    Gump E-mail Identifier (unique within run) #45.

    --
    Apache Gump
    http://gump.apache.org/ [Instance: vmgump]

    ---------------------------------------------------------------------
    To unsubscribe, e-mail: dev-unsubscribe@turbine.apache.org
    For additional commands, e-mail: dev-help@turbine.apache.org
  • Anonymous at Apr 26, 2012 at 6:23 am
    To whom it may engage...

    This is an automated request, but not an unsolicited one. For
    more information please visit http://gump.apache.org/nagged.html,
    and/or contact the folk at general@gump.apache.org.

    Project fulcrum-cache-test has an issue affecting its community integration.
    This issue affects 1 projects,
    and has been outstanding for 129 runs.
    The current state of this project is 'Failed', with reason 'Build Failed'.
    For reference only, the following projects are affected by this:
    - fulcrum-cache-test : Services Framework


    Full details are available at:
    http://vmgump.apache.org/gump/public/turbine-fulcrum/fulcrum-cache-test/index.html

    That said, some information snippets are provided here.

    The following annotations (debug/informational/warning/error messages) were provided:
    -WARNING- Overriding Maven settings: [/srv/gump/public/workspace/turbine-fulcrum/cache/gump_mvn_settings.xml]
    -DEBUG- (Apache Gump generated) Apache Maven Settings in: /srv/gump/public/workspace/turbine-fulcrum/cache/gump_mvn_settings.xml
    -INFO- Failed with reason build failed
    -DEBUG- Maven POM in: /srv/gump/public/workspace/turbine-fulcrum/cache/pom.xml



    The following work was performed:
    http://vmgump.apache.org/gump/public/turbine-fulcrum/fulcrum-cache-test/gump_work/build_turbine-fulcrum_fulcrum-cache-test.html
    Work Name: build_turbine-fulcrum_fulcrum-cache-test (Type: Build)
    Work ended in a state of : Failed
    Elapsed: 6 mins 55 secs
    Command Line: /opt/maven2/bin/mvn --batch-mode --settings /srv/gump/public/workspace/turbine-fulcrum/cache/gump_mvn_settings.xml test
    [Working Directory: /srv/gump/public/workspace/turbine-fulcrum/cache]
    M2_HOME: /opt/maven2
    ---------------------------------------------
    INFO: In DISPOSE, [Cache_Test] fromRemote [false]
    Region Name = Cache_Test
    HitCountRam = 308
    HitCountAux = 0
    ---------------------------LRU Memory Cache
    List Size = 3
    Map Size = 3
    Put Count = 23
    Hit Count = 309
    Miss Count = 1
    [DEBUG] Disposing of container...
    [DEBUG] Disposing all services
    [DEBUG] Decommision the service jcscache
    [DEBUG] Decommisioning the service jcscache
    [DEBUG] Disposable.dispose() for jcscache
    [DEBUG] JCSCacheService stopped.
    [DEBUG] Decommision the service ehcache
    [DEBUG] Decommisioning the service ehcache
    [DEBUG] Disposable.dispose() for ehcache
    [DEBUG] EHCacheService stopped!
    [DEBUG] Decommision the service cache
    [DEBUG] Decommisioning the service cache
    [DEBUG] Disposable.dispose() for cache
    [DEBUG] Disposing the service jcscache
    [DEBUG] Disposing the service ehcache
    [DEBUG] Disposing the service cache
    [DEBUG] All services are disposed
    [INFO] YaffiContainer has been disposed.
    Tests run: 10, Failures: 0, Errors: 0, Skipped: 0, Time elapsed: 142.155 sec

    Results :

    Failed tests:
    testObjectCount(org.apache.fulcrum.cache.JCSCacheTest)

    Tests run: 30, Failures: 1, Errors: 0, Skipped: 0

    [INFO] ------------------------------------------------------------------------
    [ERROR] BUILD FAILURE
    [INFO] ------------------------------------------------------------------------
    [INFO] There are test failures.

    Please refer to /srv/gump/public/workspace/turbine-fulcrum/cache/target/surefire-reports for the individual test results.
    [INFO] ------------------------------------------------------------------------
    [INFO] For more information, run Maven with the -e switch
    [INFO] ------------------------------------------------------------------------
    [INFO] Total time: 6 minutes 54 seconds
    [INFO] Finished at: Thu Apr 26 06:23:22 UTC 2012
    [INFO] Final Memory: 14M/35M
    [INFO] ------------------------------------------------------------------------
    ---------------------------------------------

    To subscribe to this information via syndicated feeds:
    - RSS: http://vmgump.apache.org/gump/public/turbine-fulcrum/fulcrum-cache-test/rss.xml
    - Atom: http://vmgump.apache.org/gump/public/turbine-fulcrum/fulcrum-cache-test/atom.xml

    ============================== Gump Tracking Only ===
    Produced by Apache Gump(TM) version 2.3.
    Gump Run 12000026042012, vmgump.apache.org:vmgump:12000026042012
    Gump E-mail Identifier (unique within run) #44.

    --
    Apache Gump
    http://gump.apache.org/ [Instance: vmgump]

    ---------------------------------------------------------------------
    To unsubscribe, e-mail: dev-unsubscribe@turbine.apache.org
    For additional commands, e-mail: dev-help@turbine.apache.org
  • Anonymous at Apr 27, 2012 at 6:26 am
    To whom it may engage...

    This is an automated request, but not an unsolicited one. For
    more information please visit http://gump.apache.org/nagged.html,
    and/or contact the folk at general@gump.apache.org.

    Project fulcrum-cache-test has an issue affecting its community integration.
    This issue affects 1 projects,
    and has been outstanding for 131 runs.
    The current state of this project is 'Failed', with reason 'Build Failed'.
    For reference only, the following projects are affected by this:
    - fulcrum-cache-test : Services Framework


    Full details are available at:
    http://vmgump.apache.org/gump/public/turbine-fulcrum/fulcrum-cache-test/index.html

    That said, some information snippets are provided here.

    The following annotations (debug/informational/warning/error messages) were provided:
    -WARNING- Overriding Maven settings: [/srv/gump/public/workspace/turbine-fulcrum/cache/gump_mvn_settings.xml]
    -DEBUG- (Apache Gump generated) Apache Maven Settings in: /srv/gump/public/workspace/turbine-fulcrum/cache/gump_mvn_settings.xml
    -INFO- Failed with reason build failed
    -DEBUG- Maven POM in: /srv/gump/public/workspace/turbine-fulcrum/cache/pom.xml



    The following work was performed:
    http://vmgump.apache.org/gump/public/turbine-fulcrum/fulcrum-cache-test/gump_work/build_turbine-fulcrum_fulcrum-cache-test.html
    Work Name: build_turbine-fulcrum_fulcrum-cache-test (Type: Build)
    Work ended in a state of : Failed
    Elapsed: 6 mins 55 secs
    Command Line: /opt/maven2/bin/mvn --batch-mode --settings /srv/gump/public/workspace/turbine-fulcrum/cache/gump_mvn_settings.xml test
    [Working Directory: /srv/gump/public/workspace/turbine-fulcrum/cache]
    M2_HOME: /opt/maven2
    ---------------------------------------------
    [DEBUG] Disposing all services
    [DEBUG] Decommision the service jcscache
    [DEBUG] Decommisioning the service jcscache
    [DEBUG] Disposable.dispose() for jcscache
    Apr 27, 2012 6:25:53 AM org.apache.jcs.engine.control.CompositeCache dispose
    INFO: In DISPOSE, [Cache_Test] fromRemote [false]
    Region Name = Cache_Test
    HitCountRam = 308
    HitCountAux = 0
    ---------------------------LRU Memory Cache
    List Size = 3
    Map Size = 3
    Put Count = 23
    Hit Count = 309
    Miss Count = 1
    [DEBUG] JCSCacheService stopped.
    [DEBUG] Decommision the service ehcache
    [DEBUG] Decommisioning the service ehcache
    [DEBUG] Disposable.dispose() for ehcache
    [DEBUG] EHCacheService stopped!
    [DEBUG] Decommision the service cache
    [DEBUG] Decommisioning the service cache
    [DEBUG] Disposable.dispose() for cache
    [DEBUG] Disposing the service jcscache
    [DEBUG] Disposing the service ehcache
    [DEBUG] Disposing the service cache
    [DEBUG] All services are disposed
    [INFO] YaffiContainer has been disposed.
    Tests run: 10, Failures: 0, Errors: 0, Skipped: 0, Time elapsed: 142.153 sec

    Results :

    Failed tests:
    testObjectCount(org.apache.fulcrum.cache.JCSCacheTest)

    Tests run: 30, Failures: 1, Errors: 0, Skipped: 0

    [INFO] ------------------------------------------------------------------------
    [ERROR] BUILD FAILURE
    [INFO] ------------------------------------------------------------------------
    [INFO] There are test failures.

    Please refer to /srv/gump/public/workspace/turbine-fulcrum/cache/target/surefire-reports for the individual test results.
    [INFO] ------------------------------------------------------------------------
    [INFO] For more information, run Maven with the -e switch
    [INFO] ------------------------------------------------------------------------
    [INFO] Total time: 6 minutes 54 seconds
    [INFO] Finished at: Fri Apr 27 06:25:53 UTC 2012
    [INFO] Final Memory: 14M/35M
    [INFO] ------------------------------------------------------------------------
    ---------------------------------------------

    To subscribe to this information via syndicated feeds:
    - RSS: http://vmgump.apache.org/gump/public/turbine-fulcrum/fulcrum-cache-test/rss.xml
    - Atom: http://vmgump.apache.org/gump/public/turbine-fulcrum/fulcrum-cache-test/atom.xml

    ============================== Gump Tracking Only ===
    Produced by Apache Gump(TM) version 2.3.
    Gump Run 12000027042012, vmgump.apache.org:vmgump:12000027042012
    Gump E-mail Identifier (unique within run) #44.

    --
    Apache Gump
    http://gump.apache.org/ [Instance: vmgump]

    ---------------------------------------------------------------------
    To unsubscribe, e-mail: dev-unsubscribe@turbine.apache.org
    For additional commands, e-mail: dev-help@turbine.apache.org
  • Anonymous at Apr 28, 2012 at 6:30 am
    To whom it may engage...

    This is an automated request, but not an unsolicited one. For
    more information please visit http://gump.apache.org/nagged.html,
    and/or contact the folk at general@gump.apache.org.

    Project fulcrum-cache-test has an issue affecting its community integration.
    This issue affects 1 projects,
    and has been outstanding for 133 runs.
    The current state of this project is 'Failed', with reason 'Build Failed'.
    For reference only, the following projects are affected by this:
    - fulcrum-cache-test : Services Framework


    Full details are available at:
    http://vmgump.apache.org/gump/public/turbine-fulcrum/fulcrum-cache-test/index.html

    That said, some information snippets are provided here.

    The following annotations (debug/informational/warning/error messages) were provided:
    -WARNING- Overriding Maven settings: [/srv/gump/public/workspace/turbine-fulcrum/cache/gump_mvn_settings.xml]
    -DEBUG- (Apache Gump generated) Apache Maven Settings in: /srv/gump/public/workspace/turbine-fulcrum/cache/gump_mvn_settings.xml
    -INFO- Failed with reason build failed
    -DEBUG- Maven POM in: /srv/gump/public/workspace/turbine-fulcrum/cache/pom.xml



    The following work was performed:
    http://vmgump.apache.org/gump/public/turbine-fulcrum/fulcrum-cache-test/gump_work/build_turbine-fulcrum_fulcrum-cache-test.html
    Work Name: build_turbine-fulcrum_fulcrum-cache-test (Type: Build)
    Work ended in a state of : Failed
    Elapsed: 6 mins 56 secs
    Command Line: /opt/maven2/bin/mvn --batch-mode --settings /srv/gump/public/workspace/turbine-fulcrum/cache/gump_mvn_settings.xml test
    [Working Directory: /srv/gump/public/workspace/turbine-fulcrum/cache]
    M2_HOME: /opt/maven2
    ---------------------------------------------
    Region Name = Cache_Test
    HitCountRam = 308
    HitCountAux = 0
    ---------------------------LRU Memory Cache
    List Size = 3
    Map Size = 3
    Put Count = 23
    Hit Count = 309
    Miss Count = 1
    [DEBUG] Located the service 'org.apache.fulcrum.cache.GlobalCacheService' in the local container
    [DEBUG] Disposing of container...
    [DEBUG] Disposing all services
    [DEBUG] Decommision the service jcscache
    [DEBUG] Decommisioning the service jcscache
    [DEBUG] Disposable.dispose() for jcscache
    [DEBUG] JCSCacheService stopped.
    [DEBUG] Decommision the service ehcache
    [DEBUG] Decommisioning the service ehcache
    [DEBUG] Disposable.dispose() for ehcache
    [DEBUG] EHCacheService stopped!
    [DEBUG] Decommision the service cache
    [DEBUG] Decommisioning the service cache
    [DEBUG] Disposable.dispose() for cache
    [DEBUG] Disposing the service jcscache
    [DEBUG] Disposing the service ehcache
    [DEBUG] Disposing the service cache
    [DEBUG] All services are disposed
    [INFO] YaffiContainer has been disposed.
    Tests run: 10, Failures: 0, Errors: 0, Skipped: 0, Time elapsed: 142.156 sec

    Results :

    Failed tests:
    testObjectCount(org.apache.fulcrum.cache.JCSCacheTest)

    Tests run: 30, Failures: 1, Errors: 0, Skipped: 0

    [INFO] ------------------------------------------------------------------------
    [ERROR] BUILD FAILURE
    [INFO] ------------------------------------------------------------------------
    [INFO] There are test failures.

    Please refer to /srv/gump/public/workspace/turbine-fulcrum/cache/target/surefire-reports for the individual test results.
    [INFO] ------------------------------------------------------------------------
    [INFO] For more information, run Maven with the -e switch
    [INFO] ------------------------------------------------------------------------
    [INFO] Total time: 6 minutes 55 seconds
    [INFO] Finished at: Sat Apr 28 06:29:40 UTC 2012
    [INFO] Final Memory: 14M/35M
    [INFO] ------------------------------------------------------------------------
    ---------------------------------------------

    To subscribe to this information via syndicated feeds:
    - RSS: http://vmgump.apache.org/gump/public/turbine-fulcrum/fulcrum-cache-test/rss.xml
    - Atom: http://vmgump.apache.org/gump/public/turbine-fulcrum/fulcrum-cache-test/atom.xml

    ============================== Gump Tracking Only ===
    Produced by Apache Gump(TM) version 2.3.
    Gump Run 12000028042012, vmgump.apache.org:vmgump:12000028042012
    Gump E-mail Identifier (unique within run) #46.

    --
    Apache Gump
    http://gump.apache.org/ [Instance: vmgump]

    ---------------------------------------------------------------------
    To unsubscribe, e-mail: dev-unsubscribe@turbine.apache.org
    For additional commands, e-mail: dev-help@turbine.apache.org
  • Anonymous at Apr 29, 2012 at 6:19 am
    To whom it may engage...

    This is an automated request, but not an unsolicited one. For
    more information please visit http://gump.apache.org/nagged.html,
    and/or contact the folk at general@gump.apache.org.

    Project fulcrum-cache-test has an issue affecting its community integration.
    This issue affects 1 projects,
    and has been outstanding for 135 runs.
    The current state of this project is 'Failed', with reason 'Build Failed'.
    For reference only, the following projects are affected by this:
    - fulcrum-cache-test : Services Framework


    Full details are available at:
    http://vmgump.apache.org/gump/public/turbine-fulcrum/fulcrum-cache-test/index.html

    That said, some information snippets are provided here.

    The following annotations (debug/informational/warning/error messages) were provided:
    -WARNING- Overriding Maven settings: [/srv/gump/public/workspace/turbine-fulcrum/cache/gump_mvn_settings.xml]
    -DEBUG- (Apache Gump generated) Apache Maven Settings in: /srv/gump/public/workspace/turbine-fulcrum/cache/gump_mvn_settings.xml
    -INFO- Failed with reason build failed
    -DEBUG- Maven POM in: /srv/gump/public/workspace/turbine-fulcrum/cache/pom.xml



    The following work was performed:
    http://vmgump.apache.org/gump/public/turbine-fulcrum/fulcrum-cache-test/gump_work/build_turbine-fulcrum_fulcrum-cache-test.html
    Work Name: build_turbine-fulcrum_fulcrum-cache-test (Type: Build)
    Work ended in a state of : Failed
    Elapsed: 6 mins 55 secs
    Command Line: /opt/maven2/bin/mvn --batch-mode --settings /srv/gump/public/workspace/turbine-fulcrum/cache/gump_mvn_settings.xml test
    [Working Directory: /srv/gump/public/workspace/turbine-fulcrum/cache]
    M2_HOME: /opt/maven2
    ---------------------------------------------
    INFO: In DISPOSE, [Cache_Test] fromRemote [false]
    Region Name = Cache_Test
    HitCountRam = 308
    HitCountAux = 0
    ---------------------------LRU Memory Cache
    List Size = 3
    Map Size = 3
    Put Count = 23
    Hit Count = 309
    Miss Count = 1
    [DEBUG] Disposing of container...
    [DEBUG] Disposing all services
    [DEBUG] Decommision the service jcscache
    [DEBUG] Decommisioning the service jcscache
    [DEBUG] Disposable.dispose() for jcscache
    [DEBUG] JCSCacheService stopped.
    [DEBUG] Decommision the service ehcache
    [DEBUG] Decommisioning the service ehcache
    [DEBUG] Disposable.dispose() for ehcache
    [DEBUG] EHCacheService stopped!
    [DEBUG] Decommision the service cache
    [DEBUG] Decommisioning the service cache
    [DEBUG] Disposable.dispose() for cache
    [DEBUG] Disposing the service jcscache
    [DEBUG] Disposing the service ehcache
    [DEBUG] Disposing the service cache
    [DEBUG] All services are disposed
    [INFO] YaffiContainer has been disposed.
    Tests run: 10, Failures: 0, Errors: 0, Skipped: 0, Time elapsed: 142.146 sec

    Results :

    Failed tests:
    testObjectCount(org.apache.fulcrum.cache.JCSCacheTest)

    Tests run: 30, Failures: 1, Errors: 0, Skipped: 0

    [INFO] ------------------------------------------------------------------------
    [ERROR] BUILD FAILURE
    [INFO] ------------------------------------------------------------------------
    [INFO] There are test failures.

    Please refer to /srv/gump/public/workspace/turbine-fulcrum/cache/target/surefire-reports for the individual test results.
    [INFO] ------------------------------------------------------------------------
    [INFO] For more information, run Maven with the -e switch
    [INFO] ------------------------------------------------------------------------
    [INFO] Total time: 6 minutes 54 seconds
    [INFO] Finished at: Sun Apr 29 06:19:28 UTC 2012
    [INFO] Final Memory: 14M/35M
    [INFO] ------------------------------------------------------------------------
    ---------------------------------------------

    To subscribe to this information via syndicated feeds:
    - RSS: http://vmgump.apache.org/gump/public/turbine-fulcrum/fulcrum-cache-test/rss.xml
    - Atom: http://vmgump.apache.org/gump/public/turbine-fulcrum/fulcrum-cache-test/atom.xml

    ============================== Gump Tracking Only ===
    Produced by Apache Gump(TM) version 2.3.
    Gump Run 11000029042012, vmgump.apache.org:vmgump:11000029042012
    Gump E-mail Identifier (unique within run) #47.

    --
    Apache Gump
    http://gump.apache.org/ [Instance: vmgump]

    ---------------------------------------------------------------------
    To unsubscribe, e-mail: dev-unsubscribe@turbine.apache.org
    For additional commands, e-mail: dev-help@turbine.apache.org
  • Anonymous at Apr 30, 2012 at 7:19 am
    To whom it may engage...

    This is an automated request, but not an unsolicited one. For
    more information please visit http://gump.apache.org/nagged.html,
    and/or contact the folk at general@gump.apache.org.

    Project fulcrum-cache-test has an issue affecting its community integration.
    This issue affects 1 projects,
    and has been outstanding for 137 runs.
    The current state of this project is 'Failed', with reason 'Build Failed'.
    For reference only, the following projects are affected by this:
    - fulcrum-cache-test : Services Framework


    Full details are available at:
    http://vmgump.apache.org/gump/public/turbine-fulcrum/fulcrum-cache-test/index.html

    That said, some information snippets are provided here.

    The following annotations (debug/informational/warning/error messages) were provided:
    -WARNING- Overriding Maven settings: [/srv/gump/public/workspace/turbine-fulcrum/cache/gump_mvn_settings.xml]
    -DEBUG- (Apache Gump generated) Apache Maven Settings in: /srv/gump/public/workspace/turbine-fulcrum/cache/gump_mvn_settings.xml
    -INFO- Failed with reason build failed
    -DEBUG- Maven POM in: /srv/gump/public/workspace/turbine-fulcrum/cache/pom.xml



    The following work was performed:
    http://vmgump.apache.org/gump/public/turbine-fulcrum/fulcrum-cache-test/gump_work/build_turbine-fulcrum_fulcrum-cache-test.html
    Work Name: build_turbine-fulcrum_fulcrum-cache-test (Type: Build)
    Work ended in a state of : Failed
    Elapsed: 6 mins 56 secs
    Command Line: /opt/maven2/bin/mvn --batch-mode --settings /srv/gump/public/workspace/turbine-fulcrum/cache/gump_mvn_settings.xml test
    [Working Directory: /srv/gump/public/workspace/turbine-fulcrum/cache]
    M2_HOME: /opt/maven2
    ---------------------------------------------
    INFO: In DISPOSE, [Cache_Test] fromRemote [false]
    Region Name = Cache_Test
    HitCountRam = 308
    HitCountAux = 0
    ---------------------------LRU Memory Cache
    List Size = 3
    Map Size = 3
    Put Count = 23
    Hit Count = 309
    Miss Count = 1
    [DEBUG] Disposing of container...
    [DEBUG] Disposing all services
    [DEBUG] Decommision the service jcscache
    [DEBUG] Decommisioning the service jcscache
    [DEBUG] Disposable.dispose() for jcscache
    [DEBUG] JCSCacheService stopped.
    [DEBUG] Decommision the service ehcache
    [DEBUG] Decommisioning the service ehcache
    [DEBUG] Disposable.dispose() for ehcache
    [DEBUG] EHCacheService stopped!
    [DEBUG] Decommision the service cache
    [DEBUG] Decommisioning the service cache
    [DEBUG] Disposable.dispose() for cache
    [DEBUG] Disposing the service jcscache
    [DEBUG] Disposing the service ehcache
    [DEBUG] Disposing the service cache
    [DEBUG] All services are disposed
    [INFO] YaffiContainer has been disposed.
    Tests run: 10, Failures: 0, Errors: 0, Skipped: 0, Time elapsed: 142.137 sec

    Results :

    Failed tests:
    testObjectCount(org.apache.fulcrum.cache.JCSCacheTest)

    Tests run: 30, Failures: 1, Errors: 0, Skipped: 0

    [INFO] ------------------------------------------------------------------------
    [ERROR] BUILD FAILURE
    [INFO] ------------------------------------------------------------------------
    [INFO] There are test failures.

    Please refer to /srv/gump/public/workspace/turbine-fulcrum/cache/target/surefire-reports for the individual test results.
    [INFO] ------------------------------------------------------------------------
    [INFO] For more information, run Maven with the -e switch
    [INFO] ------------------------------------------------------------------------
    [INFO] Total time: 6 minutes 55 seconds
    [INFO] Finished at: Mon Apr 30 07:18:35 UTC 2012
    [INFO] Final Memory: 14M/35M
    [INFO] ------------------------------------------------------------------------
    ---------------------------------------------

    To subscribe to this information via syndicated feeds:
    - RSS: http://vmgump.apache.org/gump/public/turbine-fulcrum/fulcrum-cache-test/rss.xml
    - Atom: http://vmgump.apache.org/gump/public/turbine-fulcrum/fulcrum-cache-test/atom.xml

    ============================== Gump Tracking Only ===
    Produced by Apache Gump(TM) version 2.3.
    Gump Run 12000030042012, vmgump.apache.org:vmgump:12000030042012
    Gump E-mail Identifier (unique within run) #46.

    --
    Apache Gump
    http://gump.apache.org/ [Instance: vmgump]

    ---------------------------------------------------------------------
    To unsubscribe, e-mail: dev-unsubscribe@turbine.apache.org
    For additional commands, e-mail: dev-help@turbine.apache.org

Related Discussions

Discussion Navigation
viewthread | post
Discussion Overview
groupdev @
categoriesturbine
postedApr 1, '12 at 6:34a
activeApr 30, '12 at 7:19a
posts30
users1
websiteturbine.apache.org

1 user in discussion

Anonymous: 30 posts

People

Translate

site design / logo © 2018 Grokbase