FAQ
To whom it may engage...

This is an automated request, but not an unsolicited one. For
more information please visit http://gump.apache.org/nagged.html,
and/or contact the folk at general@gump.apache.org.

Project fulcrum-cache-test has an issue affecting its community integration.
This issue affects 1 projects,
and has been outstanding for 17 runs.
The current state of this project is 'Failed', with reason 'Build Failed'.
For reference only, the following projects are affected by this:
- fulcrum-cache-test : Services Framework


Full details are available at:
http://vmgump.apache.org/gump/public/turbine-fulcrum/fulcrum-cache-test/index.html

That said, some information snippets are provided here.

The following annotations (debug/informational/warning/error messages) were provided:
-WARNING- Overriding Maven settings: [/srv/gump/public/workspace/turbine-fulcrum/cache/gump_mvn_settings.xml]
-DEBUG- (Apache Gump generated) Apache Maven Settings in: /srv/gump/public/workspace/turbine-fulcrum/cache/gump_mvn_settings.xml
-INFO- Failed with reason build failed
-DEBUG- Maven POM in: /srv/gump/public/workspace/turbine-fulcrum/cache/pom.xml



The following work was performed:
http://vmgump.apache.org/gump/public/turbine-fulcrum/fulcrum-cache-test/gump_work/build_turbine-fulcrum_fulcrum-cache-test.html
Work Name: build_turbine-fulcrum_fulcrum-cache-test (Type: Build)
Work ended in a state of : Failed
Elapsed: 6 mins 55 secs
Command Line: /opt/maven2/bin/mvn --batch-mode --settings /srv/gump/public/workspace/turbine-fulcrum/cache/gump_mvn_settings.xml test
[Working Directory: /srv/gump/public/workspace/turbine-fulcrum/cache]
M2_HOME: /opt/maven2
---------------------------------------------
INFO: In DISPOSE, [Cache_Test] fromRemote [false]
Region Name = Cache_Test
HitCountRam = 308
HitCountAux = 0
---------------------------LRU Memory Cache
List Size = 3
Map Size = 3
Put Count = 23
Hit Count = 309
Miss Count = 1
[DEBUG] Disposing of container...
[DEBUG] Disposing all services
[DEBUG] Decommision the service jcscache
[DEBUG] Decommisioning the service jcscache
[DEBUG] Disposable.dispose() for jcscache
[DEBUG] JCSCacheService stopped.
[DEBUG] Decommision the service ehcache
[DEBUG] Decommisioning the service ehcache
[DEBUG] Disposable.dispose() for ehcache
[DEBUG] EHCacheService stopped!
[DEBUG] Decommision the service cache
[DEBUG] Decommisioning the service cache
[DEBUG] Disposable.dispose() for cache
[DEBUG] Disposing the service jcscache
[DEBUG] Disposing the service ehcache
[DEBUG] Disposing the service cache
[DEBUG] All services are disposed
[INFO] YaffiContainer has been disposed.
Tests run: 10, Failures: 0, Errors: 0, Skipped: 0, Time elapsed: 142.151 sec

Results :

Failed tests:
testObjectCount(org.apache.fulcrum.cache.JCSCacheTest)

Tests run: 30, Failures: 1, Errors: 0, Skipped: 0

[INFO] ------------------------------------------------------------------------
[ERROR] BUILD FAILURE
[INFO] ------------------------------------------------------------------------
[INFO] There are test failures.

Please refer to /srv/gump/public/workspace/turbine-fulcrum/cache/target/surefire-reports for the individual test results.
[INFO] ------------------------------------------------------------------------
[INFO] For more information, run Maven with the -e switch
[INFO] ------------------------------------------------------------------------
[INFO] Total time: 6 minutes 54 seconds
[INFO] Finished at: Thu Mar 01 06:48:11 UTC 2012
[INFO] Final Memory: 14M/35M
[INFO] ------------------------------------------------------------------------
---------------------------------------------

To subscribe to this information via syndicated feeds:
- RSS: http://vmgump.apache.org/gump/public/turbine-fulcrum/fulcrum-cache-test/rss.xml
- Atom: http://vmgump.apache.org/gump/public/turbine-fulcrum/fulcrum-cache-test/atom.xml

============================== Gump Tracking Only ===
Produced by Apache Gump(TM) version 2.3.
Gump Run 11000001032012, vmgump.apache.org:vmgump:11000001032012
Gump E-mail Identifier (unique within run) #39.

--
Apache Gump
http://gump.apache.org/ [Instance: vmgump]

---------------------------------------------------------------------
To unsubscribe, e-mail: dev-unsubscribe@turbine.apache.org
For additional commands, e-mail: dev-help@turbine.apache.org

Search Discussions

  • Anonymous at Mar 2, 2012 at 7:10 am
    To whom it may engage...

    This is an automated request, but not an unsolicited one. For
    more information please visit http://gump.apache.org/nagged.html,
    and/or contact the folk at general@gump.apache.org.

    Project fulcrum-cache-test has an issue affecting its community integration.
    This issue affects 1 projects,
    and has been outstanding for 19 runs.
    The current state of this project is 'Failed', with reason 'Build Failed'.
    For reference only, the following projects are affected by this:
    - fulcrum-cache-test : Services Framework


    Full details are available at:
    http://vmgump.apache.org/gump/public/turbine-fulcrum/fulcrum-cache-test/index.html

    That said, some information snippets are provided here.

    The following annotations (debug/informational/warning/error messages) were provided:
    -WARNING- Overriding Maven settings: [/srv/gump/public/workspace/turbine-fulcrum/cache/gump_mvn_settings.xml]
    -DEBUG- (Apache Gump generated) Apache Maven Settings in: /srv/gump/public/workspace/turbine-fulcrum/cache/gump_mvn_settings.xml
    -INFO- Failed with reason build failed
    -DEBUG- Maven POM in: /srv/gump/public/workspace/turbine-fulcrum/cache/pom.xml



    The following work was performed:
    http://vmgump.apache.org/gump/public/turbine-fulcrum/fulcrum-cache-test/gump_work/build_turbine-fulcrum_fulcrum-cache-test.html
    Work Name: build_turbine-fulcrum_fulcrum-cache-test (Type: Build)
    Work ended in a state of : Failed
    Elapsed: 6 mins 55 secs
    Command Line: /opt/maven2/bin/mvn --batch-mode --settings /srv/gump/public/workspace/turbine-fulcrum/cache/gump_mvn_settings.xml test
    [Working Directory: /srv/gump/public/workspace/turbine-fulcrum/cache]
    M2_HOME: /opt/maven2
    ---------------------------------------------
    INFO: In DISPOSE, [Cache_Test] fromRemote [false]
    Region Name = Cache_Test
    HitCountRam = 308
    HitCountAux = 0
    ---------------------------LRU Memory Cache
    List Size = 3
    Map Size = 3
    Put Count = 23
    Hit Count = 309
    Miss Count = 1
    [DEBUG] Disposing of container...
    [DEBUG] Disposing all services
    [DEBUG] Decommision the service jcscache
    [DEBUG] Decommisioning the service jcscache
    [DEBUG] Disposable.dispose() for jcscache
    [DEBUG] JCSCacheService stopped.
    [DEBUG] Decommision the service ehcache
    [DEBUG] Decommisioning the service ehcache
    [DEBUG] Disposable.dispose() for ehcache
    [DEBUG] EHCacheService stopped!
    [DEBUG] Decommision the service cache
    [DEBUG] Decommisioning the service cache
    [DEBUG] Disposable.dispose() for cache
    [DEBUG] Disposing the service jcscache
    [DEBUG] Disposing the service ehcache
    [DEBUG] Disposing the service cache
    [DEBUG] All services are disposed
    [INFO] YaffiContainer has been disposed.
    Tests run: 10, Failures: 0, Errors: 0, Skipped: 0, Time elapsed: 142.19 sec

    Results :

    Failed tests:
    testObjectCount(org.apache.fulcrum.cache.JCSCacheTest)

    Tests run: 30, Failures: 1, Errors: 0, Skipped: 0

    [INFO] ------------------------------------------------------------------------
    [ERROR] BUILD FAILURE
    [INFO] ------------------------------------------------------------------------
    [INFO] There are test failures.

    Please refer to /srv/gump/public/workspace/turbine-fulcrum/cache/target/surefire-reports for the individual test results.
    [INFO] ------------------------------------------------------------------------
    [INFO] For more information, run Maven with the -e switch
    [INFO] ------------------------------------------------------------------------
    [INFO] Total time: 6 minutes 54 seconds
    [INFO] Finished at: Fri Mar 02 07:10:24 UTC 2012
    [INFO] Final Memory: 14M/35M
    [INFO] ------------------------------------------------------------------------
    ---------------------------------------------

    To subscribe to this information via syndicated feeds:
    - RSS: http://vmgump.apache.org/gump/public/turbine-fulcrum/fulcrum-cache-test/rss.xml
    - Atom: http://vmgump.apache.org/gump/public/turbine-fulcrum/fulcrum-cache-test/atom.xml

    ============================== Gump Tracking Only ===
    Produced by Apache Gump(TM) version 2.3.
    Gump Run 12000002032012, vmgump.apache.org:vmgump:12000002032012
    Gump E-mail Identifier (unique within run) #40.

    --
    Apache Gump
    http://gump.apache.org/ [Instance: vmgump]

    ---------------------------------------------------------------------
    To unsubscribe, e-mail: dev-unsubscribe@turbine.apache.org
    For additional commands, e-mail: dev-help@turbine.apache.org
  • Anonymous at Mar 3, 2012 at 6:42 am
    To whom it may engage...

    This is an automated request, but not an unsolicited one. For
    more information please visit http://gump.apache.org/nagged.html,
    and/or contact the folk at general@gump.apache.org.

    Project fulcrum-cache-test has an issue affecting its community integration.
    This issue affects 1 projects,
    and has been outstanding for 21 runs.
    The current state of this project is 'Failed', with reason 'Build Failed'.
    For reference only, the following projects are affected by this:
    - fulcrum-cache-test : Services Framework


    Full details are available at:
    http://vmgump.apache.org/gump/public/turbine-fulcrum/fulcrum-cache-test/index.html

    That said, some information snippets are provided here.

    The following annotations (debug/informational/warning/error messages) were provided:
    -WARNING- Overriding Maven settings: [/srv/gump/public/workspace/turbine-fulcrum/cache/gump_mvn_settings.xml]
    -DEBUG- (Apache Gump generated) Apache Maven Settings in: /srv/gump/public/workspace/turbine-fulcrum/cache/gump_mvn_settings.xml
    -INFO- Failed with reason build failed
    -DEBUG- Maven POM in: /srv/gump/public/workspace/turbine-fulcrum/cache/pom.xml



    The following work was performed:
    http://vmgump.apache.org/gump/public/turbine-fulcrum/fulcrum-cache-test/gump_work/build_turbine-fulcrum_fulcrum-cache-test.html
    Work Name: build_turbine-fulcrum_fulcrum-cache-test (Type: Build)
    Work ended in a state of : Failed
    Elapsed: 6 mins 55 secs
    Command Line: /opt/maven2/bin/mvn --batch-mode --settings /srv/gump/public/workspace/turbine-fulcrum/cache/gump_mvn_settings.xml test
    [Working Directory: /srv/gump/public/workspace/turbine-fulcrum/cache]
    M2_HOME: /opt/maven2
    ---------------------------------------------
    INFO: In DISPOSE, [Cache_Test] fromRemote [false]
    Region Name = Cache_Test
    HitCountRam = 308
    HitCountAux = 0
    ---------------------------LRU Memory Cache
    List Size = 3
    Map Size = 3
    Put Count = 23
    Hit Count = 309
    Miss Count = 1
    [DEBUG] Disposing of container...
    [DEBUG] Disposing all services
    [DEBUG] Decommision the service jcscache
    [DEBUG] Decommisioning the service jcscache
    [DEBUG] Disposable.dispose() for jcscache
    [DEBUG] JCSCacheService stopped.
    [DEBUG] Decommision the service ehcache
    [DEBUG] Decommisioning the service ehcache
    [DEBUG] Disposable.dispose() for ehcache
    [DEBUG] EHCacheService stopped!
    [DEBUG] Decommision the service cache
    [DEBUG] Decommisioning the service cache
    [DEBUG] Disposable.dispose() for cache
    [DEBUG] Disposing the service jcscache
    [DEBUG] Disposing the service ehcache
    [DEBUG] Disposing the service cache
    [DEBUG] All services are disposed
    [INFO] YaffiContainer has been disposed.
    Tests run: 10, Failures: 0, Errors: 0, Skipped: 0, Time elapsed: 142.162 sec

    Results :

    Failed tests:
    testObjectCount(org.apache.fulcrum.cache.JCSCacheTest)

    Tests run: 30, Failures: 1, Errors: 0, Skipped: 0

    [INFO] ------------------------------------------------------------------------
    [ERROR] BUILD FAILURE
    [INFO] ------------------------------------------------------------------------
    [INFO] There are test failures.

    Please refer to /srv/gump/public/workspace/turbine-fulcrum/cache/target/surefire-reports for the individual test results.
    [INFO] ------------------------------------------------------------------------
    [INFO] For more information, run Maven with the -e switch
    [INFO] ------------------------------------------------------------------------
    [INFO] Total time: 6 minutes 54 seconds
    [INFO] Finished at: Sat Mar 03 06:41:54 UTC 2012
    [INFO] Final Memory: 14M/35M
    [INFO] ------------------------------------------------------------------------
    ---------------------------------------------

    To subscribe to this information via syndicated feeds:
    - RSS: http://vmgump.apache.org/gump/public/turbine-fulcrum/fulcrum-cache-test/rss.xml
    - Atom: http://vmgump.apache.org/gump/public/turbine-fulcrum/fulcrum-cache-test/atom.xml

    ============================== Gump Tracking Only ===
    Produced by Apache Gump(TM) version 2.3.
    Gump Run 11000003032012, vmgump.apache.org:vmgump:11000003032012
    Gump E-mail Identifier (unique within run) #40.

    --
    Apache Gump
    http://gump.apache.org/ [Instance: vmgump]

    ---------------------------------------------------------------------
    To unsubscribe, e-mail: dev-unsubscribe@turbine.apache.org
    For additional commands, e-mail: dev-help@turbine.apache.org
  • Anonymous at Mar 4, 2012 at 6:30 am
    To whom it may engage...

    This is an automated request, but not an unsolicited one. For
    more information please visit http://gump.apache.org/nagged.html,
    and/or contact the folk at general@gump.apache.org.

    Project fulcrum-cache-test has an issue affecting its community integration.
    This issue affects 1 projects,
    and has been outstanding for 23 runs.
    The current state of this project is 'Failed', with reason 'Build Failed'.
    For reference only, the following projects are affected by this:
    - fulcrum-cache-test : Services Framework


    Full details are available at:
    http://vmgump.apache.org/gump/public/turbine-fulcrum/fulcrum-cache-test/index.html

    That said, some information snippets are provided here.

    The following annotations (debug/informational/warning/error messages) were provided:
    -WARNING- Overriding Maven settings: [/srv/gump/public/workspace/turbine-fulcrum/cache/gump_mvn_settings.xml]
    -DEBUG- (Apache Gump generated) Apache Maven Settings in: /srv/gump/public/workspace/turbine-fulcrum/cache/gump_mvn_settings.xml
    -INFO- Failed with reason build failed
    -DEBUG- Maven POM in: /srv/gump/public/workspace/turbine-fulcrum/cache/pom.xml



    The following work was performed:
    http://vmgump.apache.org/gump/public/turbine-fulcrum/fulcrum-cache-test/gump_work/build_turbine-fulcrum_fulcrum-cache-test.html
    Work Name: build_turbine-fulcrum_fulcrum-cache-test (Type: Build)
    Work ended in a state of : Failed
    Elapsed: 6 mins 55 secs
    Command Line: /opt/maven2/bin/mvn --batch-mode --settings /srv/gump/public/workspace/turbine-fulcrum/cache/gump_mvn_settings.xml test
    [Working Directory: /srv/gump/public/workspace/turbine-fulcrum/cache]
    M2_HOME: /opt/maven2
    ---------------------------------------------
    [DEBUG] Disposing all services
    [DEBUG] Decommision the service jcscache
    [DEBUG] Decommisioning the service jcscache
    [DEBUG] Disposable.dispose() for jcscache
    Mar 4, 2012 6:30:06 AM org.apache.jcs.engine.control.CompositeCache dispose
    INFO: In DISPOSE, [Cache_Test] fromRemote [false]
    Region Name = Cache_Test
    HitCountRam = 308
    HitCountAux = 0
    ---------------------------LRU Memory Cache
    List Size = 3
    Map Size = 3
    Put Count = 23
    Hit Count = 309
    Miss Count = 1
    [DEBUG] JCSCacheService stopped.
    [DEBUG] Decommision the service ehcache
    [DEBUG] Decommisioning the service ehcache
    [DEBUG] Disposable.dispose() for ehcache
    [DEBUG] EHCacheService stopped!
    [DEBUG] Decommision the service cache
    [DEBUG] Decommisioning the service cache
    [DEBUG] Disposable.dispose() for cache
    [DEBUG] Disposing the service jcscache
    [DEBUG] Disposing the service ehcache
    [DEBUG] Disposing the service cache
    [DEBUG] All services are disposed
    [INFO] YaffiContainer has been disposed.
    Tests run: 10, Failures: 0, Errors: 0, Skipped: 0, Time elapsed: 142.162 sec

    Results :

    Failed tests:
    testObjectCount(org.apache.fulcrum.cache.JCSCacheTest)

    Tests run: 30, Failures: 1, Errors: 0, Skipped: 0

    [INFO] ------------------------------------------------------------------------
    [ERROR] BUILD FAILURE
    [INFO] ------------------------------------------------------------------------
    [INFO] There are test failures.

    Please refer to /srv/gump/public/workspace/turbine-fulcrum/cache/target/surefire-reports for the individual test results.
    [INFO] ------------------------------------------------------------------------
    [INFO] For more information, run Maven with the -e switch
    [INFO] ------------------------------------------------------------------------
    [INFO] Total time: 6 minutes 54 seconds
    [INFO] Finished at: Sun Mar 04 06:30:06 UTC 2012
    [INFO] Final Memory: 14M/35M
    [INFO] ------------------------------------------------------------------------
    ---------------------------------------------

    To subscribe to this information via syndicated feeds:
    - RSS: http://vmgump.apache.org/gump/public/turbine-fulcrum/fulcrum-cache-test/rss.xml
    - Atom: http://vmgump.apache.org/gump/public/turbine-fulcrum/fulcrum-cache-test/atom.xml

    ============================== Gump Tracking Only ===
    Produced by Apache Gump(TM) version 2.3.
    Gump Run 11000004032012, vmgump.apache.org:vmgump:11000004032012
    Gump E-mail Identifier (unique within run) #40.

    --
    Apache Gump
    http://gump.apache.org/ [Instance: vmgump]

    ---------------------------------------------------------------------
    To unsubscribe, e-mail: dev-unsubscribe@turbine.apache.org
    For additional commands, e-mail: dev-help@turbine.apache.org
  • Anonymous at Mar 5, 2012 at 6:39 am
    To whom it may engage...

    This is an automated request, but not an unsolicited one. For
    more information please visit http://gump.apache.org/nagged.html,
    and/or contact the folk at general@gump.apache.org.

    Project fulcrum-cache-test has an issue affecting its community integration.
    This issue affects 1 projects,
    and has been outstanding for 25 runs.
    The current state of this project is 'Failed', with reason 'Build Failed'.
    For reference only, the following projects are affected by this:
    - fulcrum-cache-test : Services Framework


    Full details are available at:
    http://vmgump.apache.org/gump/public/turbine-fulcrum/fulcrum-cache-test/index.html

    That said, some information snippets are provided here.

    The following annotations (debug/informational/warning/error messages) were provided:
    -WARNING- Overriding Maven settings: [/srv/gump/public/workspace/turbine-fulcrum/cache/gump_mvn_settings.xml]
    -DEBUG- (Apache Gump generated) Apache Maven Settings in: /srv/gump/public/workspace/turbine-fulcrum/cache/gump_mvn_settings.xml
    -INFO- Failed with reason build failed
    -DEBUG- Maven POM in: /srv/gump/public/workspace/turbine-fulcrum/cache/pom.xml



    The following work was performed:
    http://vmgump.apache.org/gump/public/turbine-fulcrum/fulcrum-cache-test/gump_work/build_turbine-fulcrum_fulcrum-cache-test.html
    Work Name: build_turbine-fulcrum_fulcrum-cache-test (Type: Build)
    Work ended in a state of : Failed
    Elapsed: 6 mins 55 secs
    Command Line: /opt/maven2/bin/mvn --batch-mode --settings /srv/gump/public/workspace/turbine-fulcrum/cache/gump_mvn_settings.xml test
    [Working Directory: /srv/gump/public/workspace/turbine-fulcrum/cache]
    M2_HOME: /opt/maven2
    ---------------------------------------------
    [DEBUG] Disposing all services
    [DEBUG] Decommision the service jcscache
    [DEBUG] Decommisioning the service jcscache
    [DEBUG] Disposable.dispose() for jcscache
    [DEBUG] JCSCacheService stopped.
    [DEBUG] Decommision the service ehcache
    [DEBUG] Decommisioning the service ehcache
    [DEBUG] Disposable.dispose() for ehcache
    Mar 5, 2012 6:39:34 AM org.apache.jcs.engine.control.CompositeCache dispose
    INFO: In DISPOSE, [Cache_Test] fromRemote [false]
    Region Name = Cache_Test
    HitCountRam = 308
    HitCountAux = 0
    ---------------------------LRU Memory Cache
    List Size = 3
    Map Size = 3
    Put Count = 23
    Hit Count = 309
    Miss Count = 1
    [DEBUG] EHCacheService stopped!
    [DEBUG] Decommision the service cache
    [DEBUG] Decommisioning the service cache
    [DEBUG] Disposable.dispose() for cache
    [DEBUG] Disposing the service jcscache
    [DEBUG] Disposing the service ehcache
    [DEBUG] Disposing the service cache
    [DEBUG] All services are disposed
    [INFO] YaffiContainer has been disposed.
    Tests run: 10, Failures: 0, Errors: 0, Skipped: 0, Time elapsed: 142.198 sec

    Results :

    Failed tests:
    testObjectCount(org.apache.fulcrum.cache.JCSCacheTest)

    Tests run: 30, Failures: 1, Errors: 0, Skipped: 0

    [INFO] ------------------------------------------------------------------------
    [ERROR] BUILD FAILURE
    [INFO] ------------------------------------------------------------------------
    [INFO] There are test failures.

    Please refer to /srv/gump/public/workspace/turbine-fulcrum/cache/target/surefire-reports for the individual test results.
    [INFO] ------------------------------------------------------------------------
    [INFO] For more information, run Maven with the -e switch
    [INFO] ------------------------------------------------------------------------
    [INFO] Total time: 6 minutes 54 seconds
    [INFO] Finished at: Mon Mar 05 06:39:34 UTC 2012
    [INFO] Final Memory: 14M/35M
    [INFO] ------------------------------------------------------------------------
    ---------------------------------------------

    To subscribe to this information via syndicated feeds:
    - RSS: http://vmgump.apache.org/gump/public/turbine-fulcrum/fulcrum-cache-test/rss.xml
    - Atom: http://vmgump.apache.org/gump/public/turbine-fulcrum/fulcrum-cache-test/atom.xml

    ============================== Gump Tracking Only ===
    Produced by Apache Gump(TM) version 2.3.
    Gump Run 12000005032012, vmgump.apache.org:vmgump:12000005032012
    Gump E-mail Identifier (unique within run) #36.

    --
    Apache Gump
    http://gump.apache.org/ [Instance: vmgump]

    ---------------------------------------------------------------------
    To unsubscribe, e-mail: dev-unsubscribe@turbine.apache.org
    For additional commands, e-mail: dev-help@turbine.apache.org
  • Anonymous at Mar 6, 2012 at 6:43 am
    To whom it may engage...

    This is an automated request, but not an unsolicited one. For
    more information please visit http://gump.apache.org/nagged.html,
    and/or contact the folk at general@gump.apache.org.

    Project fulcrum-cache-test has an issue affecting its community integration.
    This issue affects 1 projects,
    and has been outstanding for 27 runs.
    The current state of this project is 'Failed', with reason 'Build Failed'.
    For reference only, the following projects are affected by this:
    - fulcrum-cache-test : Services Framework


    Full details are available at:
    http://vmgump.apache.org/gump/public/turbine-fulcrum/fulcrum-cache-test/index.html

    That said, some information snippets are provided here.

    The following annotations (debug/informational/warning/error messages) were provided:
    -WARNING- Overriding Maven settings: [/srv/gump/public/workspace/turbine-fulcrum/cache/gump_mvn_settings.xml]
    -DEBUG- (Apache Gump generated) Apache Maven Settings in: /srv/gump/public/workspace/turbine-fulcrum/cache/gump_mvn_settings.xml
    -INFO- Failed with reason build failed
    -DEBUG- Maven POM in: /srv/gump/public/workspace/turbine-fulcrum/cache/pom.xml



    The following work was performed:
    http://vmgump.apache.org/gump/public/turbine-fulcrum/fulcrum-cache-test/gump_work/build_turbine-fulcrum_fulcrum-cache-test.html
    Work Name: build_turbine-fulcrum_fulcrum-cache-test (Type: Build)
    Work ended in a state of : Failed
    Elapsed: 6 mins 57 secs
    Command Line: /opt/maven2/bin/mvn --batch-mode --settings /srv/gump/public/workspace/turbine-fulcrum/cache/gump_mvn_settings.xml test
    [Working Directory: /srv/gump/public/workspace/turbine-fulcrum/cache]
    M2_HOME: /opt/maven2
    ---------------------------------------------
    INFO: In DISPOSE, [Cache_Test] fromRemote [false]
    Region Name = Cache_Test
    HitCountRam = 308
    HitCountAux = 0
    ---------------------------LRU Memory Cache
    List Size = 3
    Map Size = 3
    Put Count = 23
    Hit Count = 309
    Miss Count = 1
    [DEBUG] Disposing of container...
    [DEBUG] Disposing all services
    [DEBUG] Decommision the service jcscache
    [DEBUG] Decommisioning the service jcscache
    [DEBUG] Disposable.dispose() for jcscache
    [DEBUG] JCSCacheService stopped.
    [DEBUG] Decommision the service ehcache
    [DEBUG] Decommisioning the service ehcache
    [DEBUG] Disposable.dispose() for ehcache
    [DEBUG] EHCacheService stopped!
    [DEBUG] Decommision the service cache
    [DEBUG] Decommisioning the service cache
    [DEBUG] Disposable.dispose() for cache
    [DEBUG] Disposing the service jcscache
    [DEBUG] Disposing the service ehcache
    [DEBUG] Disposing the service cache
    [DEBUG] All services are disposed
    [INFO] YaffiContainer has been disposed.
    Tests run: 10, Failures: 0, Errors: 0, Skipped: 0, Time elapsed: 142.224 sec

    Results :

    Failed tests:
    testObjectCount(org.apache.fulcrum.cache.JCSCacheTest)

    Tests run: 30, Failures: 1, Errors: 0, Skipped: 0

    [INFO] ------------------------------------------------------------------------
    [ERROR] BUILD FAILURE
    [INFO] ------------------------------------------------------------------------
    [INFO] There are test failures.

    Please refer to /srv/gump/public/workspace/turbine-fulcrum/cache/target/surefire-reports for the individual test results.
    [INFO] ------------------------------------------------------------------------
    [INFO] For more information, run Maven with the -e switch
    [INFO] ------------------------------------------------------------------------
    [INFO] Total time: 6 minutes 56 seconds
    [INFO] Finished at: Tue Mar 06 06:42:36 UTC 2012
    [INFO] Final Memory: 14M/35M
    [INFO] ------------------------------------------------------------------------
    ---------------------------------------------

    To subscribe to this information via syndicated feeds:
    - RSS: http://vmgump.apache.org/gump/public/turbine-fulcrum/fulcrum-cache-test/rss.xml
    - Atom: http://vmgump.apache.org/gump/public/turbine-fulcrum/fulcrum-cache-test/atom.xml

    ============================== Gump Tracking Only ===
    Produced by Apache Gump(TM) version 2.3.
    Gump Run 12000006032012, vmgump.apache.org:vmgump:12000006032012
    Gump E-mail Identifier (unique within run) #37.

    --
    Apache Gump
    http://gump.apache.org/ [Instance: vmgump]

    ---------------------------------------------------------------------
    To unsubscribe, e-mail: dev-unsubscribe@turbine.apache.org
    For additional commands, e-mail: dev-help@turbine.apache.org
  • Anonymous at Mar 7, 2012 at 6:39 am
    To whom it may engage...

    This is an automated request, but not an unsolicited one. For
    more information please visit http://gump.apache.org/nagged.html,
    and/or contact the folk at general@gump.apache.org.

    Project fulcrum-cache-test has an issue affecting its community integration.
    This issue affects 1 projects,
    and has been outstanding for 29 runs.
    The current state of this project is 'Failed', with reason 'Build Failed'.
    For reference only, the following projects are affected by this:
    - fulcrum-cache-test : Services Framework


    Full details are available at:
    http://vmgump.apache.org/gump/public/turbine-fulcrum/fulcrum-cache-test/index.html

    That said, some information snippets are provided here.

    The following annotations (debug/informational/warning/error messages) were provided:
    -WARNING- Overriding Maven settings: [/srv/gump/public/workspace/turbine-fulcrum/cache/gump_mvn_settings.xml]
    -DEBUG- (Apache Gump generated) Apache Maven Settings in: /srv/gump/public/workspace/turbine-fulcrum/cache/gump_mvn_settings.xml
    -INFO- Failed with reason build failed
    -DEBUG- Maven POM in: /srv/gump/public/workspace/turbine-fulcrum/cache/pom.xml



    The following work was performed:
    http://vmgump.apache.org/gump/public/turbine-fulcrum/fulcrum-cache-test/gump_work/build_turbine-fulcrum_fulcrum-cache-test.html
    Work Name: build_turbine-fulcrum_fulcrum-cache-test (Type: Build)
    Work ended in a state of : Failed
    Elapsed: 6 mins 55 secs
    Command Line: /opt/maven2/bin/mvn --batch-mode --settings /srv/gump/public/workspace/turbine-fulcrum/cache/gump_mvn_settings.xml test
    [Working Directory: /srv/gump/public/workspace/turbine-fulcrum/cache]
    M2_HOME: /opt/maven2
    ---------------------------------------------
    INFO: In DISPOSE, [Cache_Test] fromRemote [false]
    Region Name = Cache_Test
    HitCountRam = 308
    HitCountAux = 0
    ---------------------------LRU Memory Cache
    List Size = 3
    Map Size = 3
    Put Count = 23
    Hit Count = 309
    Miss Count = 1
    [DEBUG] Disposing of container...
    [DEBUG] Disposing all services
    [DEBUG] Decommision the service jcscache
    [DEBUG] Decommisioning the service jcscache
    [DEBUG] Disposable.dispose() for jcscache
    [DEBUG] JCSCacheService stopped.
    [DEBUG] Decommision the service ehcache
    [DEBUG] Decommisioning the service ehcache
    [DEBUG] Disposable.dispose() for ehcache
    [DEBUG] EHCacheService stopped!
    [DEBUG] Decommision the service cache
    [DEBUG] Decommisioning the service cache
    [DEBUG] Disposable.dispose() for cache
    [DEBUG] Disposing the service jcscache
    [DEBUG] Disposing the service ehcache
    [DEBUG] Disposing the service cache
    [DEBUG] All services are disposed
    [INFO] YaffiContainer has been disposed.
    Tests run: 10, Failures: 0, Errors: 0, Skipped: 0, Time elapsed: 142.146 sec

    Results :

    Failed tests:
    testObjectCount(org.apache.fulcrum.cache.JCSCacheTest)

    Tests run: 30, Failures: 1, Errors: 0, Skipped: 0

    [INFO] ------------------------------------------------------------------------
    [ERROR] BUILD FAILURE
    [INFO] ------------------------------------------------------------------------
    [INFO] There are test failures.

    Please refer to /srv/gump/public/workspace/turbine-fulcrum/cache/target/surefire-reports for the individual test results.
    [INFO] ------------------------------------------------------------------------
    [INFO] For more information, run Maven with the -e switch
    [INFO] ------------------------------------------------------------------------
    [INFO] Total time: 6 minutes 54 seconds
    [INFO] Finished at: Wed Mar 07 06:38:51 UTC 2012
    [INFO] Final Memory: 14M/35M
    [INFO] ------------------------------------------------------------------------
    ---------------------------------------------

    To subscribe to this information via syndicated feeds:
    - RSS: http://vmgump.apache.org/gump/public/turbine-fulcrum/fulcrum-cache-test/rss.xml
    - Atom: http://vmgump.apache.org/gump/public/turbine-fulcrum/fulcrum-cache-test/atom.xml

    ============================== Gump Tracking Only ===
    Produced by Apache Gump(TM) version 2.3.
    Gump Run 11000007032012, vmgump.apache.org:vmgump:11000007032012
    Gump E-mail Identifier (unique within run) #39.

    --
    Apache Gump
    http://gump.apache.org/ [Instance: vmgump]

    ---------------------------------------------------------------------
    To unsubscribe, e-mail: dev-unsubscribe@turbine.apache.org
    For additional commands, e-mail: dev-help@turbine.apache.org
  • Anonymous at Mar 8, 2012 at 6:30 am
    To whom it may engage...

    This is an automated request, but not an unsolicited one. For
    more information please visit http://gump.apache.org/nagged.html,
    and/or contact the folk at general@gump.apache.org.

    Project fulcrum-cache-test has an issue affecting its community integration.
    This issue affects 1 projects,
    and has been outstanding for 31 runs.
    The current state of this project is 'Failed', with reason 'Build Failed'.
    For reference only, the following projects are affected by this:
    - fulcrum-cache-test : Services Framework


    Full details are available at:
    http://vmgump.apache.org/gump/public/turbine-fulcrum/fulcrum-cache-test/index.html

    That said, some information snippets are provided here.

    The following annotations (debug/informational/warning/error messages) were provided:
    -WARNING- Overriding Maven settings: [/srv/gump/public/workspace/turbine-fulcrum/cache/gump_mvn_settings.xml]
    -DEBUG- (Apache Gump generated) Apache Maven Settings in: /srv/gump/public/workspace/turbine-fulcrum/cache/gump_mvn_settings.xml
    -INFO- Failed with reason build failed
    -DEBUG- Maven POM in: /srv/gump/public/workspace/turbine-fulcrum/cache/pom.xml



    The following work was performed:
    http://vmgump.apache.org/gump/public/turbine-fulcrum/fulcrum-cache-test/gump_work/build_turbine-fulcrum_fulcrum-cache-test.html
    Work Name: build_turbine-fulcrum_fulcrum-cache-test (Type: Build)
    Work ended in a state of : Failed
    Elapsed: 6 mins 55 secs
    Command Line: /opt/maven2/bin/mvn --batch-mode --settings /srv/gump/public/workspace/turbine-fulcrum/cache/gump_mvn_settings.xml test
    [Working Directory: /srv/gump/public/workspace/turbine-fulcrum/cache]
    M2_HOME: /opt/maven2
    ---------------------------------------------
    [DEBUG] Disposing all services
    [DEBUG] Decommision the service jcscache
    [DEBUG] Decommisioning the service jcscache
    [DEBUG] Disposable.dispose() for jcscache
    Mar 8, 2012 6:30:31 AM org.apache.jcs.engine.control.CompositeCache dispose
    INFO: In DISPOSE, [Cache_Test] fromRemote [false]
    Region Name = Cache_Test
    HitCountRam = 308
    HitCountAux = 0
    ---------------------------LRU Memory Cache
    List Size = 3
    Map Size = 3
    Put Count = 23
    Hit Count = 309
    Miss Count = 1
    [DEBUG] JCSCacheService stopped.
    [DEBUG] Decommision the service ehcache
    [DEBUG] Decommisioning the service ehcache
    [DEBUG] Disposable.dispose() for ehcache
    [DEBUG] EHCacheService stopped!
    [DEBUG] Decommision the service cache
    [DEBUG] Decommisioning the service cache
    [DEBUG] Disposable.dispose() for cache
    [DEBUG] Disposing the service jcscache
    [DEBUG] Disposing the service ehcache
    [DEBUG] Disposing the service cache
    [DEBUG] All services are disposed
    [INFO] YaffiContainer has been disposed.
    Tests run: 10, Failures: 0, Errors: 0, Skipped: 0, Time elapsed: 142.181 sec

    Results :

    Failed tests:
    testObjectCount(org.apache.fulcrum.cache.JCSCacheTest)

    Tests run: 30, Failures: 1, Errors: 0, Skipped: 0

    [INFO] ------------------------------------------------------------------------
    [ERROR] BUILD FAILURE
    [INFO] ------------------------------------------------------------------------
    [INFO] There are test failures.

    Please refer to /srv/gump/public/workspace/turbine-fulcrum/cache/target/surefire-reports for the individual test results.
    [INFO] ------------------------------------------------------------------------
    [INFO] For more information, run Maven with the -e switch
    [INFO] ------------------------------------------------------------------------
    [INFO] Total time: 6 minutes 54 seconds
    [INFO] Finished at: Thu Mar 08 06:30:31 UTC 2012
    [INFO] Final Memory: 14M/35M
    [INFO] ------------------------------------------------------------------------
    ---------------------------------------------

    To subscribe to this information via syndicated feeds:
    - RSS: http://vmgump.apache.org/gump/public/turbine-fulcrum/fulcrum-cache-test/rss.xml
    - Atom: http://vmgump.apache.org/gump/public/turbine-fulcrum/fulcrum-cache-test/atom.xml

    ============================== Gump Tracking Only ===
    Produced by Apache Gump(TM) version 2.3.
    Gump Run 12000008032012, vmgump.apache.org:vmgump:12000008032012
    Gump E-mail Identifier (unique within run) #36.

    --
    Apache Gump
    http://gump.apache.org/ [Instance: vmgump]

    ---------------------------------------------------------------------
    To unsubscribe, e-mail: dev-unsubscribe@turbine.apache.org
    For additional commands, e-mail: dev-help@turbine.apache.org
  • Anonymous at Mar 9, 2012 at 6:50 am
    To whom it may engage...

    This is an automated request, but not an unsolicited one. For
    more information please visit http://gump.apache.org/nagged.html,
    and/or contact the folk at general@gump.apache.org.

    Project fulcrum-cache-test has an issue affecting its community integration.
    This issue affects 1 projects,
    and has been outstanding for 33 runs.
    The current state of this project is 'Failed', with reason 'Build Failed'.
    For reference only, the following projects are affected by this:
    - fulcrum-cache-test : Services Framework


    Full details are available at:
    http://vmgump.apache.org/gump/public/turbine-fulcrum/fulcrum-cache-test/index.html

    That said, some information snippets are provided here.

    The following annotations (debug/informational/warning/error messages) were provided:
    -WARNING- Overriding Maven settings: [/srv/gump/public/workspace/turbine-fulcrum/cache/gump_mvn_settings.xml]
    -DEBUG- (Apache Gump generated) Apache Maven Settings in: /srv/gump/public/workspace/turbine-fulcrum/cache/gump_mvn_settings.xml
    -INFO- Failed with reason build failed
    -DEBUG- Maven POM in: /srv/gump/public/workspace/turbine-fulcrum/cache/pom.xml



    The following work was performed:
    http://vmgump.apache.org/gump/public/turbine-fulcrum/fulcrum-cache-test/gump_work/build_turbine-fulcrum_fulcrum-cache-test.html
    Work Name: build_turbine-fulcrum_fulcrum-cache-test (Type: Build)
    Work ended in a state of : Failed
    Elapsed: 6 mins 55 secs
    Command Line: /opt/maven2/bin/mvn --batch-mode --settings /srv/gump/public/workspace/turbine-fulcrum/cache/gump_mvn_settings.xml test
    [Working Directory: /srv/gump/public/workspace/turbine-fulcrum/cache]
    M2_HOME: /opt/maven2
    ---------------------------------------------
    [DEBUG] Disposing all services
    [DEBUG] Decommision the service jcscache
    [DEBUG] Decommisioning the service jcscache
    [DEBUG] Disposable.dispose() for jcscache
    Mar 9, 2012 6:50:31 AM org.apache.jcs.engine.control.CompositeCache dispose
    INFO: In DISPOSE, [Cache_Test] fromRemote [false]
    Region Name = Cache_Test
    HitCountRam = 308
    HitCountAux = 0
    ---------------------------LRU Memory Cache
    List Size = 3
    Map Size = 3
    Put Count = 23
    Hit Count = 309
    Miss Count = 1
    [DEBUG] JCSCacheService stopped.
    [DEBUG] Decommision the service ehcache
    [DEBUG] Decommisioning the service ehcache
    [DEBUG] Disposable.dispose() for ehcache
    [DEBUG] EHCacheService stopped!
    [DEBUG] Decommision the service cache
    [DEBUG] Decommisioning the service cache
    [DEBUG] Disposable.dispose() for cache
    [DEBUG] Disposing the service jcscache
    [DEBUG] Disposing the service ehcache
    [DEBUG] Disposing the service cache
    [DEBUG] All services are disposed
    [INFO] YaffiContainer has been disposed.
    Tests run: 10, Failures: 0, Errors: 0, Skipped: 0, Time elapsed: 142.178 sec

    Results :

    Failed tests:
    testObjectCount(org.apache.fulcrum.cache.JCSCacheTest)

    Tests run: 30, Failures: 1, Errors: 0, Skipped: 0

    [INFO] ------------------------------------------------------------------------
    [ERROR] BUILD FAILURE
    [INFO] ------------------------------------------------------------------------
    [INFO] There are test failures.

    Please refer to /srv/gump/public/workspace/turbine-fulcrum/cache/target/surefire-reports for the individual test results.
    [INFO] ------------------------------------------------------------------------
    [INFO] For more information, run Maven with the -e switch
    [INFO] ------------------------------------------------------------------------
    [INFO] Total time: 6 minutes 54 seconds
    [INFO] Finished at: Fri Mar 09 06:50:31 UTC 2012
    [INFO] Final Memory: 14M/35M
    [INFO] ------------------------------------------------------------------------
    ---------------------------------------------

    To subscribe to this information via syndicated feeds:
    - RSS: http://vmgump.apache.org/gump/public/turbine-fulcrum/fulcrum-cache-test/rss.xml
    - Atom: http://vmgump.apache.org/gump/public/turbine-fulcrum/fulcrum-cache-test/atom.xml

    ============================== Gump Tracking Only ===
    Produced by Apache Gump(TM) version 2.3.
    Gump Run 11000009032012, vmgump.apache.org:vmgump:11000009032012
    Gump E-mail Identifier (unique within run) #37.

    --
    Apache Gump
    http://gump.apache.org/ [Instance: vmgump]

    ---------------------------------------------------------------------
    To unsubscribe, e-mail: dev-unsubscribe@turbine.apache.org
    For additional commands, e-mail: dev-help@turbine.apache.org
  • Anonymous at Mar 10, 2012 at 6:41 am
    To whom it may engage...

    This is an automated request, but not an unsolicited one. For
    more information please visit http://gump.apache.org/nagged.html,
    and/or contact the folk at general@gump.apache.org.

    Project fulcrum-cache-test has an issue affecting its community integration.
    This issue affects 1 projects,
    and has been outstanding for 35 runs.
    The current state of this project is 'Failed', with reason 'Build Failed'.
    For reference only, the following projects are affected by this:
    - fulcrum-cache-test : Services Framework


    Full details are available at:
    http://vmgump.apache.org/gump/public/turbine-fulcrum/fulcrum-cache-test/index.html

    That said, some information snippets are provided here.

    The following annotations (debug/informational/warning/error messages) were provided:
    -WARNING- Overriding Maven settings: [/srv/gump/public/workspace/turbine-fulcrum/cache/gump_mvn_settings.xml]
    -DEBUG- (Apache Gump generated) Apache Maven Settings in: /srv/gump/public/workspace/turbine-fulcrum/cache/gump_mvn_settings.xml
    -INFO- Failed with reason build failed
    -DEBUG- Maven POM in: /srv/gump/public/workspace/turbine-fulcrum/cache/pom.xml



    The following work was performed:
    http://vmgump.apache.org/gump/public/turbine-fulcrum/fulcrum-cache-test/gump_work/build_turbine-fulcrum_fulcrum-cache-test.html
    Work Name: build_turbine-fulcrum_fulcrum-cache-test (Type: Build)
    Work ended in a state of : Failed
    Elapsed: 6 mins 55 secs
    Command Line: /opt/maven2/bin/mvn --batch-mode --settings /srv/gump/public/workspace/turbine-fulcrum/cache/gump_mvn_settings.xml test
    [Working Directory: /srv/gump/public/workspace/turbine-fulcrum/cache]
    M2_HOME: /opt/maven2
    ---------------------------------------------
    INFO: In DISPOSE, [Cache_Test] fromRemote [false]
    Region Name = Cache_Test
    HitCountRam = 308
    HitCountAux = 0
    ---------------------------LRU Memory Cache
    List Size = 3
    Map Size = 3
    Put Count = 23
    Hit Count = 309
    Miss Count = 1
    [DEBUG] Disposing of container...
    [DEBUG] Disposing all services
    [DEBUG] Decommision the service jcscache
    [DEBUG] Decommisioning the service jcscache
    [DEBUG] Disposable.dispose() for jcscache
    [DEBUG] JCSCacheService stopped.
    [DEBUG] Decommision the service ehcache
    [DEBUG] Decommisioning the service ehcache
    [DEBUG] Disposable.dispose() for ehcache
    [DEBUG] EHCacheService stopped!
    [DEBUG] Decommision the service cache
    [DEBUG] Decommisioning the service cache
    [DEBUG] Disposable.dispose() for cache
    [DEBUG] Disposing the service jcscache
    [DEBUG] Disposing the service ehcache
    [DEBUG] Disposing the service cache
    [DEBUG] All services are disposed
    [INFO] YaffiContainer has been disposed.
    Tests run: 10, Failures: 0, Errors: 0, Skipped: 0, Time elapsed: 142.145 sec

    Results :

    Failed tests:
    testObjectCount(org.apache.fulcrum.cache.JCSCacheTest)

    Tests run: 30, Failures: 1, Errors: 0, Skipped: 0

    [INFO] ------------------------------------------------------------------------
    [ERROR] BUILD FAILURE
    [INFO] ------------------------------------------------------------------------
    [INFO] There are test failures.

    Please refer to /srv/gump/public/workspace/turbine-fulcrum/cache/target/surefire-reports for the individual test results.
    [INFO] ------------------------------------------------------------------------
    [INFO] For more information, run Maven with the -e switch
    [INFO] ------------------------------------------------------------------------
    [INFO] Total time: 6 minutes 54 seconds
    [INFO] Finished at: Sat Mar 10 06:40:52 UTC 2012
    [INFO] Final Memory: 14M/35M
    [INFO] ------------------------------------------------------------------------
    ---------------------------------------------

    To subscribe to this information via syndicated feeds:
    - RSS: http://vmgump.apache.org/gump/public/turbine-fulcrum/fulcrum-cache-test/rss.xml
    - Atom: http://vmgump.apache.org/gump/public/turbine-fulcrum/fulcrum-cache-test/atom.xml

    ============================== Gump Tracking Only ===
    Produced by Apache Gump(TM) version 2.3.
    Gump Run 12000010032012, vmgump.apache.org:vmgump:12000010032012
    Gump E-mail Identifier (unique within run) #37.

    --
    Apache Gump
    http://gump.apache.org/ [Instance: vmgump]

    ---------------------------------------------------------------------
    To unsubscribe, e-mail: dev-unsubscribe@turbine.apache.org
    For additional commands, e-mail: dev-help@turbine.apache.org
  • Anonymous at Mar 11, 2012 at 6:31 am
    To whom it may engage...

    This is an automated request, but not an unsolicited one. For
    more information please visit http://gump.apache.org/nagged.html,
    and/or contact the folk at general@gump.apache.org.

    Project fulcrum-cache-test has an issue affecting its community integration.
    This issue affects 1 projects,
    and has been outstanding for 37 runs.
    The current state of this project is 'Failed', with reason 'Build Failed'.
    For reference only, the following projects are affected by this:
    - fulcrum-cache-test : Services Framework


    Full details are available at:
    http://vmgump.apache.org/gump/public/turbine-fulcrum/fulcrum-cache-test/index.html

    That said, some information snippets are provided here.

    The following annotations (debug/informational/warning/error messages) were provided:
    -WARNING- Overriding Maven settings: [/srv/gump/public/workspace/turbine-fulcrum/cache/gump_mvn_settings.xml]
    -DEBUG- (Apache Gump generated) Apache Maven Settings in: /srv/gump/public/workspace/turbine-fulcrum/cache/gump_mvn_settings.xml
    -INFO- Failed with reason build failed
    -DEBUG- Maven POM in: /srv/gump/public/workspace/turbine-fulcrum/cache/pom.xml



    The following work was performed:
    http://vmgump.apache.org/gump/public/turbine-fulcrum/fulcrum-cache-test/gump_work/build_turbine-fulcrum_fulcrum-cache-test.html
    Work Name: build_turbine-fulcrum_fulcrum-cache-test (Type: Build)
    Work ended in a state of : Failed
    Elapsed: 6 mins 55 secs
    Command Line: /opt/maven2/bin/mvn --batch-mode --settings /srv/gump/public/workspace/turbine-fulcrum/cache/gump_mvn_settings.xml test
    [Working Directory: /srv/gump/public/workspace/turbine-fulcrum/cache]
    M2_HOME: /opt/maven2
    ---------------------------------------------
    INFO: In DISPOSE, [Cache_Test] fromRemote [false]
    Region Name = Cache_Test
    HitCountRam = 308
    HitCountAux = 0
    ---------------------------LRU Memory Cache
    List Size = 3
    Map Size = 3
    Put Count = 23
    Hit Count = 309
    Miss Count = 1
    [DEBUG] Disposing of container...
    [DEBUG] Disposing all services
    [DEBUG] Decommision the service jcscache
    [DEBUG] Decommisioning the service jcscache
    [DEBUG] Disposable.dispose() for jcscache
    [DEBUG] JCSCacheService stopped.
    [DEBUG] Decommision the service ehcache
    [DEBUG] Decommisioning the service ehcache
    [DEBUG] Disposable.dispose() for ehcache
    [DEBUG] EHCacheService stopped!
    [DEBUG] Decommision the service cache
    [DEBUG] Decommisioning the service cache
    [DEBUG] Disposable.dispose() for cache
    [DEBUG] Disposing the service jcscache
    [DEBUG] Disposing the service ehcache
    [DEBUG] Disposing the service cache
    [DEBUG] All services are disposed
    [INFO] YaffiContainer has been disposed.
    Tests run: 10, Failures: 0, Errors: 0, Skipped: 0, Time elapsed: 142.152 sec

    Results :

    Failed tests:
    testObjectCount(org.apache.fulcrum.cache.JCSCacheTest)

    Tests run: 30, Failures: 1, Errors: 0, Skipped: 0

    [INFO] ------------------------------------------------------------------------
    [ERROR] BUILD FAILURE
    [INFO] ------------------------------------------------------------------------
    [INFO] There are test failures.

    Please refer to /srv/gump/public/workspace/turbine-fulcrum/cache/target/surefire-reports for the individual test results.
    [INFO] ------------------------------------------------------------------------
    [INFO] For more information, run Maven with the -e switch
    [INFO] ------------------------------------------------------------------------
    [INFO] Total time: 6 minutes 54 seconds
    [INFO] Finished at: Sun Mar 11 06:30:47 UTC 2012
    [INFO] Final Memory: 14M/35M
    [INFO] ------------------------------------------------------------------------
    ---------------------------------------------

    To subscribe to this information via syndicated feeds:
    - RSS: http://vmgump.apache.org/gump/public/turbine-fulcrum/fulcrum-cache-test/rss.xml
    - Atom: http://vmgump.apache.org/gump/public/turbine-fulcrum/fulcrum-cache-test/atom.xml

    ============================== Gump Tracking Only ===
    Produced by Apache Gump(TM) version 2.3.
    Gump Run 11000011032012, vmgump.apache.org:vmgump:11000011032012
    Gump E-mail Identifier (unique within run) #37.

    --
    Apache Gump
    http://gump.apache.org/ [Instance: vmgump]

    ---------------------------------------------------------------------
    To unsubscribe, e-mail: dev-unsubscribe@turbine.apache.org
    For additional commands, e-mail: dev-help@turbine.apache.org
  • Anonymous at Mar 12, 2012 at 6:29 am
    To whom it may engage...

    This is an automated request, but not an unsolicited one. For
    more information please visit http://gump.apache.org/nagged.html,
    and/or contact the folk at general@gump.apache.org.

    Project fulcrum-cache-test has an issue affecting its community integration.
    This issue affects 1 projects,
    and has been outstanding for 39 runs.
    The current state of this project is 'Failed', with reason 'Build Failed'.
    For reference only, the following projects are affected by this:
    - fulcrum-cache-test : Services Framework


    Full details are available at:
    http://vmgump.apache.org/gump/public/turbine-fulcrum/fulcrum-cache-test/index.html

    That said, some information snippets are provided here.

    The following annotations (debug/informational/warning/error messages) were provided:
    -WARNING- Overriding Maven settings: [/srv/gump/public/workspace/turbine-fulcrum/cache/gump_mvn_settings.xml]
    -DEBUG- (Apache Gump generated) Apache Maven Settings in: /srv/gump/public/workspace/turbine-fulcrum/cache/gump_mvn_settings.xml
    -INFO- Failed with reason build failed
    -DEBUG- Maven POM in: /srv/gump/public/workspace/turbine-fulcrum/cache/pom.xml



    The following work was performed:
    http://vmgump.apache.org/gump/public/turbine-fulcrum/fulcrum-cache-test/gump_work/build_turbine-fulcrum_fulcrum-cache-test.html
    Work Name: build_turbine-fulcrum_fulcrum-cache-test (Type: Build)
    Work ended in a state of : Failed
    Elapsed: 6 mins 55 secs
    Command Line: /opt/maven2/bin/mvn --batch-mode --settings /srv/gump/public/workspace/turbine-fulcrum/cache/gump_mvn_settings.xml test
    [Working Directory: /srv/gump/public/workspace/turbine-fulcrum/cache]
    M2_HOME: /opt/maven2
    ---------------------------------------------
    INFO: In DISPOSE, [Cache_Test] fromRemote [false]
    Region Name = Cache_Test
    HitCountRam = 308
    HitCountAux = 0
    ---------------------------LRU Memory Cache
    List Size = 3
    Map Size = 3
    Put Count = 23
    Hit Count = 309
    Miss Count = 1
    [DEBUG] Disposing of container...
    [DEBUG] Disposing all services
    [DEBUG] Decommision the service jcscache
    [DEBUG] Decommisioning the service jcscache
    [DEBUG] Disposable.dispose() for jcscache
    [DEBUG] JCSCacheService stopped.
    [DEBUG] Decommision the service ehcache
    [DEBUG] Decommisioning the service ehcache
    [DEBUG] Disposable.dispose() for ehcache
    [DEBUG] EHCacheService stopped!
    [DEBUG] Decommision the service cache
    [DEBUG] Decommisioning the service cache
    [DEBUG] Disposable.dispose() for cache
    [DEBUG] Disposing the service jcscache
    [DEBUG] Disposing the service ehcache
    [DEBUG] Disposing the service cache
    [DEBUG] All services are disposed
    [INFO] YaffiContainer has been disposed.
    Tests run: 10, Failures: 0, Errors: 0, Skipped: 0, Time elapsed: 142.163 sec

    Results :

    Failed tests:
    testObjectCount(org.apache.fulcrum.cache.JCSCacheTest)

    Tests run: 30, Failures: 1, Errors: 0, Skipped: 0

    [INFO] ------------------------------------------------------------------------
    [ERROR] BUILD FAILURE
    [INFO] ------------------------------------------------------------------------
    [INFO] There are test failures.

    Please refer to /srv/gump/public/workspace/turbine-fulcrum/cache/target/surefire-reports for the individual test results.
    [INFO] ------------------------------------------------------------------------
    [INFO] For more information, run Maven with the -e switch
    [INFO] ------------------------------------------------------------------------
    [INFO] Total time: 6 minutes 54 seconds
    [INFO] Finished at: Mon Mar 12 06:28:35 UTC 2012
    [INFO] Final Memory: 14M/35M
    [INFO] ------------------------------------------------------------------------
    ---------------------------------------------

    To subscribe to this information via syndicated feeds:
    - RSS: http://vmgump.apache.org/gump/public/turbine-fulcrum/fulcrum-cache-test/rss.xml
    - Atom: http://vmgump.apache.org/gump/public/turbine-fulcrum/fulcrum-cache-test/atom.xml

    ============================== Gump Tracking Only ===
    Produced by Apache Gump(TM) version 2.3.
    Gump Run 11000012032012, vmgump.apache.org:vmgump:11000012032012
    Gump E-mail Identifier (unique within run) #35.

    --
    Apache Gump
    http://gump.apache.org/ [Instance: vmgump]

    ---------------------------------------------------------------------
    To unsubscribe, e-mail: dev-unsubscribe@turbine.apache.org
    For additional commands, e-mail: dev-help@turbine.apache.org
  • Anonymous at Mar 13, 2012 at 6:38 am
    To whom it may engage...

    This is an automated request, but not an unsolicited one. For
    more information please visit http://gump.apache.org/nagged.html,
    and/or contact the folk at general@gump.apache.org.

    Project fulcrum-cache-test has an issue affecting its community integration.
    This issue affects 1 projects,
    and has been outstanding for 41 runs.
    The current state of this project is 'Failed', with reason 'Build Failed'.
    For reference only, the following projects are affected by this:
    - fulcrum-cache-test : Services Framework


    Full details are available at:
    http://vmgump.apache.org/gump/public/turbine-fulcrum/fulcrum-cache-test/index.html

    That said, some information snippets are provided here.

    The following annotations (debug/informational/warning/error messages) were provided:
    -WARNING- Overriding Maven settings: [/srv/gump/public/workspace/turbine-fulcrum/cache/gump_mvn_settings.xml]
    -DEBUG- (Apache Gump generated) Apache Maven Settings in: /srv/gump/public/workspace/turbine-fulcrum/cache/gump_mvn_settings.xml
    -INFO- Failed with reason build failed
    -DEBUG- Maven POM in: /srv/gump/public/workspace/turbine-fulcrum/cache/pom.xml



    The following work was performed:
    http://vmgump.apache.org/gump/public/turbine-fulcrum/fulcrum-cache-test/gump_work/build_turbine-fulcrum_fulcrum-cache-test.html
    Work Name: build_turbine-fulcrum_fulcrum-cache-test (Type: Build)
    Work ended in a state of : Failed
    Elapsed: 6 mins 56 secs
    Command Line: /opt/maven2/bin/mvn --batch-mode --settings /srv/gump/public/workspace/turbine-fulcrum/cache/gump_mvn_settings.xml test
    [Working Directory: /srv/gump/public/workspace/turbine-fulcrum/cache]
    M2_HOME: /opt/maven2
    ---------------------------------------------
    INFO: In DISPOSE, [Cache_Test] fromRemote [false]
    Region Name = Cache_Test
    HitCountRam = 308
    HitCountAux = 0
    ---------------------------LRU Memory Cache
    List Size = 3
    Map Size = 3
    Put Count = 23
    Hit Count = 309
    Miss Count = 1
    [DEBUG] Disposing of container...
    [DEBUG] Disposing all services
    [DEBUG] Decommision the service jcscache
    [DEBUG] Decommisioning the service jcscache
    [DEBUG] Disposable.dispose() for jcscache
    [DEBUG] JCSCacheService stopped.
    [DEBUG] Decommision the service ehcache
    [DEBUG] Decommisioning the service ehcache
    [DEBUG] Disposable.dispose() for ehcache
    [DEBUG] EHCacheService stopped!
    [DEBUG] Decommision the service cache
    [DEBUG] Decommisioning the service cache
    [DEBUG] Disposable.dispose() for cache
    [DEBUG] Disposing the service jcscache
    [DEBUG] Disposing the service ehcache
    [DEBUG] Disposing the service cache
    [DEBUG] All services are disposed
    [INFO] YaffiContainer has been disposed.
    Tests run: 10, Failures: 0, Errors: 0, Skipped: 0, Time elapsed: 142.381 sec

    Results :

    Failed tests:
    testObjectCount(org.apache.fulcrum.cache.JCSCacheTest)

    Tests run: 30, Failures: 1, Errors: 0, Skipped: 0

    [INFO] ------------------------------------------------------------------------
    [ERROR] BUILD FAILURE
    [INFO] ------------------------------------------------------------------------
    [INFO] There are test failures.

    Please refer to /srv/gump/public/workspace/turbine-fulcrum/cache/target/surefire-reports for the individual test results.
    [INFO] ------------------------------------------------------------------------
    [INFO] For more information, run Maven with the -e switch
    [INFO] ------------------------------------------------------------------------
    [INFO] Total time: 6 minutes 55 seconds
    [INFO] Finished at: Tue Mar 13 06:37:58 UTC 2012
    [INFO] Final Memory: 14M/35M
    [INFO] ------------------------------------------------------------------------
    ---------------------------------------------

    To subscribe to this information via syndicated feeds:
    - RSS: http://vmgump.apache.org/gump/public/turbine-fulcrum/fulcrum-cache-test/rss.xml
    - Atom: http://vmgump.apache.org/gump/public/turbine-fulcrum/fulcrum-cache-test/atom.xml

    ============================== Gump Tracking Only ===
    Produced by Apache Gump(TM) version 2.3.
    Gump Run 12000013032012, vmgump.apache.org:vmgump:12000013032012
    Gump E-mail Identifier (unique within run) #36.

    --
    Apache Gump
    http://gump.apache.org/ [Instance: vmgump]

    ---------------------------------------------------------------------
    To unsubscribe, e-mail: dev-unsubscribe@turbine.apache.org
    For additional commands, e-mail: dev-help@turbine.apache.org
  • Anonymous at Mar 14, 2012 at 6:37 am
    To whom it may engage...

    This is an automated request, but not an unsolicited one. For
    more information please visit http://gump.apache.org/nagged.html,
    and/or contact the folk at general@gump.apache.org.

    Project fulcrum-cache-test has an issue affecting its community integration.
    This issue affects 1 projects,
    and has been outstanding for 43 runs.
    The current state of this project is 'Failed', with reason 'Build Failed'.
    For reference only, the following projects are affected by this:
    - fulcrum-cache-test : Services Framework


    Full details are available at:
    http://vmgump.apache.org/gump/public/turbine-fulcrum/fulcrum-cache-test/index.html

    That said, some information snippets are provided here.

    The following annotations (debug/informational/warning/error messages) were provided:
    -WARNING- Overriding Maven settings: [/srv/gump/public/workspace/turbine-fulcrum/cache/gump_mvn_settings.xml]
    -DEBUG- (Apache Gump generated) Apache Maven Settings in: /srv/gump/public/workspace/turbine-fulcrum/cache/gump_mvn_settings.xml
    -INFO- Failed with reason build failed
    -DEBUG- Maven POM in: /srv/gump/public/workspace/turbine-fulcrum/cache/pom.xml



    The following work was performed:
    http://vmgump.apache.org/gump/public/turbine-fulcrum/fulcrum-cache-test/gump_work/build_turbine-fulcrum_fulcrum-cache-test.html
    Work Name: build_turbine-fulcrum_fulcrum-cache-test (Type: Build)
    Work ended in a state of : Failed
    Elapsed: 6 mins 55 secs
    Command Line: /opt/maven2/bin/mvn --batch-mode --settings /srv/gump/public/workspace/turbine-fulcrum/cache/gump_mvn_settings.xml test
    [Working Directory: /srv/gump/public/workspace/turbine-fulcrum/cache]
    M2_HOME: /opt/maven2
    ---------------------------------------------
    INFO: In DISPOSE, [Cache_Test] fromRemote [false]
    Region Name = Cache_Test
    HitCountRam = 308
    HitCountAux = 0
    ---------------------------LRU Memory Cache
    List Size = 3
    Map Size = 3
    Put Count = 23
    Hit Count = 309
    Miss Count = 1
    [DEBUG] Disposing of container...
    [DEBUG] Disposing all services
    [DEBUG] Decommision the service jcscache
    [DEBUG] Decommisioning the service jcscache
    [DEBUG] Disposable.dispose() for jcscache
    [DEBUG] JCSCacheService stopped.
    [DEBUG] Decommision the service ehcache
    [DEBUG] Decommisioning the service ehcache
    [DEBUG] Disposable.dispose() for ehcache
    [DEBUG] EHCacheService stopped!
    [DEBUG] Decommision the service cache
    [DEBUG] Decommisioning the service cache
    [DEBUG] Disposable.dispose() for cache
    [DEBUG] Disposing the service jcscache
    [DEBUG] Disposing the service ehcache
    [DEBUG] Disposing the service cache
    [DEBUG] All services are disposed
    [INFO] YaffiContainer has been disposed.
    Tests run: 10, Failures: 0, Errors: 0, Skipped: 0, Time elapsed: 142.152 sec

    Results :

    Failed tests:
    testObjectCount(org.apache.fulcrum.cache.JCSCacheTest)

    Tests run: 30, Failures: 1, Errors: 0, Skipped: 0

    [INFO] ------------------------------------------------------------------------
    [ERROR] BUILD FAILURE
    [INFO] ------------------------------------------------------------------------
    [INFO] There are test failures.

    Please refer to /srv/gump/public/workspace/turbine-fulcrum/cache/target/surefire-reports for the individual test results.
    [INFO] ------------------------------------------------------------------------
    [INFO] For more information, run Maven with the -e switch
    [INFO] ------------------------------------------------------------------------
    [INFO] Total time: 6 minutes 54 seconds
    [INFO] Finished at: Wed Mar 14 06:37:22 UTC 2012
    [INFO] Final Memory: 14M/35M
    [INFO] ------------------------------------------------------------------------
    ---------------------------------------------

    To subscribe to this information via syndicated feeds:
    - RSS: http://vmgump.apache.org/gump/public/turbine-fulcrum/fulcrum-cache-test/rss.xml
    - Atom: http://vmgump.apache.org/gump/public/turbine-fulcrum/fulcrum-cache-test/atom.xml

    ============================== Gump Tracking Only ===
    Produced by Apache Gump(TM) version 2.3.
    Gump Run 12000014032012, vmgump.apache.org:vmgump:12000014032012
    Gump E-mail Identifier (unique within run) #40.

    --
    Apache Gump
    http://gump.apache.org/ [Instance: vmgump]

    ---------------------------------------------------------------------
    To unsubscribe, e-mail: dev-unsubscribe@turbine.apache.org
    For additional commands, e-mail: dev-help@turbine.apache.org
  • Anonymous at Mar 15, 2012 at 6:47 am
    To whom it may engage...

    This is an automated request, but not an unsolicited one. For
    more information please visit http://gump.apache.org/nagged.html,
    and/or contact the folk at general@gump.apache.org.

    Project fulcrum-cache-test has an issue affecting its community integration.
    This issue affects 1 projects,
    and has been outstanding for 45 runs.
    The current state of this project is 'Failed', with reason 'Build Failed'.
    For reference only, the following projects are affected by this:
    - fulcrum-cache-test : Services Framework


    Full details are available at:
    http://vmgump.apache.org/gump/public/turbine-fulcrum/fulcrum-cache-test/index.html

    That said, some information snippets are provided here.

    The following annotations (debug/informational/warning/error messages) were provided:
    -WARNING- Overriding Maven settings: [/srv/gump/public/workspace/turbine-fulcrum/cache/gump_mvn_settings.xml]
    -DEBUG- (Apache Gump generated) Apache Maven Settings in: /srv/gump/public/workspace/turbine-fulcrum/cache/gump_mvn_settings.xml
    -INFO- Failed with reason build failed
    -DEBUG- Maven POM in: /srv/gump/public/workspace/turbine-fulcrum/cache/pom.xml



    The following work was performed:
    http://vmgump.apache.org/gump/public/turbine-fulcrum/fulcrum-cache-test/gump_work/build_turbine-fulcrum_fulcrum-cache-test.html
    Work Name: build_turbine-fulcrum_fulcrum-cache-test (Type: Build)
    Work ended in a state of : Failed
    Elapsed: 6 mins 56 secs
    Command Line: /opt/maven2/bin/mvn --batch-mode --settings /srv/gump/public/workspace/turbine-fulcrum/cache/gump_mvn_settings.xml test
    [Working Directory: /srv/gump/public/workspace/turbine-fulcrum/cache]
    M2_HOME: /opt/maven2
    ---------------------------------------------
    INFO: In DISPOSE, [Cache_Test] fromRemote [false]
    Region Name = Cache_Test
    HitCountRam = 308
    HitCountAux = 0
    ---------------------------LRU Memory Cache
    List Size = 3
    Map Size = 3
    Put Count = 23
    Hit Count = 309
    Miss Count = 1
    [DEBUG] Disposing of container...
    [DEBUG] Disposing all services
    [DEBUG] Decommision the service jcscache
    [DEBUG] Decommisioning the service jcscache
    [DEBUG] Disposable.dispose() for jcscache
    [DEBUG] JCSCacheService stopped.
    [DEBUG] Decommision the service ehcache
    [DEBUG] Decommisioning the service ehcache
    [DEBUG] Disposable.dispose() for ehcache
    [DEBUG] EHCacheService stopped!
    [DEBUG] Decommision the service cache
    [DEBUG] Decommisioning the service cache
    [DEBUG] Disposable.dispose() for cache
    [DEBUG] Disposing the service jcscache
    [DEBUG] Disposing the service ehcache
    [DEBUG] Disposing the service cache
    [DEBUG] All services are disposed
    [INFO] YaffiContainer has been disposed.
    Tests run: 10, Failures: 0, Errors: 0, Skipped: 0, Time elapsed: 142.345 sec

    Results :

    Failed tests:
    testObjectCount(org.apache.fulcrum.cache.JCSCacheTest)

    Tests run: 30, Failures: 1, Errors: 0, Skipped: 0

    [INFO] ------------------------------------------------------------------------
    [ERROR] BUILD FAILURE
    [INFO] ------------------------------------------------------------------------
    [INFO] There are test failures.

    Please refer to /srv/gump/public/workspace/turbine-fulcrum/cache/target/surefire-reports for the individual test results.
    [INFO] ------------------------------------------------------------------------
    [INFO] For more information, run Maven with the -e switch
    [INFO] ------------------------------------------------------------------------
    [INFO] Total time: 6 minutes 55 seconds
    [INFO] Finished at: Thu Mar 15 06:46:48 UTC 2012
    [INFO] Final Memory: 14M/35M
    [INFO] ------------------------------------------------------------------------
    ---------------------------------------------

    To subscribe to this information via syndicated feeds:
    - RSS: http://vmgump.apache.org/gump/public/turbine-fulcrum/fulcrum-cache-test/rss.xml
    - Atom: http://vmgump.apache.org/gump/public/turbine-fulcrum/fulcrum-cache-test/atom.xml

    ============================== Gump Tracking Only ===
    Produced by Apache Gump(TM) version 2.3.
    Gump Run 12000015032012, vmgump.apache.org:vmgump:12000015032012
    Gump E-mail Identifier (unique within run) #37.

    --
    Apache Gump
    http://gump.apache.org/ [Instance: vmgump]

    ---------------------------------------------------------------------
    To unsubscribe, e-mail: dev-unsubscribe@turbine.apache.org
    For additional commands, e-mail: dev-help@turbine.apache.org
  • Anonymous at Mar 16, 2012 at 6:18 am
    To whom it may engage...

    This is an automated request, but not an unsolicited one. For
    more information please visit http://gump.apache.org/nagged.html,
    and/or contact the folk at general@gump.apache.org.

    Project fulcrum-cache-test has an issue affecting its community integration.
    This issue affects 1 projects,
    and has been outstanding for 47 runs.
    The current state of this project is 'Failed', with reason 'Build Failed'.
    For reference only, the following projects are affected by this:
    - fulcrum-cache-test : Services Framework


    Full details are available at:
    http://vmgump.apache.org/gump/public/turbine-fulcrum/fulcrum-cache-test/index.html

    That said, some information snippets are provided here.

    The following annotations (debug/informational/warning/error messages) were provided:
    -WARNING- Overriding Maven settings: [/srv/gump/public/workspace/turbine-fulcrum/cache/gump_mvn_settings.xml]
    -DEBUG- (Apache Gump generated) Apache Maven Settings in: /srv/gump/public/workspace/turbine-fulcrum/cache/gump_mvn_settings.xml
    -INFO- Failed with reason build failed
    -DEBUG- Maven POM in: /srv/gump/public/workspace/turbine-fulcrum/cache/pom.xml



    The following work was performed:
    http://vmgump.apache.org/gump/public/turbine-fulcrum/fulcrum-cache-test/gump_work/build_turbine-fulcrum_fulcrum-cache-test.html
    Work Name: build_turbine-fulcrum_fulcrum-cache-test (Type: Build)
    Work ended in a state of : Failed
    Elapsed: 6 mins 55 secs
    Command Line: /opt/maven2/bin/mvn --batch-mode --settings /srv/gump/public/workspace/turbine-fulcrum/cache/gump_mvn_settings.xml test
    [Working Directory: /srv/gump/public/workspace/turbine-fulcrum/cache]
    M2_HOME: /opt/maven2
    ---------------------------------------------
    INFO: In DISPOSE, [Cache_Test] fromRemote [false]
    Region Name = Cache_Test
    HitCountRam = 308
    HitCountAux = 0
    ---------------------------LRU Memory Cache
    List Size = 3
    Map Size = 3
    Put Count = 23
    Hit Count = 309
    Miss Count = 1
    [DEBUG] Disposing of container...
    [DEBUG] Disposing all services
    [DEBUG] Decommision the service jcscache
    [DEBUG] Decommisioning the service jcscache
    [DEBUG] Disposable.dispose() for jcscache
    [DEBUG] JCSCacheService stopped.
    [DEBUG] Decommision the service ehcache
    [DEBUG] Decommisioning the service ehcache
    [DEBUG] Disposable.dispose() for ehcache
    [DEBUG] EHCacheService stopped!
    [DEBUG] Decommision the service cache
    [DEBUG] Decommisioning the service cache
    [DEBUG] Disposable.dispose() for cache
    [DEBUG] Disposing the service jcscache
    [DEBUG] Disposing the service ehcache
    [DEBUG] Disposing the service cache
    [DEBUG] All services are disposed
    [INFO] YaffiContainer has been disposed.
    Tests run: 10, Failures: 0, Errors: 0, Skipped: 0, Time elapsed: 142.167 sec

    Results :

    Failed tests:
    testObjectCount(org.apache.fulcrum.cache.JCSCacheTest)

    Tests run: 30, Failures: 1, Errors: 0, Skipped: 0

    [INFO] ------------------------------------------------------------------------
    [ERROR] BUILD FAILURE
    [INFO] ------------------------------------------------------------------------
    [INFO] There are test failures.

    Please refer to /srv/gump/public/workspace/turbine-fulcrum/cache/target/surefire-reports for the individual test results.
    [INFO] ------------------------------------------------------------------------
    [INFO] For more information, run Maven with the -e switch
    [INFO] ------------------------------------------------------------------------
    [INFO] Total time: 6 minutes 54 seconds
    [INFO] Finished at: Fri Mar 16 06:17:31 UTC 2012
    [INFO] Final Memory: 14M/35M
    [INFO] ------------------------------------------------------------------------
    ---------------------------------------------

    To subscribe to this information via syndicated feeds:
    - RSS: http://vmgump.apache.org/gump/public/turbine-fulcrum/fulcrum-cache-test/rss.xml
    - Atom: http://vmgump.apache.org/gump/public/turbine-fulcrum/fulcrum-cache-test/atom.xml

    ============================== Gump Tracking Only ===
    Produced by Apache Gump(TM) version 2.3.
    Gump Run 12000016032012, vmgump.apache.org:vmgump:12000016032012
    Gump E-mail Identifier (unique within run) #36.

    --
    Apache Gump
    http://gump.apache.org/ [Instance: vmgump]

    ---------------------------------------------------------------------
    To unsubscribe, e-mail: dev-unsubscribe@turbine.apache.org
    For additional commands, e-mail: dev-help@turbine.apache.org
  • Anonymous at Mar 17, 2012 at 6:39 am
    To whom it may engage...

    This is an automated request, but not an unsolicited one. For
    more information please visit http://gump.apache.org/nagged.html,
    and/or contact the folk at general@gump.apache.org.

    Project fulcrum-cache-test has an issue affecting its community integration.
    This issue affects 1 projects,
    and has been outstanding for 49 runs.
    The current state of this project is 'Failed', with reason 'Build Failed'.
    For reference only, the following projects are affected by this:
    - fulcrum-cache-test : Services Framework


    Full details are available at:
    http://vmgump.apache.org/gump/public/turbine-fulcrum/fulcrum-cache-test/index.html

    That said, some information snippets are provided here.

    The following annotations (debug/informational/warning/error messages) were provided:
    -WARNING- Overriding Maven settings: [/srv/gump/public/workspace/turbine-fulcrum/cache/gump_mvn_settings.xml]
    -DEBUG- (Apache Gump generated) Apache Maven Settings in: /srv/gump/public/workspace/turbine-fulcrum/cache/gump_mvn_settings.xml
    -INFO- Failed with reason build failed
    -DEBUG- Maven POM in: /srv/gump/public/workspace/turbine-fulcrum/cache/pom.xml



    The following work was performed:
    http://vmgump.apache.org/gump/public/turbine-fulcrum/fulcrum-cache-test/gump_work/build_turbine-fulcrum_fulcrum-cache-test.html
    Work Name: build_turbine-fulcrum_fulcrum-cache-test (Type: Build)
    Work ended in a state of : Failed
    Elapsed: 6 mins 56 secs
    Command Line: /opt/maven2/bin/mvn --batch-mode --settings /srv/gump/public/workspace/turbine-fulcrum/cache/gump_mvn_settings.xml test
    [Working Directory: /srv/gump/public/workspace/turbine-fulcrum/cache]
    M2_HOME: /opt/maven2
    ---------------------------------------------
    [DEBUG] Disposing all services
    [DEBUG] Decommision the service jcscache
    [DEBUG] Decommisioning the service jcscache
    [DEBUG] Disposable.dispose() for jcscache
    Mar 17, 2012 6:39:12 AM org.apache.jcs.engine.control.CompositeCache dispose
    INFO: In DISPOSE, [Cache_Test] fromRemote [false]
    Region Name = Cache_Test
    HitCountRam = 308
    HitCountAux = 0
    ---------------------------LRU Memory Cache
    List Size = 3
    Map Size = 3
    Put Count = 23
    Hit Count = 309
    Miss Count = 1
    [DEBUG] JCSCacheService stopped.
    [DEBUG] Decommision the service ehcache
    [DEBUG] Decommisioning the service ehcache
    [DEBUG] Disposable.dispose() for ehcache
    [DEBUG] EHCacheService stopped!
    [DEBUG] Decommision the service cache
    [DEBUG] Decommisioning the service cache
    [DEBUG] Disposable.dispose() for cache
    [DEBUG] Disposing the service jcscache
    [DEBUG] Disposing the service ehcache
    [DEBUG] Disposing the service cache
    [DEBUG] All services are disposed
    [INFO] YaffiContainer has been disposed.
    Tests run: 10, Failures: 0, Errors: 0, Skipped: 0, Time elapsed: 142.315 sec

    Results :

    Failed tests:
    testObjectCount(org.apache.fulcrum.cache.JCSCacheTest)

    Tests run: 30, Failures: 1, Errors: 0, Skipped: 0

    [INFO] ------------------------------------------------------------------------
    [ERROR] BUILD FAILURE
    [INFO] ------------------------------------------------------------------------
    [INFO] There are test failures.

    Please refer to /srv/gump/public/workspace/turbine-fulcrum/cache/target/surefire-reports for the individual test results.
    [INFO] ------------------------------------------------------------------------
    [INFO] For more information, run Maven with the -e switch
    [INFO] ------------------------------------------------------------------------
    [INFO] Total time: 6 minutes 55 seconds
    [INFO] Finished at: Sat Mar 17 06:39:12 UTC 2012
    [INFO] Final Memory: 14M/35M
    [INFO] ------------------------------------------------------------------------
    ---------------------------------------------

    To subscribe to this information via syndicated feeds:
    - RSS: http://vmgump.apache.org/gump/public/turbine-fulcrum/fulcrum-cache-test/rss.xml
    - Atom: http://vmgump.apache.org/gump/public/turbine-fulcrum/fulcrum-cache-test/atom.xml

    ============================== Gump Tracking Only ===
    Produced by Apache Gump(TM) version 2.3.
    Gump Run 12000017032012, vmgump.apache.org:vmgump:12000017032012
    Gump E-mail Identifier (unique within run) #37.

    --
    Apache Gump
    http://gump.apache.org/ [Instance: vmgump]

    ---------------------------------------------------------------------
    To unsubscribe, e-mail: dev-unsubscribe@turbine.apache.org
    For additional commands, e-mail: dev-help@turbine.apache.org
  • Anonymous at Mar 18, 2012 at 6:36 am
    To whom it may engage...

    This is an automated request, but not an unsolicited one. For
    more information please visit http://gump.apache.org/nagged.html,
    and/or contact the folk at general@gump.apache.org.

    Project fulcrum-cache-test has an issue affecting its community integration.
    This issue affects 1 projects,
    and has been outstanding for 51 runs.
    The current state of this project is 'Failed', with reason 'Build Failed'.
    For reference only, the following projects are affected by this:
    - fulcrum-cache-test : Services Framework


    Full details are available at:
    http://vmgump.apache.org/gump/public/turbine-fulcrum/fulcrum-cache-test/index.html

    That said, some information snippets are provided here.

    The following annotations (debug/informational/warning/error messages) were provided:
    -WARNING- Overriding Maven settings: [/srv/gump/public/workspace/turbine-fulcrum/cache/gump_mvn_settings.xml]
    -DEBUG- (Apache Gump generated) Apache Maven Settings in: /srv/gump/public/workspace/turbine-fulcrum/cache/gump_mvn_settings.xml
    -INFO- Failed with reason build failed
    -DEBUG- Maven POM in: /srv/gump/public/workspace/turbine-fulcrum/cache/pom.xml



    The following work was performed:
    http://vmgump.apache.org/gump/public/turbine-fulcrum/fulcrum-cache-test/gump_work/build_turbine-fulcrum_fulcrum-cache-test.html
    Work Name: build_turbine-fulcrum_fulcrum-cache-test (Type: Build)
    Work ended in a state of : Failed
    Elapsed: 6 mins 57 secs
    Command Line: /opt/maven2/bin/mvn --batch-mode --settings /srv/gump/public/workspace/turbine-fulcrum/cache/gump_mvn_settings.xml test
    [Working Directory: /srv/gump/public/workspace/turbine-fulcrum/cache]
    M2_HOME: /opt/maven2
    ---------------------------------------------
    INFO: In DISPOSE, [Cache_Test] fromRemote [false]
    Region Name = Cache_Test
    HitCountRam = 308
    HitCountAux = 0
    ---------------------------LRU Memory Cache
    List Size = 3
    Map Size = 3
    Put Count = 23
    Hit Count = 309
    Miss Count = 1
    [DEBUG] Disposing of container...
    [DEBUG] Disposing all services
    [DEBUG] Decommision the service jcscache
    [DEBUG] Decommisioning the service jcscache
    [DEBUG] Disposable.dispose() for jcscache
    [DEBUG] JCSCacheService stopped.
    [DEBUG] Decommision the service ehcache
    [DEBUG] Decommisioning the service ehcache
    [DEBUG] Disposable.dispose() for ehcache
    [DEBUG] EHCacheService stopped!
    [DEBUG] Decommision the service cache
    [DEBUG] Decommisioning the service cache
    [DEBUG] Disposable.dispose() for cache
    [DEBUG] Disposing the service jcscache
    [DEBUG] Disposing the service ehcache
    [DEBUG] Disposing the service cache
    [DEBUG] All services are disposed
    [INFO] YaffiContainer has been disposed.
    Tests run: 10, Failures: 0, Errors: 0, Skipped: 0, Time elapsed: 142.356 sec

    Results :

    Failed tests:
    testObjectCount(org.apache.fulcrum.cache.JCSCacheTest)

    Tests run: 30, Failures: 1, Errors: 0, Skipped: 0

    [INFO] ------------------------------------------------------------------------
    [ERROR] BUILD FAILURE
    [INFO] ------------------------------------------------------------------------
    [INFO] There are test failures.

    Please refer to /srv/gump/public/workspace/turbine-fulcrum/cache/target/surefire-reports for the individual test results.
    [INFO] ------------------------------------------------------------------------
    [INFO] For more information, run Maven with the -e switch
    [INFO] ------------------------------------------------------------------------
    [INFO] Total time: 6 minutes 55 seconds
    [INFO] Finished at: Sun Mar 18 06:35:57 UTC 2012
    [INFO] Final Memory: 14M/35M
    [INFO] ------------------------------------------------------------------------
    ---------------------------------------------

    To subscribe to this information via syndicated feeds:
    - RSS: http://vmgump.apache.org/gump/public/turbine-fulcrum/fulcrum-cache-test/rss.xml
    - Atom: http://vmgump.apache.org/gump/public/turbine-fulcrum/fulcrum-cache-test/atom.xml

    ============================== Gump Tracking Only ===
    Produced by Apache Gump(TM) version 2.3.
    Gump Run 12000018032012, vmgump.apache.org:vmgump:12000018032012
    Gump E-mail Identifier (unique within run) #37.

    --
    Apache Gump
    http://gump.apache.org/ [Instance: vmgump]

    ---------------------------------------------------------------------
    To unsubscribe, e-mail: dev-unsubscribe@turbine.apache.org
    For additional commands, e-mail: dev-help@turbine.apache.org
  • Anonymous at Mar 19, 2012 at 6:38 am
    To whom it may engage...

    This is an automated request, but not an unsolicited one. For
    more information please visit http://gump.apache.org/nagged.html,
    and/or contact the folk at general@gump.apache.org.

    Project fulcrum-cache-test has an issue affecting its community integration.
    This issue affects 1 projects,
    and has been outstanding for 53 runs.
    The current state of this project is 'Failed', with reason 'Build Failed'.
    For reference only, the following projects are affected by this:
    - fulcrum-cache-test : Services Framework


    Full details are available at:
    http://vmgump.apache.org/gump/public/turbine-fulcrum/fulcrum-cache-test/index.html

    That said, some information snippets are provided here.

    The following annotations (debug/informational/warning/error messages) were provided:
    -WARNING- Overriding Maven settings: [/srv/gump/public/workspace/turbine-fulcrum/cache/gump_mvn_settings.xml]
    -DEBUG- (Apache Gump generated) Apache Maven Settings in: /srv/gump/public/workspace/turbine-fulcrum/cache/gump_mvn_settings.xml
    -INFO- Failed with reason build failed
    -DEBUG- Maven POM in: /srv/gump/public/workspace/turbine-fulcrum/cache/pom.xml



    The following work was performed:
    http://vmgump.apache.org/gump/public/turbine-fulcrum/fulcrum-cache-test/gump_work/build_turbine-fulcrum_fulcrum-cache-test.html
    Work Name: build_turbine-fulcrum_fulcrum-cache-test (Type: Build)
    Work ended in a state of : Failed
    Elapsed: 6 mins 55 secs
    Command Line: /opt/maven2/bin/mvn --batch-mode --settings /srv/gump/public/workspace/turbine-fulcrum/cache/gump_mvn_settings.xml test
    [Working Directory: /srv/gump/public/workspace/turbine-fulcrum/cache]
    M2_HOME: /opt/maven2
    ---------------------------------------------
    INFO: In DISPOSE, [Cache_Test] fromRemote [false]
    Region Name = Cache_Test
    HitCountRam = 308
    HitCountAux = 0
    ---------------------------LRU Memory Cache
    List Size = 3
    Map Size = 3
    Put Count = 23
    Hit Count = 309
    Miss Count = 1
    [DEBUG] Disposing of container...
    [DEBUG] Disposing all services
    [DEBUG] Decommision the service jcscache
    [DEBUG] Decommisioning the service jcscache
    [DEBUG] Disposable.dispose() for jcscache
    [DEBUG] JCSCacheService stopped.
    [DEBUG] Decommision the service ehcache
    [DEBUG] Decommisioning the service ehcache
    [DEBUG] Disposable.dispose() for ehcache
    [DEBUG] EHCacheService stopped!
    [DEBUG] Decommision the service cache
    [DEBUG] Decommisioning the service cache
    [DEBUG] Disposable.dispose() for cache
    [DEBUG] Disposing the service jcscache
    [DEBUG] Disposing the service ehcache
    [DEBUG] Disposing the service cache
    [DEBUG] All services are disposed
    [INFO] YaffiContainer has been disposed.
    Tests run: 10, Failures: 0, Errors: 0, Skipped: 0, Time elapsed: 142.415 sec

    Results :

    Failed tests:
    testObjectCount(org.apache.fulcrum.cache.JCSCacheTest)

    Tests run: 30, Failures: 1, Errors: 0, Skipped: 0

    [INFO] ------------------------------------------------------------------------
    [ERROR] BUILD FAILURE
    [INFO] ------------------------------------------------------------------------
    [INFO] There are test failures.

    Please refer to /srv/gump/public/workspace/turbine-fulcrum/cache/target/surefire-reports for the individual test results.
    [INFO] ------------------------------------------------------------------------
    [INFO] For more information, run Maven with the -e switch
    [INFO] ------------------------------------------------------------------------
    [INFO] Total time: 6 minutes 54 seconds
    [INFO] Finished at: Mon Mar 19 06:37:58 UTC 2012
    [INFO] Final Memory: 14M/35M
    [INFO] ------------------------------------------------------------------------
    ---------------------------------------------

    To subscribe to this information via syndicated feeds:
    - RSS: http://vmgump.apache.org/gump/public/turbine-fulcrum/fulcrum-cache-test/rss.xml
    - Atom: http://vmgump.apache.org/gump/public/turbine-fulcrum/fulcrum-cache-test/atom.xml

    ============================== Gump Tracking Only ===
    Produced by Apache Gump(TM) version 2.3.
    Gump Run 11000019032012, vmgump.apache.org:vmgump:11000019032012
    Gump E-mail Identifier (unique within run) #37.

    --
    Apache Gump
    http://gump.apache.org/ [Instance: vmgump]

    ---------------------------------------------------------------------
    To unsubscribe, e-mail: dev-unsubscribe@turbine.apache.org
    For additional commands, e-mail: dev-help@turbine.apache.org
  • Anonymous at Mar 20, 2012 at 6:52 am
    To whom it may engage...

    This is an automated request, but not an unsolicited one. For
    more information please visit http://gump.apache.org/nagged.html,
    and/or contact the folk at general@gump.apache.org.

    Project fulcrum-cache-test has an issue affecting its community integration.
    This issue affects 1 projects,
    and has been outstanding for 55 runs.
    The current state of this project is 'Failed', with reason 'Build Failed'.
    For reference only, the following projects are affected by this:
    - fulcrum-cache-test : Services Framework


    Full details are available at:
    http://vmgump.apache.org/gump/public/turbine-fulcrum/fulcrum-cache-test/index.html

    That said, some information snippets are provided here.

    The following annotations (debug/informational/warning/error messages) were provided:
    -WARNING- Overriding Maven settings: [/srv/gump/public/workspace/turbine-fulcrum/cache/gump_mvn_settings.xml]
    -DEBUG- (Apache Gump generated) Apache Maven Settings in: /srv/gump/public/workspace/turbine-fulcrum/cache/gump_mvn_settings.xml
    -INFO- Failed with reason build failed
    -DEBUG- Maven POM in: /srv/gump/public/workspace/turbine-fulcrum/cache/pom.xml



    The following work was performed:
    http://vmgump.apache.org/gump/public/turbine-fulcrum/fulcrum-cache-test/gump_work/build_turbine-fulcrum_fulcrum-cache-test.html
    Work Name: build_turbine-fulcrum_fulcrum-cache-test (Type: Build)
    Work ended in a state of : Failed
    Elapsed: 6 mins 56 secs
    Command Line: /opt/maven2/bin/mvn --batch-mode --settings /srv/gump/public/workspace/turbine-fulcrum/cache/gump_mvn_settings.xml test
    [Working Directory: /srv/gump/public/workspace/turbine-fulcrum/cache]
    M2_HOME: /opt/maven2
    ---------------------------------------------
    INFO: In DISPOSE, [Cache_Test] fromRemote [false]
    Region Name = Cache_Test
    HitCountRam = 308
    HitCountAux = 0
    ---------------------------LRU Memory Cache
    List Size = 3
    Map Size = 3
    Put Count = 23
    Hit Count = 309
    Miss Count = 1
    [DEBUG] Disposing of container...
    [DEBUG] Disposing all services
    [DEBUG] Decommision the service jcscache
    [DEBUG] Decommisioning the service jcscache
    [DEBUG] Disposable.dispose() for jcscache
    [DEBUG] JCSCacheService stopped.
    [DEBUG] Decommision the service ehcache
    [DEBUG] Decommisioning the service ehcache
    [DEBUG] Disposable.dispose() for ehcache
    [DEBUG] EHCacheService stopped!
    [DEBUG] Decommision the service cache
    [DEBUG] Decommisioning the service cache
    [DEBUG] Disposable.dispose() for cache
    [DEBUG] Disposing the service jcscache
    [DEBUG] Disposing the service ehcache
    [DEBUG] Disposing the service cache
    [DEBUG] All services are disposed
    [INFO] YaffiContainer has been disposed.
    Tests run: 10, Failures: 0, Errors: 0, Skipped: 0, Time elapsed: 142.307 sec

    Results :

    Failed tests:
    testObjectCount(org.apache.fulcrum.cache.JCSCacheTest)

    Tests run: 30, Failures: 1, Errors: 0, Skipped: 0

    [INFO] ------------------------------------------------------------------------
    [ERROR] BUILD FAILURE
    [INFO] ------------------------------------------------------------------------
    [INFO] There are test failures.

    Please refer to /srv/gump/public/workspace/turbine-fulcrum/cache/target/surefire-reports for the individual test results.
    [INFO] ------------------------------------------------------------------------
    [INFO] For more information, run Maven with the -e switch
    [INFO] ------------------------------------------------------------------------
    [INFO] Total time: 6 minutes 55 seconds
    [INFO] Finished at: Tue Mar 20 06:52:02 UTC 2012
    [INFO] Final Memory: 14M/35M
    [INFO] ------------------------------------------------------------------------
    ---------------------------------------------

    To subscribe to this information via syndicated feeds:
    - RSS: http://vmgump.apache.org/gump/public/turbine-fulcrum/fulcrum-cache-test/rss.xml
    - Atom: http://vmgump.apache.org/gump/public/turbine-fulcrum/fulcrum-cache-test/atom.xml

    ============================== Gump Tracking Only ===
    Produced by Apache Gump(TM) version 2.3.
    Gump Run 12000020032012, vmgump.apache.org:vmgump:12000020032012
    Gump E-mail Identifier (unique within run) #36.

    --
    Apache Gump
    http://gump.apache.org/ [Instance: vmgump]

    ---------------------------------------------------------------------
    To unsubscribe, e-mail: dev-unsubscribe@turbine.apache.org
    For additional commands, e-mail: dev-help@turbine.apache.org
  • Anonymous at Mar 21, 2012 at 6:43 am
    To whom it may engage...

    This is an automated request, but not an unsolicited one. For
    more information please visit http://gump.apache.org/nagged.html,
    and/or contact the folk at general@gump.apache.org.

    Project fulcrum-cache-test has an issue affecting its community integration.
    This issue affects 1 projects,
    and has been outstanding for 57 runs.
    The current state of this project is 'Failed', with reason 'Build Failed'.
    For reference only, the following projects are affected by this:
    - fulcrum-cache-test : Services Framework


    Full details are available at:
    http://vmgump.apache.org/gump/public/turbine-fulcrum/fulcrum-cache-test/index.html

    That said, some information snippets are provided here.

    The following annotations (debug/informational/warning/error messages) were provided:
    -WARNING- Overriding Maven settings: [/srv/gump/public/workspace/turbine-fulcrum/cache/gump_mvn_settings.xml]
    -DEBUG- (Apache Gump generated) Apache Maven Settings in: /srv/gump/public/workspace/turbine-fulcrum/cache/gump_mvn_settings.xml
    -INFO- Failed with reason build failed
    -DEBUG- Maven POM in: /srv/gump/public/workspace/turbine-fulcrum/cache/pom.xml



    The following work was performed:
    http://vmgump.apache.org/gump/public/turbine-fulcrum/fulcrum-cache-test/gump_work/build_turbine-fulcrum_fulcrum-cache-test.html
    Work Name: build_turbine-fulcrum_fulcrum-cache-test (Type: Build)
    Work ended in a state of : Failed
    Elapsed: 6 mins 55 secs
    Command Line: /opt/maven2/bin/mvn --batch-mode --settings /srv/gump/public/workspace/turbine-fulcrum/cache/gump_mvn_settings.xml test
    [Working Directory: /srv/gump/public/workspace/turbine-fulcrum/cache]
    M2_HOME: /opt/maven2
    ---------------------------------------------
    [DEBUG] Disposing all services
    [DEBUG] Decommision the service jcscache
    [DEBUG] Decommisioning the service jcscache
    Mar 21, 2012 6:42:50 AM org.apache.jcs.engine.control.CompositeCache dispose
    INFO: In DISPOSE, [Cache_Test] fromRemote [false]
    Region Name = Cache_Test
    HitCountRam = 308
    HitCountAux = 0
    ---------------------------LRU Memory Cache
    List Size = 3
    Map Size = 3
    Put Count = 23
    Hit Count = 309
    Miss Count = 1
    [DEBUG] Disposable.dispose() for jcscache
    [DEBUG] JCSCacheService stopped.
    [DEBUG] Decommision the service ehcache
    [DEBUG] Decommisioning the service ehcache
    [DEBUG] Disposable.dispose() for ehcache
    [DEBUG] EHCacheService stopped!
    [DEBUG] Decommision the service cache
    [DEBUG] Decommisioning the service cache
    [DEBUG] Disposable.dispose() for cache
    [DEBUG] Disposing the service jcscache
    [DEBUG] Disposing the service ehcache
    [DEBUG] Disposing the service cache
    [DEBUG] All services are disposed
    [INFO] YaffiContainer has been disposed.
    Tests run: 10, Failures: 0, Errors: 0, Skipped: 0, Time elapsed: 142.158 sec

    Results :

    Failed tests:
    testObjectCount(org.apache.fulcrum.cache.JCSCacheTest)

    Tests run: 30, Failures: 1, Errors: 0, Skipped: 0

    [INFO] ------------------------------------------------------------------------
    [ERROR] BUILD FAILURE
    [INFO] ------------------------------------------------------------------------
    [INFO] There are test failures.

    Please refer to /srv/gump/public/workspace/turbine-fulcrum/cache/target/surefire-reports for the individual test results.
    [INFO] ------------------------------------------------------------------------
    [INFO] For more information, run Maven with the -e switch
    [INFO] ------------------------------------------------------------------------
    [INFO] Total time: 6 minutes 54 seconds
    [INFO] Finished at: Wed Mar 21 06:42:50 UTC 2012
    [INFO] Final Memory: 14M/35M
    [INFO] ------------------------------------------------------------------------
    ---------------------------------------------

    To subscribe to this information via syndicated feeds:
    - RSS: http://vmgump.apache.org/gump/public/turbine-fulcrum/fulcrum-cache-test/rss.xml
    - Atom: http://vmgump.apache.org/gump/public/turbine-fulcrum/fulcrum-cache-test/atom.xml

    ============================== Gump Tracking Only ===
    Produced by Apache Gump(TM) version 2.3.
    Gump Run 12000021032012, vmgump.apache.org:vmgump:12000021032012
    Gump E-mail Identifier (unique within run) #39.

    --
    Apache Gump
    http://gump.apache.org/ [Instance: vmgump]

    ---------------------------------------------------------------------
    To unsubscribe, e-mail: dev-unsubscribe@turbine.apache.org
    For additional commands, e-mail: dev-help@turbine.apache.org
  • Anonymous at Mar 22, 2012 at 7:58 am
    To whom it may engage...

    This is an automated request, but not an unsolicited one. For
    more information please visit http://gump.apache.org/nagged.html,
    and/or contact the folk at general@gump.apache.org.

    Project fulcrum-cache-test has an issue affecting its community integration.
    This issue affects 1 projects,
    and has been outstanding for 59 runs.
    The current state of this project is 'Failed', with reason 'Build Failed'.
    For reference only, the following projects are affected by this:
    - fulcrum-cache-test : Services Framework


    Full details are available at:
    http://vmgump.apache.org/gump/public/turbine-fulcrum/fulcrum-cache-test/index.html

    That said, some information snippets are provided here.

    The following annotations (debug/informational/warning/error messages) were provided:
    -WARNING- Overriding Maven settings: [/srv/gump/public/workspace/turbine-fulcrum/cache/gump_mvn_settings.xml]
    -DEBUG- (Apache Gump generated) Apache Maven Settings in: /srv/gump/public/workspace/turbine-fulcrum/cache/gump_mvn_settings.xml
    -INFO- Failed with reason build failed
    -DEBUG- Maven POM in: /srv/gump/public/workspace/turbine-fulcrum/cache/pom.xml



    The following work was performed:
    http://vmgump.apache.org/gump/public/turbine-fulcrum/fulcrum-cache-test/gump_work/build_turbine-fulcrum_fulcrum-cache-test.html
    Work Name: build_turbine-fulcrum_fulcrum-cache-test (Type: Build)
    Work ended in a state of : Failed
    Elapsed: 6 mins 55 secs
    Command Line: /opt/maven2/bin/mvn --batch-mode --settings /srv/gump/public/workspace/turbine-fulcrum/cache/gump_mvn_settings.xml test
    [Working Directory: /srv/gump/public/workspace/turbine-fulcrum/cache]
    M2_HOME: /opt/maven2
    ---------------------------------------------
    INFO: In DISPOSE, [Cache_Test] fromRemote [false]
    Region Name = Cache_Test
    HitCountRam = 308
    HitCountAux = 0
    ---------------------------LRU Memory Cache
    List Size = 3
    Map Size = 3
    Put Count = 23
    Hit Count = 309
    Miss Count = 1
    [DEBUG] Disposing of container...
    [DEBUG] Disposing all services
    [DEBUG] Decommision the service jcscache
    [DEBUG] Decommisioning the service jcscache
    [DEBUG] Disposable.dispose() for jcscache
    [DEBUG] JCSCacheService stopped.
    [DEBUG] Decommision the service ehcache
    [DEBUG] Decommisioning the service ehcache
    [DEBUG] Disposable.dispose() for ehcache
    [DEBUG] EHCacheService stopped!
    [DEBUG] Decommision the service cache
    [DEBUG] Decommisioning the service cache
    [DEBUG] Disposable.dispose() for cache
    [DEBUG] Disposing the service jcscache
    [DEBUG] Disposing the service ehcache
    [DEBUG] Disposing the service cache
    [DEBUG] All services are disposed
    [INFO] YaffiContainer has been disposed.
    Tests run: 10, Failures: 0, Errors: 0, Skipped: 0, Time elapsed: 142.171 sec

    Results :

    Failed tests:
    testObjectCount(org.apache.fulcrum.cache.JCSCacheTest)

    Tests run: 30, Failures: 1, Errors: 0, Skipped: 0

    [INFO] ------------------------------------------------------------------------
    [ERROR] BUILD FAILURE
    [INFO] ------------------------------------------------------------------------
    [INFO] There are test failures.

    Please refer to /srv/gump/public/workspace/turbine-fulcrum/cache/target/surefire-reports for the individual test results.
    [INFO] ------------------------------------------------------------------------
    [INFO] For more information, run Maven with the -e switch
    [INFO] ------------------------------------------------------------------------
    [INFO] Total time: 6 minutes 54 seconds
    [INFO] Finished at: Thu Mar 22 07:57:31 UTC 2012
    [INFO] Final Memory: 14M/35M
    [INFO] ------------------------------------------------------------------------
    ---------------------------------------------

    To subscribe to this information via syndicated feeds:
    - RSS: http://vmgump.apache.org/gump/public/turbine-fulcrum/fulcrum-cache-test/rss.xml
    - Atom: http://vmgump.apache.org/gump/public/turbine-fulcrum/fulcrum-cache-test/atom.xml

    ============================== Gump Tracking Only ===
    Produced by Apache Gump(TM) version 2.3.
    Gump Run 12000022032012, vmgump.apache.org:vmgump:12000022032012
    Gump E-mail Identifier (unique within run) #39.

    --
    Apache Gump
    http://gump.apache.org/ [Instance: vmgump]

    ---------------------------------------------------------------------
    To unsubscribe, e-mail: dev-unsubscribe@turbine.apache.org
    For additional commands, e-mail: dev-help@turbine.apache.org
  • Anonymous at Mar 23, 2012 at 7:02 am
    To whom it may engage...

    This is an automated request, but not an unsolicited one. For
    more information please visit http://gump.apache.org/nagged.html,
    and/or contact the folk at general@gump.apache.org.

    Project fulcrum-cache-test has an issue affecting its community integration.
    This issue affects 1 projects,
    and has been outstanding for 61 runs.
    The current state of this project is 'Failed', with reason 'Build Failed'.
    For reference only, the following projects are affected by this:
    - fulcrum-cache-test : Services Framework


    Full details are available at:
    http://vmgump.apache.org/gump/public/turbine-fulcrum/fulcrum-cache-test/index.html

    That said, some information snippets are provided here.

    The following annotations (debug/informational/warning/error messages) were provided:
    -WARNING- Overriding Maven settings: [/srv/gump/public/workspace/turbine-fulcrum/cache/gump_mvn_settings.xml]
    -DEBUG- (Apache Gump generated) Apache Maven Settings in: /srv/gump/public/workspace/turbine-fulcrum/cache/gump_mvn_settings.xml
    -INFO- Failed with reason build failed
    -DEBUG- Maven POM in: /srv/gump/public/workspace/turbine-fulcrum/cache/pom.xml



    The following work was performed:
    http://vmgump.apache.org/gump/public/turbine-fulcrum/fulcrum-cache-test/gump_work/build_turbine-fulcrum_fulcrum-cache-test.html
    Work Name: build_turbine-fulcrum_fulcrum-cache-test (Type: Build)
    Work ended in a state of : Failed
    Elapsed: 6 mins 57 secs
    Command Line: /opt/maven2/bin/mvn --batch-mode --settings /srv/gump/public/workspace/turbine-fulcrum/cache/gump_mvn_settings.xml test
    [Working Directory: /srv/gump/public/workspace/turbine-fulcrum/cache]
    M2_HOME: /opt/maven2
    ---------------------------------------------
    [DEBUG] Disposing all services
    [DEBUG] Decommision the service jcscache
    [DEBUG] Decommisioning the service jcscache
    [DEBUG] Disposable.dispose() for jcscache
    Mar 23, 2012 7:01:50 AM org.apache.jcs.engine.control.CompositeCache dispose
    INFO: In DISPOSE, [Cache_Test] fromRemote [false]
    Region Name = Cache_Test
    HitCountRam = 305
    HitCountAux = 0
    ---------------------------LRU Memory Cache
    List Size = 3
    Map Size = 3
    Put Count = 23
    Hit Count = 306
    Miss Count = 1
    [DEBUG] JCSCacheService stopped.
    [DEBUG] Decommision the service ehcache
    [DEBUG] Decommisioning the service ehcache
    [DEBUG] Disposable.dispose() for ehcache
    [DEBUG] EHCacheService stopped!
    [DEBUG] Decommision the service cache
    [DEBUG] Decommisioning the service cache
    [DEBUG] Disposable.dispose() for cache
    [DEBUG] Disposing the service jcscache
    [DEBUG] Disposing the service ehcache
    [DEBUG] Disposing the service cache
    [DEBUG] All services are disposed
    [INFO] YaffiContainer has been disposed.
    Tests run: 10, Failures: 0, Errors: 0, Skipped: 0, Time elapsed: 142.183 sec

    Results :

    Failed tests:
    testObjectCount(org.apache.fulcrum.cache.JCSCacheTest)

    Tests run: 30, Failures: 1, Errors: 0, Skipped: 0

    [INFO] ------------------------------------------------------------------------
    [ERROR] BUILD FAILURE
    [INFO] ------------------------------------------------------------------------
    [INFO] There are test failures.

    Please refer to /srv/gump/public/workspace/turbine-fulcrum/cache/target/surefire-reports for the individual test results.
    [INFO] ------------------------------------------------------------------------
    [INFO] For more information, run Maven with the -e switch
    [INFO] ------------------------------------------------------------------------
    [INFO] Total time: 6 minutes 55 seconds
    [INFO] Finished at: Fri Mar 23 07:01:50 UTC 2012
    [INFO] Final Memory: 14M/35M
    [INFO] ------------------------------------------------------------------------
    ---------------------------------------------

    To subscribe to this information via syndicated feeds:
    - RSS: http://vmgump.apache.org/gump/public/turbine-fulcrum/fulcrum-cache-test/rss.xml
    - Atom: http://vmgump.apache.org/gump/public/turbine-fulcrum/fulcrum-cache-test/atom.xml

    ============================== Gump Tracking Only ===
    Produced by Apache Gump(TM) version 2.3.
    Gump Run 13000023032012, vmgump.apache.org:vmgump:13000023032012
    Gump E-mail Identifier (unique within run) #39.

    --
    Apache Gump
    http://gump.apache.org/ [Instance: vmgump]

    ---------------------------------------------------------------------
    To unsubscribe, e-mail: dev-unsubscribe@turbine.apache.org
    For additional commands, e-mail: dev-help@turbine.apache.org
  • Anonymous at Mar 24, 2012 at 6:47 am
    To whom it may engage...

    This is an automated request, but not an unsolicited one. For
    more information please visit http://gump.apache.org/nagged.html,
    and/or contact the folk at general@gump.apache.org.

    Project fulcrum-cache-test has an issue affecting its community integration.
    This issue affects 1 projects,
    and has been outstanding for 63 runs.
    The current state of this project is 'Failed', with reason 'Build Failed'.
    For reference only, the following projects are affected by this:
    - fulcrum-cache-test : Services Framework


    Full details are available at:
    http://vmgump.apache.org/gump/public/turbine-fulcrum/fulcrum-cache-test/index.html

    That said, some information snippets are provided here.

    The following annotations (debug/informational/warning/error messages) were provided:
    -WARNING- Overriding Maven settings: [/srv/gump/public/workspace/turbine-fulcrum/cache/gump_mvn_settings.xml]
    -DEBUG- (Apache Gump generated) Apache Maven Settings in: /srv/gump/public/workspace/turbine-fulcrum/cache/gump_mvn_settings.xml
    -INFO- Failed with reason build failed
    -DEBUG- Maven POM in: /srv/gump/public/workspace/turbine-fulcrum/cache/pom.xml



    The following work was performed:
    http://vmgump.apache.org/gump/public/turbine-fulcrum/fulcrum-cache-test/gump_work/build_turbine-fulcrum_fulcrum-cache-test.html
    Work Name: build_turbine-fulcrum_fulcrum-cache-test (Type: Build)
    Work ended in a state of : Failed
    Elapsed: 6 mins 56 secs
    Command Line: /opt/maven2/bin/mvn --batch-mode --settings /srv/gump/public/workspace/turbine-fulcrum/cache/gump_mvn_settings.xml test
    [Working Directory: /srv/gump/public/workspace/turbine-fulcrum/cache]
    M2_HOME: /opt/maven2
    ---------------------------------------------
    [DEBUG] Disposing all services
    [DEBUG] Decommision the service jcscache
    [DEBUG] Decommisioning the service jcscache
    Mar 24, 2012 6:46:32 AM org.apache.jcs.engine.control.CompositeCache dispose
    INFO: In DISPOSE, [Cache_Test] fromRemote [false]
    Region Name = Cache_Test
    HitCountRam = 308
    HitCountAux = 0
    ---------------------------LRU Memory Cache
    List Size = 3
    Map Size = 3
    Put Count = 23
    Hit Count = 309
    Miss Count = 1
    [DEBUG] Disposable.dispose() for jcscache
    [DEBUG] JCSCacheService stopped.
    [DEBUG] Decommision the service ehcache
    [DEBUG] Decommisioning the service ehcache
    [DEBUG] Disposable.dispose() for ehcache
    [DEBUG] EHCacheService stopped!
    [DEBUG] Decommision the service cache
    [DEBUG] Decommisioning the service cache
    [DEBUG] Disposable.dispose() for cache
    [DEBUG] Disposing the service jcscache
    [DEBUG] Disposing the service ehcache
    [DEBUG] Disposing the service cache
    [DEBUG] All services are disposed
    [INFO] YaffiContainer has been disposed.
    Tests run: 10, Failures: 0, Errors: 0, Skipped: 0, Time elapsed: 142.247 sec

    Results :

    Failed tests:
    testObjectCount(org.apache.fulcrum.cache.JCSCacheTest)

    Tests run: 30, Failures: 1, Errors: 0, Skipped: 0

    [INFO] ------------------------------------------------------------------------
    [ERROR] BUILD FAILURE
    [INFO] ------------------------------------------------------------------------
    [INFO] There are test failures.

    Please refer to /srv/gump/public/workspace/turbine-fulcrum/cache/target/surefire-reports for the individual test results.
    [INFO] ------------------------------------------------------------------------
    [INFO] For more information, run Maven with the -e switch
    [INFO] ------------------------------------------------------------------------
    [INFO] Total time: 6 minutes 55 seconds
    [INFO] Finished at: Sat Mar 24 06:46:32 UTC 2012
    [INFO] Final Memory: 14M/35M
    [INFO] ------------------------------------------------------------------------
    ---------------------------------------------

    To subscribe to this information via syndicated feeds:
    - RSS: http://vmgump.apache.org/gump/public/turbine-fulcrum/fulcrum-cache-test/rss.xml
    - Atom: http://vmgump.apache.org/gump/public/turbine-fulcrum/fulcrum-cache-test/atom.xml

    ============================== Gump Tracking Only ===
    Produced by Apache Gump(TM) version 2.3.
    Gump Run 10000024032012, vmgump.apache.org:vmgump:10000024032012
    Gump E-mail Identifier (unique within run) #40.

    --
    Apache Gump
    http://gump.apache.org/ [Instance: vmgump]

    ---------------------------------------------------------------------
    To unsubscribe, e-mail: dev-unsubscribe@turbine.apache.org
    For additional commands, e-mail: dev-help@turbine.apache.org
  • Anonymous at Mar 25, 2012 at 7:34 am
    To whom it may engage...

    This is an automated request, but not an unsolicited one. For
    more information please visit http://gump.apache.org/nagged.html,
    and/or contact the folk at general@gump.apache.org.

    Project fulcrum-cache-test has an issue affecting its community integration.
    This issue affects 1 projects,
    and has been outstanding for 65 runs.
    The current state of this project is 'Failed', with reason 'Build Failed'.
    For reference only, the following projects are affected by this:
    - fulcrum-cache-test : Services Framework


    Full details are available at:
    http://vmgump.apache.org/gump/public/turbine-fulcrum/fulcrum-cache-test/index.html

    That said, some information snippets are provided here.

    The following annotations (debug/informational/warning/error messages) were provided:
    -WARNING- Overriding Maven settings: [/srv/gump/public/workspace/turbine-fulcrum/cache/gump_mvn_settings.xml]
    -DEBUG- (Apache Gump generated) Apache Maven Settings in: /srv/gump/public/workspace/turbine-fulcrum/cache/gump_mvn_settings.xml
    -INFO- Failed with reason build failed
    -DEBUG- Maven POM in: /srv/gump/public/workspace/turbine-fulcrum/cache/pom.xml



    The following work was performed:
    http://vmgump.apache.org/gump/public/turbine-fulcrum/fulcrum-cache-test/gump_work/build_turbine-fulcrum_fulcrum-cache-test.html
    Work Name: build_turbine-fulcrum_fulcrum-cache-test (Type: Build)
    Work ended in a state of : Failed
    Elapsed: 6 mins 55 secs
    Command Line: /opt/maven2/bin/mvn --batch-mode --settings /srv/gump/public/workspace/turbine-fulcrum/cache/gump_mvn_settings.xml test
    [Working Directory: /srv/gump/public/workspace/turbine-fulcrum/cache]
    M2_HOME: /opt/maven2
    ---------------------------------------------
    [DEBUG] Disposing all services
    [DEBUG] Decommision the service jcscache
    [DEBUG] Decommisioning the service jcscache
    [DEBUG] Disposable.dispose() for jcscache
    Mar 25, 2012 7:34:19 AM org.apache.jcs.engine.control.CompositeCache dispose
    INFO: In DISPOSE, [Cache_Test] fromRemote [false]
    Region Name = Cache_Test
    HitCountRam = 308
    HitCountAux = 0
    ---------------------------LRU Memory Cache
    List Size = 3
    Map Size = 3
    Put Count = 23
    Hit Count = 309
    Miss Count = 1
    [DEBUG] JCSCacheService stopped.
    [DEBUG] Decommision the service ehcache
    [DEBUG] Decommisioning the service ehcache
    [DEBUG] Disposable.dispose() for ehcache
    [DEBUG] EHCacheService stopped!
    [DEBUG] Decommision the service cache
    [DEBUG] Decommisioning the service cache
    [DEBUG] Disposable.dispose() for cache
    [DEBUG] Disposing the service jcscache
    [DEBUG] Disposing the service ehcache
    [DEBUG] Disposing the service cache
    [DEBUG] All services are disposed
    [INFO] YaffiContainer has been disposed.
    Tests run: 10, Failures: 0, Errors: 0, Skipped: 0, Time elapsed: 142.144 sec

    Results :

    Failed tests:
    testObjectCount(org.apache.fulcrum.cache.JCSCacheTest)

    Tests run: 30, Failures: 1, Errors: 0, Skipped: 0

    [INFO] ------------------------------------------------------------------------
    [ERROR] BUILD FAILURE
    [INFO] ------------------------------------------------------------------------
    [INFO] There are test failures.

    Please refer to /srv/gump/public/workspace/turbine-fulcrum/cache/target/surefire-reports for the individual test results.
    [INFO] ------------------------------------------------------------------------
    [INFO] For more information, run Maven with the -e switch
    [INFO] ------------------------------------------------------------------------
    [INFO] Total time: 6 minutes 54 seconds
    [INFO] Finished at: Sun Mar 25 07:34:19 UTC 2012
    [INFO] Final Memory: 14M/35M
    [INFO] ------------------------------------------------------------------------
    ---------------------------------------------

    To subscribe to this information via syndicated feeds:
    - RSS: http://vmgump.apache.org/gump/public/turbine-fulcrum/fulcrum-cache-test/rss.xml
    - Atom: http://vmgump.apache.org/gump/public/turbine-fulcrum/fulcrum-cache-test/atom.xml

    ============================== Gump Tracking Only ===
    Produced by Apache Gump(TM) version 2.3.
    Gump Run 12000025032012, vmgump.apache.org:vmgump:12000025032012
    Gump E-mail Identifier (unique within run) #40.

    --
    Apache Gump
    http://gump.apache.org/ [Instance: vmgump]

    ---------------------------------------------------------------------
    To unsubscribe, e-mail: dev-unsubscribe@turbine.apache.org
    For additional commands, e-mail: dev-help@turbine.apache.org
  • Anonymous at Mar 26, 2012 at 6:56 am
    To whom it may engage...

    This is an automated request, but not an unsolicited one. For
    more information please visit http://gump.apache.org/nagged.html,
    and/or contact the folk at general@gump.apache.org.

    Project fulcrum-cache-test has an issue affecting its community integration.
    This issue affects 1 projects,
    and has been outstanding for 67 runs.
    The current state of this project is 'Failed', with reason 'Build Failed'.
    For reference only, the following projects are affected by this:
    - fulcrum-cache-test : Services Framework


    Full details are available at:
    http://vmgump.apache.org/gump/public/turbine-fulcrum/fulcrum-cache-test/index.html

    That said, some information snippets are provided here.

    The following annotations (debug/informational/warning/error messages) were provided:
    -WARNING- Overriding Maven settings: [/srv/gump/public/workspace/turbine-fulcrum/cache/gump_mvn_settings.xml]
    -DEBUG- (Apache Gump generated) Apache Maven Settings in: /srv/gump/public/workspace/turbine-fulcrum/cache/gump_mvn_settings.xml
    -INFO- Failed with reason build failed
    -DEBUG- Maven POM in: /srv/gump/public/workspace/turbine-fulcrum/cache/pom.xml



    The following work was performed:
    http://vmgump.apache.org/gump/public/turbine-fulcrum/fulcrum-cache-test/gump_work/build_turbine-fulcrum_fulcrum-cache-test.html
    Work Name: build_turbine-fulcrum_fulcrum-cache-test (Type: Build)
    Work ended in a state of : Failed
    Elapsed: 6 mins 56 secs
    Command Line: /opt/maven2/bin/mvn --batch-mode --settings /srv/gump/public/workspace/turbine-fulcrum/cache/gump_mvn_settings.xml test
    [Working Directory: /srv/gump/public/workspace/turbine-fulcrum/cache]
    M2_HOME: /opt/maven2
    ---------------------------------------------
    INFO: In DISPOSE, [Cache_Test] fromRemote [false]
    Region Name = Cache_Test
    HitCountRam = 308
    HitCountAux = 0
    ---------------------------LRU Memory Cache
    List Size = 3
    Map Size = 3
    Put Count = 23
    Hit Count = 309
    Miss Count = 1
    [DEBUG] Disposing of container...
    [DEBUG] Disposing all services
    [DEBUG] Decommision the service jcscache
    [DEBUG] Decommisioning the service jcscache
    [DEBUG] Disposable.dispose() for jcscache
    [DEBUG] JCSCacheService stopped.
    [DEBUG] Decommision the service ehcache
    [DEBUG] Decommisioning the service ehcache
    [DEBUG] Disposable.dispose() for ehcache
    [DEBUG] EHCacheService stopped!
    [DEBUG] Decommision the service cache
    [DEBUG] Decommisioning the service cache
    [DEBUG] Disposable.dispose() for cache
    [DEBUG] Disposing the service jcscache
    [DEBUG] Disposing the service ehcache
    [DEBUG] Disposing the service cache
    [DEBUG] All services are disposed
    [INFO] YaffiContainer has been disposed.
    Tests run: 10, Failures: 0, Errors: 0, Skipped: 0, Time elapsed: 142.182 sec

    Results :

    Failed tests:
    testObjectCount(org.apache.fulcrum.cache.JCSCacheTest)

    Tests run: 30, Failures: 1, Errors: 0, Skipped: 0

    [INFO] ------------------------------------------------------------------------
    [ERROR] BUILD FAILURE
    [INFO] ------------------------------------------------------------------------
    [INFO] There are test failures.

    Please refer to /srv/gump/public/workspace/turbine-fulcrum/cache/target/surefire-reports for the individual test results.
    [INFO] ------------------------------------------------------------------------
    [INFO] For more information, run Maven with the -e switch
    [INFO] ------------------------------------------------------------------------
    [INFO] Total time: 6 minutes 55 seconds
    [INFO] Finished at: Mon Mar 26 06:56:13 UTC 2012
    [INFO] Final Memory: 14M/35M
    [INFO] ------------------------------------------------------------------------
    ---------------------------------------------

    To subscribe to this information via syndicated feeds:
    - RSS: http://vmgump.apache.org/gump/public/turbine-fulcrum/fulcrum-cache-test/rss.xml
    - Atom: http://vmgump.apache.org/gump/public/turbine-fulcrum/fulcrum-cache-test/atom.xml

    ============================== Gump Tracking Only ===
    Produced by Apache Gump(TM) version 2.3.
    Gump Run 12000026032012, vmgump.apache.org:vmgump:12000026032012
    Gump E-mail Identifier (unique within run) #40.

    --
    Apache Gump
    http://gump.apache.org/ [Instance: vmgump]

    ---------------------------------------------------------------------
    To unsubscribe, e-mail: dev-unsubscribe@turbine.apache.org
    For additional commands, e-mail: dev-help@turbine.apache.org
  • Anonymous at Mar 27, 2012 at 6:48 am
    To whom it may engage...

    This is an automated request, but not an unsolicited one. For
    more information please visit http://gump.apache.org/nagged.html,
    and/or contact the folk at general@gump.apache.org.

    Project fulcrum-cache-test has an issue affecting its community integration.
    This issue affects 1 projects,
    and has been outstanding for 69 runs.
    The current state of this project is 'Failed', with reason 'Build Failed'.
    For reference only, the following projects are affected by this:
    - fulcrum-cache-test : Services Framework


    Full details are available at:
    http://vmgump.apache.org/gump/public/turbine-fulcrum/fulcrum-cache-test/index.html

    That said, some information snippets are provided here.

    The following annotations (debug/informational/warning/error messages) were provided:
    -WARNING- Overriding Maven settings: [/srv/gump/public/workspace/turbine-fulcrum/cache/gump_mvn_settings.xml]
    -DEBUG- (Apache Gump generated) Apache Maven Settings in: /srv/gump/public/workspace/turbine-fulcrum/cache/gump_mvn_settings.xml
    -INFO- Failed with reason build failed
    -DEBUG- Maven POM in: /srv/gump/public/workspace/turbine-fulcrum/cache/pom.xml



    The following work was performed:
    http://vmgump.apache.org/gump/public/turbine-fulcrum/fulcrum-cache-test/gump_work/build_turbine-fulcrum_fulcrum-cache-test.html
    Work Name: build_turbine-fulcrum_fulcrum-cache-test (Type: Build)
    Work ended in a state of : Failed
    Elapsed: 6 mins 56 secs
    Command Line: /opt/maven2/bin/mvn --batch-mode --settings /srv/gump/public/workspace/turbine-fulcrum/cache/gump_mvn_settings.xml test
    [Working Directory: /srv/gump/public/workspace/turbine-fulcrum/cache]
    M2_HOME: /opt/maven2
    ---------------------------------------------
    [DEBUG] Disposing all services
    [DEBUG] Decommision the service jcscache
    Mar 27, 2012 6:47:26 AM org.apache.jcs.engine.control.CompositeCache dispose
    INFO: In DISPOSE, [Cache_Test] fromRemote [false]
    Region Name = Cache_Test
    HitCountRam = 308
    HitCountAux = 0
    ---------------------------LRU Memory Cache
    List Size = 3
    Map Size = 3
    Put Count = 23
    Hit Count = 309
    Miss Count = 1
    [DEBUG] Decommisioning the service jcscache
    [DEBUG] Disposable.dispose() for jcscache
    [DEBUG] JCSCacheService stopped.
    [DEBUG] Decommision the service ehcache
    [DEBUG] Decommisioning the service ehcache
    [DEBUG] Disposable.dispose() for ehcache
    [DEBUG] EHCacheService stopped!
    [DEBUG] Decommision the service cache
    [DEBUG] Decommisioning the service cache
    [DEBUG] Disposable.dispose() for cache
    [DEBUG] Disposing the service jcscache
    [DEBUG] Disposing the service ehcache
    [DEBUG] Disposing the service cache
    [DEBUG] All services are disposed
    [INFO] YaffiContainer has been disposed.
    Tests run: 10, Failures: 0, Errors: 0, Skipped: 0, Time elapsed: 142.331 sec

    Results :

    Failed tests:
    testObjectCount(org.apache.fulcrum.cache.JCSCacheTest)

    Tests run: 30, Failures: 1, Errors: 0, Skipped: 0

    [INFO] ------------------------------------------------------------------------
    [ERROR] BUILD FAILURE
    [INFO] ------------------------------------------------------------------------
    [INFO] There are test failures.

    Please refer to /srv/gump/public/workspace/turbine-fulcrum/cache/target/surefire-reports for the individual test results.
    [INFO] ------------------------------------------------------------------------
    [INFO] For more information, run Maven with the -e switch
    [INFO] ------------------------------------------------------------------------
    [INFO] Total time: 6 minutes 55 seconds
    [INFO] Finished at: Tue Mar 27 06:47:26 UTC 2012
    [INFO] Final Memory: 14M/35M
    [INFO] ------------------------------------------------------------------------
    ---------------------------------------------

    To subscribe to this information via syndicated feeds:
    - RSS: http://vmgump.apache.org/gump/public/turbine-fulcrum/fulcrum-cache-test/rss.xml
    - Atom: http://vmgump.apache.org/gump/public/turbine-fulcrum/fulcrum-cache-test/atom.xml

    ============================== Gump Tracking Only ===
    Produced by Apache Gump(TM) version 2.3.
    Gump Run 12000027032012, vmgump.apache.org:vmgump:12000027032012
    Gump E-mail Identifier (unique within run) #39.

    --
    Apache Gump
    http://gump.apache.org/ [Instance: vmgump]

    ---------------------------------------------------------------------
    To unsubscribe, e-mail: dev-unsubscribe@turbine.apache.org
    For additional commands, e-mail: dev-help@turbine.apache.org
  • Anonymous at Mar 28, 2012 at 6:52 am
    To whom it may engage...

    This is an automated request, but not an unsolicited one. For
    more information please visit http://gump.apache.org/nagged.html,
    and/or contact the folk at general@gump.apache.org.

    Project fulcrum-cache-test has an issue affecting its community integration.
    This issue affects 1 projects,
    and has been outstanding for 71 runs.
    The current state of this project is 'Failed', with reason 'Build Failed'.
    For reference only, the following projects are affected by this:
    - fulcrum-cache-test : Services Framework


    Full details are available at:
    http://vmgump.apache.org/gump/public/turbine-fulcrum/fulcrum-cache-test/index.html

    That said, some information snippets are provided here.

    The following annotations (debug/informational/warning/error messages) were provided:
    -WARNING- Overriding Maven settings: [/srv/gump/public/workspace/turbine-fulcrum/cache/gump_mvn_settings.xml]
    -DEBUG- (Apache Gump generated) Apache Maven Settings in: /srv/gump/public/workspace/turbine-fulcrum/cache/gump_mvn_settings.xml
    -INFO- Failed with reason build failed
    -DEBUG- Maven POM in: /srv/gump/public/workspace/turbine-fulcrum/cache/pom.xml



    The following work was performed:
    http://vmgump.apache.org/gump/public/turbine-fulcrum/fulcrum-cache-test/gump_work/build_turbine-fulcrum_fulcrum-cache-test.html
    Work Name: build_turbine-fulcrum_fulcrum-cache-test (Type: Build)
    Work ended in a state of : Failed
    Elapsed: 6 mins 57 secs
    Command Line: /opt/maven2/bin/mvn --batch-mode --settings /srv/gump/public/workspace/turbine-fulcrum/cache/gump_mvn_settings.xml test
    [Working Directory: /srv/gump/public/workspace/turbine-fulcrum/cache]
    M2_HOME: /opt/maven2
    ---------------------------------------------
    INFO: In DISPOSE, [Cache_Test] fromRemote [false]
    Region Name = Cache_Test
    HitCountRam = 308
    HitCountAux = 0
    ---------------------------LRU Memory Cache
    List Size = 3
    Map Size = 3
    Put Count = 23
    Hit Count = 309
    Miss Count = 1
    [DEBUG] Disposing of container...
    [DEBUG] Disposing all services
    [DEBUG] Decommision the service jcscache
    [DEBUG] Decommisioning the service jcscache
    [DEBUG] Disposable.dispose() for jcscache
    [DEBUG] JCSCacheService stopped.
    [DEBUG] Decommision the service ehcache
    [DEBUG] Decommisioning the service ehcache
    [DEBUG] Disposable.dispose() for ehcache
    [DEBUG] EHCacheService stopped!
    [DEBUG] Decommision the service cache
    [DEBUG] Decommisioning the service cache
    [DEBUG] Disposable.dispose() for cache
    [DEBUG] Disposing the service jcscache
    [DEBUG] Disposing the service ehcache
    [DEBUG] Disposing the service cache
    [DEBUG] All services are disposed
    [INFO] YaffiContainer has been disposed.
    Tests run: 10, Failures: 0, Errors: 0, Skipped: 0, Time elapsed: 142.276 sec

    Results :

    Failed tests:
    testObjectCount(org.apache.fulcrum.cache.JCSCacheTest)

    Tests run: 30, Failures: 1, Errors: 0, Skipped: 0

    [INFO] ------------------------------------------------------------------------
    [ERROR] BUILD FAILURE
    [INFO] ------------------------------------------------------------------------
    [INFO] There are test failures.

    Please refer to /srv/gump/public/workspace/turbine-fulcrum/cache/target/surefire-reports for the individual test results.
    [INFO] ------------------------------------------------------------------------
    [INFO] For more information, run Maven with the -e switch
    [INFO] ------------------------------------------------------------------------
    [INFO] Total time: 6 minutes 55 seconds
    [INFO] Finished at: Wed Mar 28 06:51:56 UTC 2012
    [INFO] Final Memory: 14M/35M
    [INFO] ------------------------------------------------------------------------
    ---------------------------------------------

    To subscribe to this information via syndicated feeds:
    - RSS: http://vmgump.apache.org/gump/public/turbine-fulcrum/fulcrum-cache-test/rss.xml
    - Atom: http://vmgump.apache.org/gump/public/turbine-fulcrum/fulcrum-cache-test/atom.xml

    ============================== Gump Tracking Only ===
    Produced by Apache Gump(TM) version 2.3.
    Gump Run 11000028032012, vmgump.apache.org:vmgump:11000028032012
    Gump E-mail Identifier (unique within run) #41.

    --
    Apache Gump
    http://gump.apache.org/ [Instance: vmgump]

    ---------------------------------------------------------------------
    To unsubscribe, e-mail: dev-unsubscribe@turbine.apache.org
    For additional commands, e-mail: dev-help@turbine.apache.org
  • Anonymous at Mar 29, 2012 at 7:05 am
    To whom it may engage...

    This is an automated request, but not an unsolicited one. For
    more information please visit http://gump.apache.org/nagged.html,
    and/or contact the folk at general@gump.apache.org.

    Project fulcrum-cache-test has an issue affecting its community integration.
    This issue affects 1 projects,
    and has been outstanding for 73 runs.
    The current state of this project is 'Failed', with reason 'Build Failed'.
    For reference only, the following projects are affected by this:
    - fulcrum-cache-test : Services Framework


    Full details are available at:
    http://vmgump.apache.org/gump/public/turbine-fulcrum/fulcrum-cache-test/index.html

    That said, some information snippets are provided here.

    The following annotations (debug/informational/warning/error messages) were provided:
    -WARNING- Overriding Maven settings: [/srv/gump/public/workspace/turbine-fulcrum/cache/gump_mvn_settings.xml]
    -DEBUG- (Apache Gump generated) Apache Maven Settings in: /srv/gump/public/workspace/turbine-fulcrum/cache/gump_mvn_settings.xml
    -INFO- Failed with reason build failed
    -DEBUG- Maven POM in: /srv/gump/public/workspace/turbine-fulcrum/cache/pom.xml



    The following work was performed:
    http://vmgump.apache.org/gump/public/turbine-fulcrum/fulcrum-cache-test/gump_work/build_turbine-fulcrum_fulcrum-cache-test.html
    Work Name: build_turbine-fulcrum_fulcrum-cache-test (Type: Build)
    Work ended in a state of : Failed
    Elapsed: 7 mins
    Command Line: /opt/maven2/bin/mvn --batch-mode --settings /srv/gump/public/workspace/turbine-fulcrum/cache/gump_mvn_settings.xml test
    [Working Directory: /srv/gump/public/workspace/turbine-fulcrum/cache]
    M2_HOME: /opt/maven2
    ---------------------------------------------
    INFO: In DISPOSE, [Cache_Test] fromRemote [false]
    Region Name = Cache_Test
    HitCountRam = 308
    HitCountAux = 0
    ---------------------------LRU Memory Cache
    List Size = 3
    Map Size = 3
    Put Count = 23
    Hit Count = 309
    Miss Count = 1
    [DEBUG] Disposing of container...
    [DEBUG] Disposing all services
    [DEBUG] Decommision the service jcscache
    [DEBUG] Decommisioning the service jcscache
    [DEBUG] Disposable.dispose() for jcscache
    [DEBUG] JCSCacheService stopped.
    [DEBUG] Decommision the service ehcache
    [DEBUG] Decommisioning the service ehcache
    [DEBUG] Disposable.dispose() for ehcache
    [DEBUG] EHCacheService stopped!
    [DEBUG] Decommision the service cache
    [DEBUG] Decommisioning the service cache
    [DEBUG] Disposable.dispose() for cache
    [DEBUG] Disposing the service jcscache
    [DEBUG] Disposing the service ehcache
    [DEBUG] Disposing the service cache
    [DEBUG] All services are disposed
    [INFO] YaffiContainer has been disposed.
    Tests run: 10, Failures: 0, Errors: 0, Skipped: 0, Time elapsed: 142.201 sec

    Results :

    Failed tests:
    testObjectCount(org.apache.fulcrum.cache.JCSCacheTest)

    Tests run: 30, Failures: 1, Errors: 0, Skipped: 0

    [INFO] ------------------------------------------------------------------------
    [ERROR] BUILD FAILURE
    [INFO] ------------------------------------------------------------------------
    [INFO] There are test failures.

    Please refer to /srv/gump/public/workspace/turbine-fulcrum/cache/target/surefire-reports for the individual test results.
    [INFO] ------------------------------------------------------------------------
    [INFO] For more information, run Maven with the -e switch
    [INFO] ------------------------------------------------------------------------
    [INFO] Total time: 6 minutes 59 seconds
    [INFO] Finished at: Thu Mar 29 07:04:23 UTC 2012
    [INFO] Final Memory: 14M/35M
    [INFO] ------------------------------------------------------------------------
    ---------------------------------------------

    To subscribe to this information via syndicated feeds:
    - RSS: http://vmgump.apache.org/gump/public/turbine-fulcrum/fulcrum-cache-test/rss.xml
    - Atom: http://vmgump.apache.org/gump/public/turbine-fulcrum/fulcrum-cache-test/atom.xml

    ============================== Gump Tracking Only ===
    Produced by Apache Gump(TM) version 2.3.
    Gump Run 10000029032012, vmgump.apache.org:vmgump:10000029032012
    Gump E-mail Identifier (unique within run) #38.

    --
    Apache Gump
    http://gump.apache.org/ [Instance: vmgump]

    ---------------------------------------------------------------------
    To unsubscribe, e-mail: dev-unsubscribe@turbine.apache.org
    For additional commands, e-mail: dev-help@turbine.apache.org
  • Anonymous at Mar 30, 2012 at 6:29 am
    To whom it may engage...

    This is an automated request, but not an unsolicited one. For
    more information please visit http://gump.apache.org/nagged.html,
    and/or contact the folk at general@gump.apache.org.

    Project fulcrum-cache-test has an issue affecting its community integration.
    This issue affects 1 projects,
    and has been outstanding for 75 runs.
    The current state of this project is 'Failed', with reason 'Build Failed'.
    For reference only, the following projects are affected by this:
    - fulcrum-cache-test : Services Framework


    Full details are available at:
    http://vmgump.apache.org/gump/public/turbine-fulcrum/fulcrum-cache-test/index.html

    That said, some information snippets are provided here.

    The following annotations (debug/informational/warning/error messages) were provided:
    -WARNING- Overriding Maven settings: [/srv/gump/public/workspace/turbine-fulcrum/cache/gump_mvn_settings.xml]
    -DEBUG- (Apache Gump generated) Apache Maven Settings in: /srv/gump/public/workspace/turbine-fulcrum/cache/gump_mvn_settings.xml
    -INFO- Failed with reason build failed
    -DEBUG- Maven POM in: /srv/gump/public/workspace/turbine-fulcrum/cache/pom.xml



    The following work was performed:
    http://vmgump.apache.org/gump/public/turbine-fulcrum/fulcrum-cache-test/gump_work/build_turbine-fulcrum_fulcrum-cache-test.html
    Work Name: build_turbine-fulcrum_fulcrum-cache-test (Type: Build)
    Work ended in a state of : Failed
    Elapsed: 6 mins 55 secs
    Command Line: /opt/maven2/bin/mvn --batch-mode --settings /srv/gump/public/workspace/turbine-fulcrum/cache/gump_mvn_settings.xml test
    [Working Directory: /srv/gump/public/workspace/turbine-fulcrum/cache]
    M2_HOME: /opt/maven2
    ---------------------------------------------
    Mar 30, 2012 6:29:22 AM org.apache.jcs.engine.control.CompositeCache dispose
    INFO: In DISPOSE, [Cache_Test] fromRemote [false]
    Region Name = Cache_Test
    HitCountRam = 308
    HitCountAux = 0
    ---------------------------LRU Memory Cache
    List Size = 3
    Map Size = 3
    Put Count = 23
    Hit Count = 309
    Miss Count = 1
    [DEBUG] Disposing all services
    [DEBUG] Decommision the service jcscache
    [DEBUG] Decommisioning the service jcscache
    [DEBUG] Disposable.dispose() for jcscache
    [DEBUG] JCSCacheService stopped.
    [DEBUG] Decommision the service ehcache
    [DEBUG] Decommisioning the service ehcache
    [DEBUG] Disposable.dispose() for ehcache
    [DEBUG] EHCacheService stopped!
    [DEBUG] Decommision the service cache
    [DEBUG] Decommisioning the service cache
    [DEBUG] Disposable.dispose() for cache
    [DEBUG] Disposing the service jcscache
    [DEBUG] Disposing the service ehcache
    [DEBUG] Disposing the service cache
    [DEBUG] All services are disposed
    [INFO] YaffiContainer has been disposed.
    Tests run: 10, Failures: 0, Errors: 0, Skipped: 0, Time elapsed: 142.187 sec

    Results :

    Failed tests:
    testObjectCount(org.apache.fulcrum.cache.JCSCacheTest)

    Tests run: 30, Failures: 1, Errors: 0, Skipped: 0

    [INFO] ------------------------------------------------------------------------
    [ERROR] BUILD FAILURE
    [INFO] ------------------------------------------------------------------------
    [INFO] There are test failures.

    Please refer to /srv/gump/public/workspace/turbine-fulcrum/cache/target/surefire-reports for the individual test results.
    [INFO] ------------------------------------------------------------------------
    [INFO] For more information, run Maven with the -e switch
    [INFO] ------------------------------------------------------------------------
    [INFO] Total time: 6 minutes 54 seconds
    [INFO] Finished at: Fri Mar 30 06:29:22 UTC 2012
    [INFO] Final Memory: 14M/35M
    [INFO] ------------------------------------------------------------------------
    ---------------------------------------------

    To subscribe to this information via syndicated feeds:
    - RSS: http://vmgump.apache.org/gump/public/turbine-fulcrum/fulcrum-cache-test/rss.xml
    - Atom: http://vmgump.apache.org/gump/public/turbine-fulcrum/fulcrum-cache-test/atom.xml

    ============================== Gump Tracking Only ===
    Produced by Apache Gump(TM) version 2.3.
    Gump Run 12000030032012, vmgump.apache.org:vmgump:12000030032012
    Gump E-mail Identifier (unique within run) #46.

    --
    Apache Gump
    http://gump.apache.org/ [Instance: vmgump]

    ---------------------------------------------------------------------
    To unsubscribe, e-mail: dev-unsubscribe@turbine.apache.org
    For additional commands, e-mail: dev-help@turbine.apache.org
  • Anonymous at Mar 31, 2012 at 6:30 am
    To whom it may engage...

    This is an automated request, but not an unsolicited one. For
    more information please visit http://gump.apache.org/nagged.html,
    and/or contact the folk at general@gump.apache.org.

    Project fulcrum-cache-test has an issue affecting its community integration.
    This issue affects 1 projects,
    and has been outstanding for 77 runs.
    The current state of this project is 'Failed', with reason 'Build Failed'.
    For reference only, the following projects are affected by this:
    - fulcrum-cache-test : Services Framework


    Full details are available at:
    http://vmgump.apache.org/gump/public/turbine-fulcrum/fulcrum-cache-test/index.html

    That said, some information snippets are provided here.

    The following annotations (debug/informational/warning/error messages) were provided:
    -WARNING- Overriding Maven settings: [/srv/gump/public/workspace/turbine-fulcrum/cache/gump_mvn_settings.xml]
    -DEBUG- (Apache Gump generated) Apache Maven Settings in: /srv/gump/public/workspace/turbine-fulcrum/cache/gump_mvn_settings.xml
    -INFO- Failed with reason build failed
    -DEBUG- Maven POM in: /srv/gump/public/workspace/turbine-fulcrum/cache/pom.xml



    The following work was performed:
    http://vmgump.apache.org/gump/public/turbine-fulcrum/fulcrum-cache-test/gump_work/build_turbine-fulcrum_fulcrum-cache-test.html
    Work Name: build_turbine-fulcrum_fulcrum-cache-test (Type: Build)
    Work ended in a state of : Failed
    Elapsed: 6 mins 55 secs
    Command Line: /opt/maven2/bin/mvn --batch-mode --settings /srv/gump/public/workspace/turbine-fulcrum/cache/gump_mvn_settings.xml test
    [Working Directory: /srv/gump/public/workspace/turbine-fulcrum/cache]
    M2_HOME: /opt/maven2
    ---------------------------------------------
    INFO: In DISPOSE, [Cache_Test] fromRemote [false]
    Region Name = Cache_Test
    HitCountRam = 308
    HitCountAux = 0
    ---------------------------LRU Memory Cache
    List Size = 3
    Map Size = 3
    Put Count = 23
    Hit Count = 309
    Miss Count = 1
    [DEBUG] Disposing of container...
    [DEBUG] Disposing all services
    [DEBUG] Decommision the service jcscache
    [DEBUG] Decommisioning the service jcscache
    [DEBUG] Disposable.dispose() for jcscache
    [DEBUG] JCSCacheService stopped.
    [DEBUG] Decommision the service ehcache
    [DEBUG] Decommisioning the service ehcache
    [DEBUG] Disposable.dispose() for ehcache
    [DEBUG] EHCacheService stopped!
    [DEBUG] Decommision the service cache
    [DEBUG] Decommisioning the service cache
    [DEBUG] Disposable.dispose() for cache
    [DEBUG] Disposing the service jcscache
    [DEBUG] Disposing the service ehcache
    [DEBUG] Disposing the service cache
    [DEBUG] All services are disposed
    [INFO] YaffiContainer has been disposed.
    Tests run: 10, Failures: 0, Errors: 0, Skipped: 0, Time elapsed: 142.161 sec

    Results :

    Failed tests:
    testObjectCount(org.apache.fulcrum.cache.JCSCacheTest)

    Tests run: 30, Failures: 1, Errors: 0, Skipped: 0

    [INFO] ------------------------------------------------------------------------
    [ERROR] BUILD FAILURE
    [INFO] ------------------------------------------------------------------------
    [INFO] There are test failures.

    Please refer to /srv/gump/public/workspace/turbine-fulcrum/cache/target/surefire-reports for the individual test results.
    [INFO] ------------------------------------------------------------------------
    [INFO] For more information, run Maven with the -e switch
    [INFO] ------------------------------------------------------------------------
    [INFO] Total time: 6 minutes 54 seconds
    [INFO] Finished at: Sat Mar 31 06:29:23 UTC 2012
    [INFO] Final Memory: 14M/35M
    [INFO] ------------------------------------------------------------------------
    ---------------------------------------------

    To subscribe to this information via syndicated feeds:
    - RSS: http://vmgump.apache.org/gump/public/turbine-fulcrum/fulcrum-cache-test/rss.xml
    - Atom: http://vmgump.apache.org/gump/public/turbine-fulcrum/fulcrum-cache-test/atom.xml

    ============================== Gump Tracking Only ===
    Produced by Apache Gump(TM) version 2.3.
    Gump Run 13000031032012, vmgump.apache.org:vmgump:13000031032012
    Gump E-mail Identifier (unique within run) #37.

    --
    Apache Gump
    http://gump.apache.org/ [Instance: vmgump]

    ---------------------------------------------------------------------
    To unsubscribe, e-mail: dev-unsubscribe@turbine.apache.org
    For additional commands, e-mail: dev-help@turbine.apache.org

Related Discussions

Discussion Navigation
viewthread | post
Discussion Overview
groupdev @
categoriesturbine
postedMar 1, '12 at 6:48a
activeMar 31, '12 at 6:30a
posts31
users1
websiteturbine.apache.org

1 user in discussion

Anonymous: 31 posts

People

Translate

site design / logo © 2018 Grokbase