FAQ
To whom it may engage...

This is an automated request, but not an unsolicited one. For
more information please visit http://gump.apache.org/nagged.html,
and/or contact the folk at general@gump.apache.org.

Project fulcrum-cache-test has an issue affecting its community integration.
This issue affects 1 projects.
The current state of this project is 'Failed', with reason 'Build Failed'.
For reference only, the following projects are affected by this:
- fulcrum-cache-test : Services Framework


Full details are available at:
http://vmgump.apache.org/gump/public/turbine-fulcrum/fulcrum-cache-test/index.html

That said, some information snippets are provided here.

The following annotations (debug/informational/warning/error messages) were provided:
-WARNING- Overriding Maven settings: [/srv/gump/public/workspace/turbine-fulcrum/cache/gump_mvn_settings.xml]
-DEBUG- (Apache Gump generated) Apache Maven Settings in: /srv/gump/public/workspace/turbine-fulcrum/cache/gump_mvn_settings.xml
-INFO- Failed with reason build failed
-DEBUG- Maven POM in: /srv/gump/public/workspace/turbine-fulcrum/cache/pom.xml



The following work was performed:
http://vmgump.apache.org/gump/public/turbine-fulcrum/fulcrum-cache-test/gump_work/build_turbine-fulcrum_fulcrum-cache-test.html
Work Name: build_turbine-fulcrum_fulcrum-cache-test (Type: Build)
Work ended in a state of : Failed
Elapsed: 6 mins 55 secs
Command Line: /opt/maven2/bin/mvn --batch-mode --settings /srv/gump/public/workspace/turbine-fulcrum/cache/gump_mvn_settings.xml test
[Working Directory: /srv/gump/public/workspace/turbine-fulcrum/cache]
M2_HOME: /opt/maven2
---------------------------------------------
INFO: In DISPOSE, [Cache_Test] fromRemote [false]
Region Name = Cache_Test
HitCountRam = 308
HitCountAux = 0
---------------------------LRU Memory Cache
List Size = 3
Map Size = 3
Put Count = 23
Hit Count = 309
Miss Count = 1
[DEBUG] Disposing of container...
[DEBUG] Disposing all services
[DEBUG] Decommision the service jcscache
[DEBUG] Decommisioning the service jcscache
[DEBUG] Disposable.dispose() for jcscache
[DEBUG] JCSCacheService stopped.
[DEBUG] Decommision the service ehcache
[DEBUG] Decommisioning the service ehcache
[DEBUG] Disposable.dispose() for ehcache
[DEBUG] EHCacheService stopped!
[DEBUG] Decommision the service cache
[DEBUG] Decommisioning the service cache
[DEBUG] Disposable.dispose() for cache
[DEBUG] Disposing the service jcscache
[DEBUG] Disposing the service ehcache
[DEBUG] Disposing the service cache
[DEBUG] All services are disposed
[INFO] YaffiContainer has been disposed.
Tests run: 10, Failures: 0, Errors: 0, Skipped: 0, Time elapsed: 142.169 sec

Results :

Failed tests:
testObjectCount(org.apache.fulcrum.cache.JCSCacheTest)

Tests run: 30, Failures: 1, Errors: 0, Skipped: 0

[INFO] ------------------------------------------------------------------------
[ERROR] BUILD FAILURE
[INFO] ------------------------------------------------------------------------
[INFO] There are test failures.

Please refer to /srv/gump/public/workspace/turbine-fulcrum/cache/target/surefire-reports for the individual test results.
[INFO] ------------------------------------------------------------------------
[INFO] For more information, run Maven with the -e switch
[INFO] ------------------------------------------------------------------------
[INFO] Total time: 6 minutes 54 seconds
[INFO] Finished at: Wed Feb 22 06:12:10 UTC 2012
[INFO] Final Memory: 14M/35M
[INFO] ------------------------------------------------------------------------
---------------------------------------------

To subscribe to this information via syndicated feeds:
- RSS: http://vmgump.apache.org/gump/public/turbine-fulcrum/fulcrum-cache-test/rss.xml
- Atom: http://vmgump.apache.org/gump/public/turbine-fulcrum/fulcrum-cache-test/atom.xml

============================== Gump Tracking Only ===
Produced by Apache Gump(TM) version 2.3.
Gump Run 12000022022012, vmgump.apache.org:vmgump:12000022022012
Gump E-mail Identifier (unique within run) #45.

--
Apache Gump
http://gump.apache.org/ [Instance: vmgump]

---------------------------------------------------------------------
To unsubscribe, e-mail: dev-unsubscribe@turbine.apache.org
For additional commands, e-mail: dev-help@turbine.apache.org

Search Discussions

  • Anonymous at Feb 23, 2012 at 6:06 am
    To whom it may engage...

    This is an automated request, but not an unsolicited one. For
    more information please visit http://gump.apache.org/nagged.html,
    and/or contact the folk at general@gump.apache.org.

    Project fulcrum-cache-test has an issue affecting its community integration.
    This issue affects 1 projects,
    and has been outstanding for 3 runs.
    The current state of this project is 'Failed', with reason 'Build Failed'.
    For reference only, the following projects are affected by this:
    - fulcrum-cache-test : Services Framework


    Full details are available at:
    http://vmgump.apache.org/gump/public/turbine-fulcrum/fulcrum-cache-test/index.html

    That said, some information snippets are provided here.

    The following annotations (debug/informational/warning/error messages) were provided:
    -WARNING- Overriding Maven settings: [/srv/gump/public/workspace/turbine-fulcrum/cache/gump_mvn_settings.xml]
    -DEBUG- (Apache Gump generated) Apache Maven Settings in: /srv/gump/public/workspace/turbine-fulcrum/cache/gump_mvn_settings.xml
    -INFO- Failed with reason build failed
    -DEBUG- Maven POM in: /srv/gump/public/workspace/turbine-fulcrum/cache/pom.xml



    The following work was performed:
    http://vmgump.apache.org/gump/public/turbine-fulcrum/fulcrum-cache-test/gump_work/build_turbine-fulcrum_fulcrum-cache-test.html
    Work Name: build_turbine-fulcrum_fulcrum-cache-test (Type: Build)
    Work ended in a state of : Failed
    Elapsed: 6 mins 55 secs
    Command Line: /opt/maven2/bin/mvn --batch-mode --settings /srv/gump/public/workspace/turbine-fulcrum/cache/gump_mvn_settings.xml test
    [Working Directory: /srv/gump/public/workspace/turbine-fulcrum/cache]
    M2_HOME: /opt/maven2
    ---------------------------------------------
    INFO: In DISPOSE, [Cache_Test] fromRemote [false]
    Region Name = Cache_Test
    HitCountRam = 302
    HitCountAux = 0
    ---------------------------LRU Memory Cache
    List Size = 3
    Map Size = 3
    Put Count = 23
    Hit Count = 303
    Miss Count = 1
    [DEBUG] Disposing of container...
    [DEBUG] Disposing all services
    [DEBUG] Decommision the service jcscache
    [DEBUG] Decommisioning the service jcscache
    [DEBUG] Disposable.dispose() for jcscache
    [DEBUG] JCSCacheService stopped.
    [DEBUG] Decommision the service ehcache
    [DEBUG] Decommisioning the service ehcache
    [DEBUG] Disposable.dispose() for ehcache
    [DEBUG] EHCacheService stopped!
    [DEBUG] Decommision the service cache
    [DEBUG] Decommisioning the service cache
    [DEBUG] Disposable.dispose() for cache
    [DEBUG] Disposing the service jcscache
    [DEBUG] Disposing the service ehcache
    [DEBUG] Disposing the service cache
    [DEBUG] All services are disposed
    [INFO] YaffiContainer has been disposed.
    Tests run: 10, Failures: 0, Errors: 0, Skipped: 0, Time elapsed: 142.238 sec

    Results :

    Failed tests:
    testObjectCount(org.apache.fulcrum.cache.JCSCacheTest)

    Tests run: 30, Failures: 1, Errors: 0, Skipped: 0

    [INFO] ------------------------------------------------------------------------
    [ERROR] BUILD FAILURE
    [INFO] ------------------------------------------------------------------------
    [INFO] There are test failures.

    Please refer to /srv/gump/public/workspace/turbine-fulcrum/cache/target/surefire-reports for the individual test results.
    [INFO] ------------------------------------------------------------------------
    [INFO] For more information, run Maven with the -e switch
    [INFO] ------------------------------------------------------------------------
    [INFO] Total time: 6 minutes 54 seconds
    [INFO] Finished at: Thu Feb 23 06:06:27 UTC 2012
    [INFO] Final Memory: 14M/35M
    [INFO] ------------------------------------------------------------------------
    ---------------------------------------------

    To subscribe to this information via syndicated feeds:
    - RSS: http://vmgump.apache.org/gump/public/turbine-fulcrum/fulcrum-cache-test/rss.xml
    - Atom: http://vmgump.apache.org/gump/public/turbine-fulcrum/fulcrum-cache-test/atom.xml

    ============================== Gump Tracking Only ===
    Produced by Apache Gump(TM) version 2.3.
    Gump Run 10000023022012, vmgump.apache.org:vmgump:10000023022012
    Gump E-mail Identifier (unique within run) #44.

    --
    Apache Gump
    http://gump.apache.org/ [Instance: vmgump]

    ---------------------------------------------------------------------
    To unsubscribe, e-mail: dev-unsubscribe@turbine.apache.org
    For additional commands, e-mail: dev-help@turbine.apache.org
  • Anonymous at Feb 24, 2012 at 6:19 am
    To whom it may engage...

    This is an automated request, but not an unsolicited one. For
    more information please visit http://gump.apache.org/nagged.html,
    and/or contact the folk at general@gump.apache.org.

    Project fulcrum-cache-test has an issue affecting its community integration.
    This issue affects 1 projects,
    and has been outstanding for 5 runs.
    The current state of this project is 'Failed', with reason 'Build Failed'.
    For reference only, the following projects are affected by this:
    - fulcrum-cache-test : Services Framework


    Full details are available at:
    http://vmgump.apache.org/gump/public/turbine-fulcrum/fulcrum-cache-test/index.html

    That said, some information snippets are provided here.

    The following annotations (debug/informational/warning/error messages) were provided:
    -WARNING- Overriding Maven settings: [/srv/gump/public/workspace/turbine-fulcrum/cache/gump_mvn_settings.xml]
    -DEBUG- (Apache Gump generated) Apache Maven Settings in: /srv/gump/public/workspace/turbine-fulcrum/cache/gump_mvn_settings.xml
    -INFO- Failed with reason build failed
    -DEBUG- Maven POM in: /srv/gump/public/workspace/turbine-fulcrum/cache/pom.xml



    The following work was performed:
    http://vmgump.apache.org/gump/public/turbine-fulcrum/fulcrum-cache-test/gump_work/build_turbine-fulcrum_fulcrum-cache-test.html
    Work Name: build_turbine-fulcrum_fulcrum-cache-test (Type: Build)
    Work ended in a state of : Failed
    Elapsed: 6 mins 55 secs
    Command Line: /opt/maven2/bin/mvn --batch-mode --settings /srv/gump/public/workspace/turbine-fulcrum/cache/gump_mvn_settings.xml test
    [Working Directory: /srv/gump/public/workspace/turbine-fulcrum/cache]
    M2_HOME: /opt/maven2
    ---------------------------------------------
    [DEBUG] Disposing all services
    [DEBUG] Decommision the service jcscache
    [DEBUG] Decommisioning the service jcscache
    [DEBUG] Disposable.dispose() for jcscache
    Feb 24, 2012 6:18:49 AM org.apache.jcs.engine.control.CompositeCache dispose
    INFO: In DISPOSE, [Cache_Test] fromRemote [false]
    Region Name = Cache_Test
    HitCountRam = 308
    HitCountAux = 0
    ---------------------------LRU Memory Cache
    List Size = 3
    Map Size = 3
    Put Count = 23
    Hit Count = 309
    Miss Count = 1
    [DEBUG] JCSCacheService stopped.
    [DEBUG] Decommision the service ehcache
    [DEBUG] Decommisioning the service ehcache
    [DEBUG] Disposable.dispose() for ehcache
    [DEBUG] EHCacheService stopped!
    [DEBUG] Decommision the service cache
    [DEBUG] Decommisioning the service cache
    [DEBUG] Disposable.dispose() for cache
    [DEBUG] Disposing the service jcscache
    [DEBUG] Disposing the service ehcache
    [DEBUG] Disposing the service cache
    [DEBUG] All services are disposed
    [INFO] YaffiContainer has been disposed.
    Tests run: 10, Failures: 0, Errors: 0, Skipped: 0, Time elapsed: 142.176 sec

    Results :

    Failed tests:
    testObjectCount(org.apache.fulcrum.cache.JCSCacheTest)

    Tests run: 30, Failures: 1, Errors: 0, Skipped: 0

    [INFO] ------------------------------------------------------------------------
    [ERROR] BUILD FAILURE
    [INFO] ------------------------------------------------------------------------
    [INFO] There are test failures.

    Please refer to /srv/gump/public/workspace/turbine-fulcrum/cache/target/surefire-reports for the individual test results.
    [INFO] ------------------------------------------------------------------------
    [INFO] For more information, run Maven with the -e switch
    [INFO] ------------------------------------------------------------------------
    [INFO] Total time: 6 minutes 54 seconds
    [INFO] Finished at: Fri Feb 24 06:18:50 UTC 2012
    [INFO] Final Memory: 14M/35M
    [INFO] ------------------------------------------------------------------------
    ---------------------------------------------

    To subscribe to this information via syndicated feeds:
    - RSS: http://vmgump.apache.org/gump/public/turbine-fulcrum/fulcrum-cache-test/rss.xml
    - Atom: http://vmgump.apache.org/gump/public/turbine-fulcrum/fulcrum-cache-test/atom.xml

    ============================== Gump Tracking Only ===
    Produced by Apache Gump(TM) version 2.3.
    Gump Run 11000024022012, vmgump.apache.org:vmgump:11000024022012
    Gump E-mail Identifier (unique within run) #49.

    --
    Apache Gump
    http://gump.apache.org/ [Instance: vmgump]

    ---------------------------------------------------------------------
    To unsubscribe, e-mail: dev-unsubscribe@turbine.apache.org
    For additional commands, e-mail: dev-help@turbine.apache.org
  • Anonymous at Feb 25, 2012 at 6:26 am
    To whom it may engage...

    This is an automated request, but not an unsolicited one. For
    more information please visit http://gump.apache.org/nagged.html,
    and/or contact the folk at general@gump.apache.org.

    Project fulcrum-cache-test has an issue affecting its community integration.
    This issue affects 1 projects,
    and has been outstanding for 7 runs.
    The current state of this project is 'Failed', with reason 'Build Failed'.
    For reference only, the following projects are affected by this:
    - fulcrum-cache-test : Services Framework


    Full details are available at:
    http://vmgump.apache.org/gump/public/turbine-fulcrum/fulcrum-cache-test/index.html

    That said, some information snippets are provided here.

    The following annotations (debug/informational/warning/error messages) were provided:
    -WARNING- Overriding Maven settings: [/srv/gump/public/workspace/turbine-fulcrum/cache/gump_mvn_settings.xml]
    -DEBUG- (Apache Gump generated) Apache Maven Settings in: /srv/gump/public/workspace/turbine-fulcrum/cache/gump_mvn_settings.xml
    -INFO- Failed with reason build failed
    -DEBUG- Maven POM in: /srv/gump/public/workspace/turbine-fulcrum/cache/pom.xml



    The following work was performed:
    http://vmgump.apache.org/gump/public/turbine-fulcrum/fulcrum-cache-test/gump_work/build_turbine-fulcrum_fulcrum-cache-test.html
    Work Name: build_turbine-fulcrum_fulcrum-cache-test (Type: Build)
    Work ended in a state of : Failed
    Elapsed: 6 mins 54 secs
    Command Line: /opt/maven2/bin/mvn --batch-mode --settings /srv/gump/public/workspace/turbine-fulcrum/cache/gump_mvn_settings.xml test
    [Working Directory: /srv/gump/public/workspace/turbine-fulcrum/cache]
    M2_HOME: /opt/maven2
    ---------------------------------------------
    INFO: In DISPOSE, [Cache_Test] fromRemote [false]
    Region Name = Cache_Test
    HitCountRam = 308
    HitCountAux = 0
    ---------------------------LRU Memory Cache
    List Size = 3
    Map Size = 3
    Put Count = 23
    Hit Count = 309
    Miss Count = 1
    [DEBUG] Disposing of container...
    [DEBUG] Disposing all services
    [DEBUG] Decommision the service jcscache
    [DEBUG] Decommisioning the service jcscache
    [DEBUG] Disposable.dispose() for jcscache
    [DEBUG] JCSCacheService stopped.
    [DEBUG] Decommision the service ehcache
    [DEBUG] Decommisioning the service ehcache
    [DEBUG] Disposable.dispose() for ehcache
    [DEBUG] EHCacheService stopped!
    [DEBUG] Decommision the service cache
    [DEBUG] Decommisioning the service cache
    [DEBUG] Disposable.dispose() for cache
    [DEBUG] Disposing the service jcscache
    [DEBUG] Disposing the service ehcache
    [DEBUG] Disposing the service cache
    [DEBUG] All services are disposed
    [INFO] YaffiContainer has been disposed.
    Tests run: 10, Failures: 0, Errors: 0, Skipped: 0, Time elapsed: 142.137 sec

    Results :

    Failed tests:
    testObjectCount(org.apache.fulcrum.cache.JCSCacheTest)

    Tests run: 30, Failures: 1, Errors: 0, Skipped: 0

    [INFO] ------------------------------------------------------------------------
    [ERROR] BUILD FAILURE
    [INFO] ------------------------------------------------------------------------
    [INFO] There are test failures.

    Please refer to /srv/gump/public/workspace/turbine-fulcrum/cache/target/surefire-reports for the individual test results.
    [INFO] ------------------------------------------------------------------------
    [INFO] For more information, run Maven with the -e switch
    [INFO] ------------------------------------------------------------------------
    [INFO] Total time: 6 minutes 53 seconds
    [INFO] Finished at: Sat Feb 25 06:25:52 UTC 2012
    [INFO] Final Memory: 14M/35M
    [INFO] ------------------------------------------------------------------------
    ---------------------------------------------

    To subscribe to this information via syndicated feeds:
    - RSS: http://vmgump.apache.org/gump/public/turbine-fulcrum/fulcrum-cache-test/rss.xml
    - Atom: http://vmgump.apache.org/gump/public/turbine-fulcrum/fulcrum-cache-test/atom.xml

    ============================== Gump Tracking Only ===
    Produced by Apache Gump(TM) version 2.3.
    Gump Run 09000025022012, vmgump.apache.org:vmgump:09000025022012
    Gump E-mail Identifier (unique within run) #49.

    --
    Apache Gump
    http://gump.apache.org/ [Instance: vmgump]

    ---------------------------------------------------------------------
    To unsubscribe, e-mail: dev-unsubscribe@turbine.apache.org
    For additional commands, e-mail: dev-help@turbine.apache.org
  • Anonymous at Feb 26, 2012 at 6:26 am
    To whom it may engage...

    This is an automated request, but not an unsolicited one. For
    more information please visit http://gump.apache.org/nagged.html,
    and/or contact the folk at general@gump.apache.org.

    Project fulcrum-cache-test has an issue affecting its community integration.
    This issue affects 1 projects,
    and has been outstanding for 9 runs.
    The current state of this project is 'Failed', with reason 'Build Failed'.
    For reference only, the following projects are affected by this:
    - fulcrum-cache-test : Services Framework


    Full details are available at:
    http://vmgump.apache.org/gump/public/turbine-fulcrum/fulcrum-cache-test/index.html

    That said, some information snippets are provided here.

    The following annotations (debug/informational/warning/error messages) were provided:
    -WARNING- Overriding Maven settings: [/srv/gump/public/workspace/turbine-fulcrum/cache/gump_mvn_settings.xml]
    -DEBUG- (Apache Gump generated) Apache Maven Settings in: /srv/gump/public/workspace/turbine-fulcrum/cache/gump_mvn_settings.xml
    -INFO- Failed with reason build failed
    -DEBUG- Maven POM in: /srv/gump/public/workspace/turbine-fulcrum/cache/pom.xml



    The following work was performed:
    http://vmgump.apache.org/gump/public/turbine-fulcrum/fulcrum-cache-test/gump_work/build_turbine-fulcrum_fulcrum-cache-test.html
    Work Name: build_turbine-fulcrum_fulcrum-cache-test (Type: Build)
    Work ended in a state of : Failed
    Elapsed: 6 mins 55 secs
    Command Line: /opt/maven2/bin/mvn --batch-mode --settings /srv/gump/public/workspace/turbine-fulcrum/cache/gump_mvn_settings.xml test
    [Working Directory: /srv/gump/public/workspace/turbine-fulcrum/cache]
    M2_HOME: /opt/maven2
    ---------------------------------------------
    INFO: In DISPOSE, [Cache_Test] fromRemote [false]
    Region Name = Cache_Test
    HitCountRam = 308
    HitCountAux = 0
    ---------------------------LRU Memory Cache
    List Size = 3
    Map Size = 3
    Put Count = 23
    Hit Count = 309
    Miss Count = 1
    [DEBUG] Disposing of container...
    [DEBUG] Disposing all services
    [DEBUG] Decommision the service jcscache
    [DEBUG] Decommisioning the service jcscache
    [DEBUG] Disposable.dispose() for jcscache
    [DEBUG] JCSCacheService stopped.
    [DEBUG] Decommision the service ehcache
    [DEBUG] Decommisioning the service ehcache
    [DEBUG] Disposable.dispose() for ehcache
    [DEBUG] EHCacheService stopped!
    [DEBUG] Decommision the service cache
    [DEBUG] Decommisioning the service cache
    [DEBUG] Disposable.dispose() for cache
    [DEBUG] Disposing the service jcscache
    [DEBUG] Disposing the service ehcache
    [DEBUG] Disposing the service cache
    [DEBUG] All services are disposed
    [INFO] YaffiContainer has been disposed.
    Tests run: 10, Failures: 0, Errors: 0, Skipped: 0, Time elapsed: 142.147 sec

    Results :

    Failed tests:
    testObjectCount(org.apache.fulcrum.cache.JCSCacheTest)

    Tests run: 30, Failures: 1, Errors: 0, Skipped: 0

    [INFO] ------------------------------------------------------------------------
    [ERROR] BUILD FAILURE
    [INFO] ------------------------------------------------------------------------
    [INFO] There are test failures.

    Please refer to /srv/gump/public/workspace/turbine-fulcrum/cache/target/surefire-reports for the individual test results.
    [INFO] ------------------------------------------------------------------------
    [INFO] For more information, run Maven with the -e switch
    [INFO] ------------------------------------------------------------------------
    [INFO] Total time: 6 minutes 54 seconds
    [INFO] Finished at: Sun Feb 26 06:26:09 UTC 2012
    [INFO] Final Memory: 14M/35M
    [INFO] ------------------------------------------------------------------------
    ---------------------------------------------

    To subscribe to this information via syndicated feeds:
    - RSS: http://vmgump.apache.org/gump/public/turbine-fulcrum/fulcrum-cache-test/rss.xml
    - Atom: http://vmgump.apache.org/gump/public/turbine-fulcrum/fulcrum-cache-test/atom.xml

    ============================== Gump Tracking Only ===
    Produced by Apache Gump(TM) version 2.3.
    Gump Run 09000026022012, vmgump.apache.org:vmgump:09000026022012
    Gump E-mail Identifier (unique within run) #50.

    --
    Apache Gump
    http://gump.apache.org/ [Instance: vmgump]

    ---------------------------------------------------------------------
    To unsubscribe, e-mail: dev-unsubscribe@turbine.apache.org
    For additional commands, e-mail: dev-help@turbine.apache.org
  • Anonymous at Feb 27, 2012 at 6:32 am
    To whom it may engage...

    This is an automated request, but not an unsolicited one. For
    more information please visit http://gump.apache.org/nagged.html,
    and/or contact the folk at general@gump.apache.org.

    Project fulcrum-cache-test has an issue affecting its community integration.
    This issue affects 1 projects,
    and has been outstanding for 11 runs.
    The current state of this project is 'Failed', with reason 'Build Failed'.
    For reference only, the following projects are affected by this:
    - fulcrum-cache-test : Services Framework


    Full details are available at:
    http://vmgump.apache.org/gump/public/turbine-fulcrum/fulcrum-cache-test/index.html

    That said, some information snippets are provided here.

    The following annotations (debug/informational/warning/error messages) were provided:
    -WARNING- Overriding Maven settings: [/srv/gump/public/workspace/turbine-fulcrum/cache/gump_mvn_settings.xml]
    -DEBUG- (Apache Gump generated) Apache Maven Settings in: /srv/gump/public/workspace/turbine-fulcrum/cache/gump_mvn_settings.xml
    -INFO- Failed with reason build failed
    -DEBUG- Maven POM in: /srv/gump/public/workspace/turbine-fulcrum/cache/pom.xml



    The following work was performed:
    http://vmgump.apache.org/gump/public/turbine-fulcrum/fulcrum-cache-test/gump_work/build_turbine-fulcrum_fulcrum-cache-test.html
    Work Name: build_turbine-fulcrum_fulcrum-cache-test (Type: Build)
    Work ended in a state of : Failed
    Elapsed: 6 mins 56 secs
    Command Line: /opt/maven2/bin/mvn --batch-mode --settings /srv/gump/public/workspace/turbine-fulcrum/cache/gump_mvn_settings.xml test
    [Working Directory: /srv/gump/public/workspace/turbine-fulcrum/cache]
    M2_HOME: /opt/maven2
    ---------------------------------------------
    INFO: In DISPOSE, [Cache_Test] fromRemote [false]
    Region Name = Cache_Test
    HitCountRam = 308
    HitCountAux = 0
    ---------------------------LRU Memory Cache
    List Size = 3
    Map Size = 3
    Put Count = 23
    Hit Count = 309
    Miss Count = 1
    [DEBUG] Disposing of container...
    [DEBUG] Disposing all services
    [DEBUG] Decommision the service jcscache
    [DEBUG] Decommisioning the service jcscache
    [DEBUG] Disposable.dispose() for jcscache
    [DEBUG] JCSCacheService stopped.
    [DEBUG] Decommision the service ehcache
    [DEBUG] Decommisioning the service ehcache
    [DEBUG] Disposable.dispose() for ehcache
    [DEBUG] EHCacheService stopped!
    [DEBUG] Decommision the service cache
    [DEBUG] Decommisioning the service cache
    [DEBUG] Disposable.dispose() for cache
    [DEBUG] Disposing the service jcscache
    [DEBUG] Disposing the service ehcache
    [DEBUG] Disposing the service cache
    [DEBUG] All services are disposed
    [INFO] YaffiContainer has been disposed.
    Tests run: 10, Failures: 0, Errors: 0, Skipped: 0, Time elapsed: 142.166 sec

    Results :

    Failed tests:
    testObjectCount(org.apache.fulcrum.cache.JCSCacheTest)

    Tests run: 30, Failures: 1, Errors: 0, Skipped: 0

    [INFO] ------------------------------------------------------------------------
    [ERROR] BUILD FAILURE
    [INFO] ------------------------------------------------------------------------
    [INFO] There are test failures.

    Please refer to /srv/gump/public/workspace/turbine-fulcrum/cache/target/surefire-reports for the individual test results.
    [INFO] ------------------------------------------------------------------------
    [INFO] For more information, run Maven with the -e switch
    [INFO] ------------------------------------------------------------------------
    [INFO] Total time: 6 minutes 55 seconds
    [INFO] Finished at: Mon Feb 27 06:32:18 UTC 2012
    [INFO] Final Memory: 14M/35M
    [INFO] ------------------------------------------------------------------------
    ---------------------------------------------

    To subscribe to this information via syndicated feeds:
    - RSS: http://vmgump.apache.org/gump/public/turbine-fulcrum/fulcrum-cache-test/rss.xml
    - Atom: http://vmgump.apache.org/gump/public/turbine-fulcrum/fulcrum-cache-test/atom.xml

    ============================== Gump Tracking Only ===
    Produced by Apache Gump(TM) version 2.3.
    Gump Run 10000027022012, vmgump.apache.org:vmgump:10000027022012
    Gump E-mail Identifier (unique within run) #40.

    --
    Apache Gump
    http://gump.apache.org/ [Instance: vmgump]

    ---------------------------------------------------------------------
    To unsubscribe, e-mail: dev-unsubscribe@turbine.apache.org
    For additional commands, e-mail: dev-help@turbine.apache.org
  • Anonymous at Feb 28, 2012 at 6:29 am
    To whom it may engage...

    This is an automated request, but not an unsolicited one. For
    more information please visit http://gump.apache.org/nagged.html,
    and/or contact the folk at general@gump.apache.org.

    Project fulcrum-cache-test has an issue affecting its community integration.
    This issue affects 1 projects,
    and has been outstanding for 13 runs.
    The current state of this project is 'Failed', with reason 'Build Failed'.
    For reference only, the following projects are affected by this:
    - fulcrum-cache-test : Services Framework


    Full details are available at:
    http://vmgump.apache.org/gump/public/turbine-fulcrum/fulcrum-cache-test/index.html

    That said, some information snippets are provided here.

    The following annotations (debug/informational/warning/error messages) were provided:
    -WARNING- Overriding Maven settings: [/srv/gump/public/workspace/turbine-fulcrum/cache/gump_mvn_settings.xml]
    -DEBUG- (Apache Gump generated) Apache Maven Settings in: /srv/gump/public/workspace/turbine-fulcrum/cache/gump_mvn_settings.xml
    -INFO- Failed with reason build failed
    -DEBUG- Maven POM in: /srv/gump/public/workspace/turbine-fulcrum/cache/pom.xml



    The following work was performed:
    http://vmgump.apache.org/gump/public/turbine-fulcrum/fulcrum-cache-test/gump_work/build_turbine-fulcrum_fulcrum-cache-test.html
    Work Name: build_turbine-fulcrum_fulcrum-cache-test (Type: Build)
    Work ended in a state of : Failed
    Elapsed: 6 mins 55 secs
    Command Line: /opt/maven2/bin/mvn --batch-mode --settings /srv/gump/public/workspace/turbine-fulcrum/cache/gump_mvn_settings.xml test
    [Working Directory: /srv/gump/public/workspace/turbine-fulcrum/cache]
    M2_HOME: /opt/maven2
    ---------------------------------------------
    INFO: In DISPOSE, [Cache_Test] fromRemote [false]
    Region Name = Cache_Test
    HitCountRam = 308
    HitCountAux = 0
    ---------------------------LRU Memory Cache
    List Size = 3
    Map Size = 3
    Put Count = 23
    Hit Count = 309
    Miss Count = 1
    [DEBUG] Disposing of container...
    [DEBUG] Disposing all services
    [DEBUG] Decommision the service jcscache
    [DEBUG] Decommisioning the service jcscache
    [DEBUG] Disposable.dispose() for jcscache
    [DEBUG] JCSCacheService stopped.
    [DEBUG] Decommision the service ehcache
    [DEBUG] Decommisioning the service ehcache
    [DEBUG] Disposable.dispose() for ehcache
    [DEBUG] EHCacheService stopped!
    [DEBUG] Decommision the service cache
    [DEBUG] Decommisioning the service cache
    [DEBUG] Disposable.dispose() for cache
    [DEBUG] Disposing the service jcscache
    [DEBUG] Disposing the service ehcache
    [DEBUG] Disposing the service cache
    [DEBUG] All services are disposed
    [INFO] YaffiContainer has been disposed.
    Tests run: 10, Failures: 0, Errors: 0, Skipped: 0, Time elapsed: 142.162 sec

    Results :

    Failed tests:
    testObjectCount(org.apache.fulcrum.cache.JCSCacheTest)

    Tests run: 30, Failures: 1, Errors: 0, Skipped: 0

    [INFO] ------------------------------------------------------------------------
    [ERROR] BUILD FAILURE
    [INFO] ------------------------------------------------------------------------
    [INFO] There are test failures.

    Please refer to /srv/gump/public/workspace/turbine-fulcrum/cache/target/surefire-reports for the individual test results.
    [INFO] ------------------------------------------------------------------------
    [INFO] For more information, run Maven with the -e switch
    [INFO] ------------------------------------------------------------------------
    [INFO] Total time: 6 minutes 54 seconds
    [INFO] Finished at: Tue Feb 28 06:28:32 UTC 2012
    [INFO] Final Memory: 14M/35M
    [INFO] ------------------------------------------------------------------------
    ---------------------------------------------

    To subscribe to this information via syndicated feeds:
    - RSS: http://vmgump.apache.org/gump/public/turbine-fulcrum/fulcrum-cache-test/rss.xml
    - Atom: http://vmgump.apache.org/gump/public/turbine-fulcrum/fulcrum-cache-test/atom.xml

    ============================== Gump Tracking Only ===
    Produced by Apache Gump(TM) version 2.3.
    Gump Run 10000028022012, vmgump.apache.org:vmgump:10000028022012
    Gump E-mail Identifier (unique within run) #42.

    --
    Apache Gump
    http://gump.apache.org/ [Instance: vmgump]

    ---------------------------------------------------------------------
    To unsubscribe, e-mail: dev-unsubscribe@turbine.apache.org
    For additional commands, e-mail: dev-help@turbine.apache.org
  • Anonymous at Feb 29, 2012 at 6:44 am
    To whom it may engage...

    This is an automated request, but not an unsolicited one. For
    more information please visit http://gump.apache.org/nagged.html,
    and/or contact the folk at general@gump.apache.org.

    Project fulcrum-cache-test has an issue affecting its community integration.
    This issue affects 1 projects,
    and has been outstanding for 15 runs.
    The current state of this project is 'Failed', with reason 'Build Failed'.
    For reference only, the following projects are affected by this:
    - fulcrum-cache-test : Services Framework


    Full details are available at:
    http://vmgump.apache.org/gump/public/turbine-fulcrum/fulcrum-cache-test/index.html

    That said, some information snippets are provided here.

    The following annotations (debug/informational/warning/error messages) were provided:
    -WARNING- Overriding Maven settings: [/srv/gump/public/workspace/turbine-fulcrum/cache/gump_mvn_settings.xml]
    -DEBUG- (Apache Gump generated) Apache Maven Settings in: /srv/gump/public/workspace/turbine-fulcrum/cache/gump_mvn_settings.xml
    -INFO- Failed with reason build failed
    -DEBUG- Maven POM in: /srv/gump/public/workspace/turbine-fulcrum/cache/pom.xml



    The following work was performed:
    http://vmgump.apache.org/gump/public/turbine-fulcrum/fulcrum-cache-test/gump_work/build_turbine-fulcrum_fulcrum-cache-test.html
    Work Name: build_turbine-fulcrum_fulcrum-cache-test (Type: Build)
    Work ended in a state of : Failed
    Elapsed: 6 mins 56 secs
    Command Line: /opt/maven2/bin/mvn --batch-mode --settings /srv/gump/public/workspace/turbine-fulcrum/cache/gump_mvn_settings.xml test
    [Working Directory: /srv/gump/public/workspace/turbine-fulcrum/cache]
    M2_HOME: /opt/maven2
    ---------------------------------------------
    INFO: In DISPOSE, [Cache_Test] fromRemote [false]
    Region Name = Cache_Test
    HitCountRam = 308
    HitCountAux = 0
    ---------------------------LRU Memory Cache
    List Size = 3
    Map Size = 3
    Put Count = 23
    Hit Count = 309
    Miss Count = 1
    [DEBUG] Disposing of container...
    [DEBUG] Disposing all services
    [DEBUG] Decommision the service jcscache
    [DEBUG] Decommisioning the service jcscache
    [DEBUG] Disposable.dispose() for jcscache
    [DEBUG] JCSCacheService stopped.
    [DEBUG] Decommision the service ehcache
    [DEBUG] Decommisioning the service ehcache
    [DEBUG] Disposable.dispose() for ehcache
    [DEBUG] EHCacheService stopped!
    [DEBUG] Decommision the service cache
    [DEBUG] Decommisioning the service cache
    [DEBUG] Disposable.dispose() for cache
    [DEBUG] Disposing the service jcscache
    [DEBUG] Disposing the service ehcache
    [DEBUG] Disposing the service cache
    [DEBUG] All services are disposed
    [INFO] YaffiContainer has been disposed.
    Tests run: 10, Failures: 0, Errors: 0, Skipped: 0, Time elapsed: 142.19 sec

    Results :

    Failed tests:
    testObjectCount(org.apache.fulcrum.cache.JCSCacheTest)

    Tests run: 30, Failures: 1, Errors: 0, Skipped: 0

    [INFO] ------------------------------------------------------------------------
    [ERROR] BUILD FAILURE
    [INFO] ------------------------------------------------------------------------
    [INFO] There are test failures.

    Please refer to /srv/gump/public/workspace/turbine-fulcrum/cache/target/surefire-reports for the individual test results.
    [INFO] ------------------------------------------------------------------------
    [INFO] For more information, run Maven with the -e switch
    [INFO] ------------------------------------------------------------------------
    [INFO] Total time: 6 minutes 55 seconds
    [INFO] Finished at: Wed Feb 29 06:44:20 UTC 2012
    [INFO] Final Memory: 14M/35M
    [INFO] ------------------------------------------------------------------------
    ---------------------------------------------

    To subscribe to this information via syndicated feeds:
    - RSS: http://vmgump.apache.org/gump/public/turbine-fulcrum/fulcrum-cache-test/rss.xml
    - Atom: http://vmgump.apache.org/gump/public/turbine-fulcrum/fulcrum-cache-test/atom.xml

    ============================== Gump Tracking Only ===
    Produced by Apache Gump(TM) version 2.3.
    Gump Run 10000029022012, vmgump.apache.org:vmgump:10000029022012
    Gump E-mail Identifier (unique within run) #38.

    --
    Apache Gump
    http://gump.apache.org/ [Instance: vmgump]

    ---------------------------------------------------------------------
    To unsubscribe, e-mail: dev-unsubscribe@turbine.apache.org
    For additional commands, e-mail: dev-help@turbine.apache.org

Related Discussions

Discussion Navigation
viewthread | post
Discussion Overview
groupdev @
categoriesturbine
postedFeb 22, '12 at 6:12a
activeFeb 29, '12 at 6:44a
posts8
users1
websiteturbine.apache.org

1 user in discussion

Anonymous: 8 posts

People

Translate

site design / logo © 2018 Grokbase