Grokbase Groups Turbine dev May 2011
FAQ
To whom it may engage...

This is an automated request, but not an unsolicited one. For
more information please visit http://gump.apache.org/nagged.html,
and/or contact the folk at general@gump.apache.org.

Project turbine-core has an issue affecting its community integration.
This issue affects 2 projects,
and has been outstanding for 122 runs.
The current state of this project is 'Failed', with reason 'Build Failed'.
For reference only, the following projects are affected by this:
- turbine-core : A servlet based framework.
- turbine-core-test : A servlet based framework.


Full details are available at:
http://vmgump.apache.org/gump/public/turbine-core/turbine-core/index.html

That said, some information snippets are provided here.

The following annotations (debug/informational/warning/error messages) were provided:
-INFO- Optional dependency dom4j prerequisite failed with reason build timed out
-INFO- Optional dependency commons-fileupload prerequisite failed with reason build failed
-INFO- Optional dependency httpunit failed with reason build failed
-DEBUG- (Apache Gump generated) Apache Maven Settings in: /srv/gump/public/workspace/turbine-core/gump_mvn_settings.xml
-INFO- Failed with reason build failed
-DEBUG- Maven POM in: /srv/gump/public/workspace/turbine-core/pom.xml
-INFO- Failed to extract fallback artifacts from Gump Repository



The following work was performed:
http://vmgump.apache.org/gump/public/turbine-core/turbine-core/gump_work/build_turbine-core_turbine-core.html
Work Name: build_turbine-core_turbine-core (Type: Build)
Work ended in a state of : Failed
Elapsed: 37 secs
Command Line: /opt/maven2/bin/mvn --batch-mode -DskipTests=true --settings /srv/gump/public/workspace/turbine-core/gump_mvn_settings.xml package
[Working Directory: /srv/gump/public/workspace/turbine-core]
M2_HOME: /opt/maven2
---------------------------------------------
urls[19] = file:/srv/gump/public/workspace/mvnlocalrepo/shared/xml-apis/xml-apis/1.0.b2/xml-apis-1.0.b2.jar
urls[20] = file:/srv/gump/public/workspace/mvnlocalrepo/shared/commons-configuration/commons-configuration/1.4/commons-configuration-1.4.jar
urls[21] = file:/srv/gump/public/workspace/mvnlocalrepo/shared/commons-logging/commons-logging-api/1.0.4/commons-logging-api-1.0.4.jar
urls[22] = file:/srv/gump/public/workspace/mvnlocalrepo/shared/commons-digester/commons-digester/1.8/commons-digester-1.8.jar
urls[23] = file:/srv/gump/public/workspace/mvnlocalrepo/shared/commons-beanutils/commons-beanutils/1.7.0/commons-beanutils-1.7.0.jar
urls[24] = file:/srv/gump/public/workspace/mvnlocalrepo/shared/commons-beanutils/commons-beanutils-core/1.7.0/commons-beanutils-core-1.7.0.jar
urls[25] = file:/srv/gump/public/workspace/mvnlocalrepo/shared/commons-codec/commons-codec/1.3/commons-codec-1.3.jar
urls[26] = file:/srv/gump/public/workspace/mvnlocalrepo/shared/commons-jxpath/commons-jxpath/1.2/commons-jxpath-1.2.jar
urls[27] = file:/srv/gump/public/workspace/mvnlocalrepo/shared/xerces/xerces/1.2.3/xerces-1.2.3.jar
urls[28] = file:/srv/gump/public/workspace/mvnlocalrepo/shared/ant/ant-optional/1.5.1/ant-optional-1.5.1.jar
urls[29] = file:/srv/gump/public/workspace/mvnlocalrepo/shared/jdom/jdom/b9/jdom-b9.jar
Number of imports: 10
import: org.codehaus.classworlds.Entry@a6c57a42
import: org.codehaus.classworlds.Entry@12f43f3b
import: org.codehaus.classworlds.Entry@20025374
import: org.codehaus.classworlds.Entry@f8e44ca4
import: org.codehaus.classworlds.Entry@92758522
import: org.codehaus.classworlds.Entry@ebf2705b
import: org.codehaus.classworlds.Entry@bb25e54
import: org.codehaus.classworlds.Entry@bece5185
import: org.codehaus.classworlds.Entry@3fee8e37
import: org.codehaus.classworlds.Entry@3fee19d8


this realm = plexus.core
urls[0] = file:/opt/maven2/lib/maven-2.2.1-uber.jar
Number of imports: 10
import: org.codehaus.classworlds.Entry@a6c57a42
import: org.codehaus.classworlds.Entry@12f43f3b
import: org.codehaus.classworlds.Entry@20025374
import: org.codehaus.classworlds.Entry@f8e44ca4
import: org.codehaus.classworlds.Entry@92758522
import: org.codehaus.classworlds.Entry@ebf2705b
import: org.codehaus.classworlds.Entry@bb25e54
import: org.codehaus.classworlds.Entry@bece5185
import: org.codehaus.classworlds.Entry@3fee8e37
import: org.codehaus.classworlds.Entry@3fee19d8
-----------------------------------------------------
[INFO] ------------------------------------------------------------------------
[ERROR] BUILD ERROR
[INFO] ------------------------------------------------------------------------
[INFO] Internal error in the plugin manager executing goal 'org.apache.torque:torque-maven-plugin:3.3:om': Unable to load the mojo 'org.apache.torque:torque-maven-plugin:3.3:om' in the plugin 'org.apache.torque:torque-maven-plugin'. A required class is missing: org/apache/torque/task/TorqueDataModelTask
org.apache.torque.task.TorqueDataModelTask
[INFO] ------------------------------------------------------------------------
[INFO] For more information, run Maven with the -e switch
[INFO] ------------------------------------------------------------------------
[INFO] Total time: 36 seconds
[INFO] Finished at: Sun May 01 07:30:49 UTC 2011
[INFO] Final Memory: 30M/72M
[INFO] ------------------------------------------------------------------------
---------------------------------------------

To subscribe to this information via syndicated feeds:
- RSS: http://vmgump.apache.org/gump/public/turbine-core/turbine-core/rss.xml
- Atom: http://vmgump.apache.org/gump/public/turbine-core/turbine-core/atom.xml

============================== Gump Tracking Only ===
Produced by Apache Gump(TM) version 2.3.
Gump Run 08000001052011, vmgump.apache.org:vmgump:08000001052011
Gump E-mail Identifier (unique within run) #28.

--
Apache Gump
http://gump.apache.org/ [Instance: vmgump]

---------------------------------------------------------------------
To unsubscribe, e-mail: dev-unsubscribe@turbine.apache.org
For additional commands, e-mail: dev-help@turbine.apache.org

Search Discussions

  • Anonymous at May 2, 2011 at 6:33 am
    To whom it may engage...

    This is an automated request, but not an unsolicited one. For
    more information please visit http://gump.apache.org/nagged.html,
    and/or contact the folk at general@gump.apache.org.

    Project turbine-core has an issue affecting its community integration.
    This issue affects 2 projects,
    and has been outstanding for 124 runs.
    The current state of this project is 'Failed', with reason 'Build Failed'.
    For reference only, the following projects are affected by this:
    - turbine-core : A servlet based framework.
    - turbine-core-test : A servlet based framework.


    Full details are available at:
    http://vmgump.apache.org/gump/public/turbine-core/turbine-core/index.html

    That said, some information snippets are provided here.

    The following annotations (debug/informational/warning/error messages) were provided:
    -INFO- Optional dependency commons-fileupload prerequisite failed with reason build failed
    -INFO- Optional dependency httpunit failed with reason build failed
    -DEBUG- (Apache Gump generated) Apache Maven Settings in: /srv/gump/public/workspace/turbine-core/gump_mvn_settings.xml
    -INFO- Failed with reason build failed
    -DEBUG- Maven POM in: /srv/gump/public/workspace/turbine-core/pom.xml
    -INFO- Failed to extract fallback artifacts from Gump Repository



    The following work was performed:
    http://vmgump.apache.org/gump/public/turbine-core/turbine-core/gump_work/build_turbine-core_turbine-core.html
    Work Name: build_turbine-core_turbine-core (Type: Build)
    Work ended in a state of : Failed
    Elapsed: 37 secs
    Command Line: /opt/maven2/bin/mvn --batch-mode -DskipTests=true --settings /srv/gump/public/workspace/turbine-core/gump_mvn_settings.xml package
    [Working Directory: /srv/gump/public/workspace/turbine-core]
    M2_HOME: /opt/maven2
    ---------------------------------------------
    urls[19] = file:/srv/gump/public/workspace/mvnlocalrepo/shared/xml-apis/xml-apis/1.0.b2/xml-apis-1.0.b2.jar
    urls[20] = file:/srv/gump/public/workspace/mvnlocalrepo/shared/commons-configuration/commons-configuration/1.4/commons-configuration-1.4.jar
    urls[21] = file:/srv/gump/public/workspace/mvnlocalrepo/shared/commons-logging/commons-logging-api/1.0.4/commons-logging-api-1.0.4.jar
    urls[22] = file:/srv/gump/public/workspace/mvnlocalrepo/shared/commons-digester/commons-digester/1.8/commons-digester-1.8.jar
    urls[23] = file:/srv/gump/public/workspace/mvnlocalrepo/shared/commons-beanutils/commons-beanutils/1.7.0/commons-beanutils-1.7.0.jar
    urls[24] = file:/srv/gump/public/workspace/mvnlocalrepo/shared/commons-beanutils/commons-beanutils-core/1.7.0/commons-beanutils-core-1.7.0.jar
    urls[25] = file:/srv/gump/public/workspace/mvnlocalrepo/shared/commons-codec/commons-codec/1.3/commons-codec-1.3.jar
    urls[26] = file:/srv/gump/public/workspace/mvnlocalrepo/shared/commons-jxpath/commons-jxpath/1.2/commons-jxpath-1.2.jar
    urls[27] = file:/srv/gump/public/workspace/mvnlocalrepo/shared/xerces/xerces/1.2.3/xerces-1.2.3.jar
    urls[28] = file:/srv/gump/public/workspace/mvnlocalrepo/shared/ant/ant-optional/1.5.1/ant-optional-1.5.1.jar
    urls[29] = file:/srv/gump/public/workspace/mvnlocalrepo/shared/jdom/jdom/b9/jdom-b9.jar
    Number of imports: 10
    import: org.codehaus.classworlds.Entry@a6c57a42
    import: org.codehaus.classworlds.Entry@12f43f3b
    import: org.codehaus.classworlds.Entry@20025374
    import: org.codehaus.classworlds.Entry@f8e44ca4
    import: org.codehaus.classworlds.Entry@92758522
    import: org.codehaus.classworlds.Entry@ebf2705b
    import: org.codehaus.classworlds.Entry@bb25e54
    import: org.codehaus.classworlds.Entry@bece5185
    import: org.codehaus.classworlds.Entry@3fee8e37
    import: org.codehaus.classworlds.Entry@3fee19d8


    this realm = plexus.core
    urls[0] = file:/opt/maven2/lib/maven-2.2.1-uber.jar
    Number of imports: 10
    import: org.codehaus.classworlds.Entry@a6c57a42
    import: org.codehaus.classworlds.Entry@12f43f3b
    import: org.codehaus.classworlds.Entry@20025374
    import: org.codehaus.classworlds.Entry@f8e44ca4
    import: org.codehaus.classworlds.Entry@92758522
    import: org.codehaus.classworlds.Entry@ebf2705b
    import: org.codehaus.classworlds.Entry@bb25e54
    import: org.codehaus.classworlds.Entry@bece5185
    import: org.codehaus.classworlds.Entry@3fee8e37
    import: org.codehaus.classworlds.Entry@3fee19d8
    -----------------------------------------------------
    [INFO] ------------------------------------------------------------------------
    [ERROR] BUILD ERROR
    [INFO] ------------------------------------------------------------------------
    [INFO] Internal error in the plugin manager executing goal 'org.apache.torque:torque-maven-plugin:3.3:om': Unable to load the mojo 'org.apache.torque:torque-maven-plugin:3.3:om' in the plugin 'org.apache.torque:torque-maven-plugin'. A required class is missing: org/apache/torque/task/TorqueDataModelTask
    org.apache.torque.task.TorqueDataModelTask
    [INFO] ------------------------------------------------------------------------
    [INFO] For more information, run Maven with the -e switch
    [INFO] ------------------------------------------------------------------------
    [INFO] Total time: 36 seconds
    [INFO] Finished at: Mon May 02 06:33:14 UTC 2011
    [INFO] Final Memory: 30M/72M
    [INFO] ------------------------------------------------------------------------
    ---------------------------------------------

    To subscribe to this information via syndicated feeds:
    - RSS: http://vmgump.apache.org/gump/public/turbine-core/turbine-core/rss.xml
    - Atom: http://vmgump.apache.org/gump/public/turbine-core/turbine-core/atom.xml

    ============================== Gump Tracking Only ===
    Produced by Apache Gump(TM) version 2.3.
    Gump Run 09000002052011, vmgump.apache.org:vmgump:09000002052011
    Gump E-mail Identifier (unique within run) #28.

    --
    Apache Gump
    http://gump.apache.org/ [Instance: vmgump]

    ---------------------------------------------------------------------
    To unsubscribe, e-mail: dev-unsubscribe@turbine.apache.org
    For additional commands, e-mail: dev-help@turbine.apache.org
  • Anonymous at May 3, 2011 at 7:08 am
    To whom it may engage...

    This is an automated request, but not an unsolicited one. For
    more information please visit http://gump.apache.org/nagged.html,
    and/or contact the folk at general@gump.apache.org.

    Project turbine-core has an issue affecting its community integration.
    This issue affects 2 projects,
    and has been outstanding for 126 runs.
    The current state of this project is 'Failed', with reason 'Build Failed'.
    For reference only, the following projects are affected by this:
    - turbine-core : A servlet based framework.
    - turbine-core-test : A servlet based framework.


    Full details are available at:
    http://vmgump.apache.org/gump/public/turbine-core/turbine-core/index.html

    That said, some information snippets are provided here.

    The following annotations (debug/informational/warning/error messages) were provided:
    -INFO- Optional dependency commons-fileupload prerequisite failed with reason build failed
    -INFO- Optional dependency httpunit failed with reason build failed
    -DEBUG- (Apache Gump generated) Apache Maven Settings in: /srv/gump/public/workspace/turbine-core/gump_mvn_settings.xml
    -INFO- Failed with reason build failed
    -DEBUG- Maven POM in: /srv/gump/public/workspace/turbine-core/pom.xml
    -INFO- Failed to extract fallback artifacts from Gump Repository



    The following work was performed:
    http://vmgump.apache.org/gump/public/turbine-core/turbine-core/gump_work/build_turbine-core_turbine-core.html
    Work Name: build_turbine-core_turbine-core (Type: Build)
    Work ended in a state of : Failed
    Elapsed: 39 secs
    Command Line: /opt/maven2/bin/mvn --batch-mode -DskipTests=true --settings /srv/gump/public/workspace/turbine-core/gump_mvn_settings.xml package
    [Working Directory: /srv/gump/public/workspace/turbine-core]
    M2_HOME: /opt/maven2
    ---------------------------------------------
    urls[19] = file:/srv/gump/public/workspace/mvnlocalrepo/shared/xml-apis/xml-apis/1.0.b2/xml-apis-1.0.b2.jar
    urls[20] = file:/srv/gump/public/workspace/mvnlocalrepo/shared/commons-configuration/commons-configuration/1.4/commons-configuration-1.4.jar
    urls[21] = file:/srv/gump/public/workspace/mvnlocalrepo/shared/commons-logging/commons-logging-api/1.0.4/commons-logging-api-1.0.4.jar
    urls[22] = file:/srv/gump/public/workspace/mvnlocalrepo/shared/commons-digester/commons-digester/1.8/commons-digester-1.8.jar
    urls[23] = file:/srv/gump/public/workspace/mvnlocalrepo/shared/commons-beanutils/commons-beanutils/1.7.0/commons-beanutils-1.7.0.jar
    urls[24] = file:/srv/gump/public/workspace/mvnlocalrepo/shared/commons-beanutils/commons-beanutils-core/1.7.0/commons-beanutils-core-1.7.0.jar
    urls[25] = file:/srv/gump/public/workspace/mvnlocalrepo/shared/commons-codec/commons-codec/1.3/commons-codec-1.3.jar
    urls[26] = file:/srv/gump/public/workspace/mvnlocalrepo/shared/commons-jxpath/commons-jxpath/1.2/commons-jxpath-1.2.jar
    urls[27] = file:/srv/gump/public/workspace/mvnlocalrepo/shared/xerces/xerces/1.2.3/xerces-1.2.3.jar
    urls[28] = file:/srv/gump/public/workspace/mvnlocalrepo/shared/ant/ant-optional/1.5.1/ant-optional-1.5.1.jar
    urls[29] = file:/srv/gump/public/workspace/mvnlocalrepo/shared/jdom/jdom/b9/jdom-b9.jar
    Number of imports: 10
    import: org.codehaus.classworlds.Entry@a6c57a42
    import: org.codehaus.classworlds.Entry@12f43f3b
    import: org.codehaus.classworlds.Entry@20025374
    import: org.codehaus.classworlds.Entry@f8e44ca4
    import: org.codehaus.classworlds.Entry@92758522
    import: org.codehaus.classworlds.Entry@ebf2705b
    import: org.codehaus.classworlds.Entry@bb25e54
    import: org.codehaus.classworlds.Entry@bece5185
    import: org.codehaus.classworlds.Entry@3fee8e37
    import: org.codehaus.classworlds.Entry@3fee19d8


    this realm = plexus.core
    urls[0] = file:/opt/maven2/lib/maven-2.2.1-uber.jar
    Number of imports: 10
    import: org.codehaus.classworlds.Entry@a6c57a42
    import: org.codehaus.classworlds.Entry@12f43f3b
    import: org.codehaus.classworlds.Entry@20025374
    import: org.codehaus.classworlds.Entry@f8e44ca4
    import: org.codehaus.classworlds.Entry@92758522
    import: org.codehaus.classworlds.Entry@ebf2705b
    import: org.codehaus.classworlds.Entry@bb25e54
    import: org.codehaus.classworlds.Entry@bece5185
    import: org.codehaus.classworlds.Entry@3fee8e37
    import: org.codehaus.classworlds.Entry@3fee19d8
    -----------------------------------------------------
    [INFO] ------------------------------------------------------------------------
    [ERROR] BUILD ERROR
    [INFO] ------------------------------------------------------------------------
    [INFO] Internal error in the plugin manager executing goal 'org.apache.torque:torque-maven-plugin:3.3:om': Unable to load the mojo 'org.apache.torque:torque-maven-plugin:3.3:om' in the plugin 'org.apache.torque:torque-maven-plugin'. A required class is missing: org/apache/torque/task/TorqueDataModelTask
    org.apache.torque.task.TorqueDataModelTask
    [INFO] ------------------------------------------------------------------------
    [INFO] For more information, run Maven with the -e switch
    [INFO] ------------------------------------------------------------------------
    [INFO] Total time: 38 seconds
    [INFO] Finished at: Tue May 03 07:08:15 UTC 2011
    [INFO] Final Memory: 30M/72M
    [INFO] ------------------------------------------------------------------------
    ---------------------------------------------

    To subscribe to this information via syndicated feeds:
    - RSS: http://vmgump.apache.org/gump/public/turbine-core/turbine-core/rss.xml
    - Atom: http://vmgump.apache.org/gump/public/turbine-core/turbine-core/atom.xml

    ============================== Gump Tracking Only ===
    Produced by Apache Gump(TM) version 2.3.
    Gump Run 10000003052011, vmgump.apache.org:vmgump:10000003052011
    Gump E-mail Identifier (unique within run) #29.

    --
    Apache Gump
    http://gump.apache.org/ [Instance: vmgump]

    ---------------------------------------------------------------------
    To unsubscribe, e-mail: dev-unsubscribe@turbine.apache.org
    For additional commands, e-mail: dev-help@turbine.apache.org
  • Anonymous at May 4, 2011 at 6:37 am
    To whom it may engage...

    This is an automated request, but not an unsolicited one. For
    more information please visit http://gump.apache.org/nagged.html,
    and/or contact the folk at general@gump.apache.org.

    Project turbine-core has an issue affecting its community integration.
    This issue affects 2 projects,
    and has been outstanding for 128 runs.
    The current state of this project is 'Failed', with reason 'Build Failed'.
    For reference only, the following projects are affected by this:
    - turbine-core : A servlet based framework.
    - turbine-core-test : A servlet based framework.


    Full details are available at:
    http://vmgump.apache.org/gump/public/turbine-core/turbine-core/index.html

    That said, some information snippets are provided here.

    The following annotations (debug/informational/warning/error messages) were provided:
    -INFO- Optional dependency commons-fileupload prerequisite failed with reason build failed
    -INFO- Optional dependency httpunit failed with reason build failed
    -DEBUG- (Apache Gump generated) Apache Maven Settings in: /srv/gump/public/workspace/turbine-core/gump_mvn_settings.xml
    -INFO- Failed with reason build failed
    -DEBUG- Maven POM in: /srv/gump/public/workspace/turbine-core/pom.xml
    -INFO- Failed to extract fallback artifacts from Gump Repository



    The following work was performed:
    http://vmgump.apache.org/gump/public/turbine-core/turbine-core/gump_work/build_turbine-core_turbine-core.html
    Work Name: build_turbine-core_turbine-core (Type: Build)
    Work ended in a state of : Failed
    Elapsed: 40 secs
    Command Line: /opt/maven2/bin/mvn --batch-mode -DskipTests=true --settings /srv/gump/public/workspace/turbine-core/gump_mvn_settings.xml package
    [Working Directory: /srv/gump/public/workspace/turbine-core]
    M2_HOME: /opt/maven2
    ---------------------------------------------
    urls[19] = file:/srv/gump/public/workspace/mvnlocalrepo/shared/xml-apis/xml-apis/1.0.b2/xml-apis-1.0.b2.jar
    urls[20] = file:/srv/gump/public/workspace/mvnlocalrepo/shared/commons-configuration/commons-configuration/1.4/commons-configuration-1.4.jar
    urls[21] = file:/srv/gump/public/workspace/mvnlocalrepo/shared/commons-logging/commons-logging-api/1.0.4/commons-logging-api-1.0.4.jar
    urls[22] = file:/srv/gump/public/workspace/mvnlocalrepo/shared/commons-digester/commons-digester/1.8/commons-digester-1.8.jar
    urls[23] = file:/srv/gump/public/workspace/mvnlocalrepo/shared/commons-beanutils/commons-beanutils/1.7.0/commons-beanutils-1.7.0.jar
    urls[24] = file:/srv/gump/public/workspace/mvnlocalrepo/shared/commons-beanutils/commons-beanutils-core/1.7.0/commons-beanutils-core-1.7.0.jar
    urls[25] = file:/srv/gump/public/workspace/mvnlocalrepo/shared/commons-codec/commons-codec/1.3/commons-codec-1.3.jar
    urls[26] = file:/srv/gump/public/workspace/mvnlocalrepo/shared/commons-jxpath/commons-jxpath/1.2/commons-jxpath-1.2.jar
    urls[27] = file:/srv/gump/public/workspace/mvnlocalrepo/shared/xerces/xerces/1.2.3/xerces-1.2.3.jar
    urls[28] = file:/srv/gump/public/workspace/mvnlocalrepo/shared/ant/ant-optional/1.5.1/ant-optional-1.5.1.jar
    urls[29] = file:/srv/gump/public/workspace/mvnlocalrepo/shared/jdom/jdom/b9/jdom-b9.jar
    Number of imports: 10
    import: org.codehaus.classworlds.Entry@a6c57a42
    import: org.codehaus.classworlds.Entry@12f43f3b
    import: org.codehaus.classworlds.Entry@20025374
    import: org.codehaus.classworlds.Entry@f8e44ca4
    import: org.codehaus.classworlds.Entry@92758522
    import: org.codehaus.classworlds.Entry@ebf2705b
    import: org.codehaus.classworlds.Entry@bb25e54
    import: org.codehaus.classworlds.Entry@bece5185
    import: org.codehaus.classworlds.Entry@3fee8e37
    import: org.codehaus.classworlds.Entry@3fee19d8


    this realm = plexus.core
    urls[0] = file:/opt/maven2/lib/maven-2.2.1-uber.jar
    Number of imports: 10
    import: org.codehaus.classworlds.Entry@a6c57a42
    import: org.codehaus.classworlds.Entry@12f43f3b
    import: org.codehaus.classworlds.Entry@20025374
    import: org.codehaus.classworlds.Entry@f8e44ca4
    import: org.codehaus.classworlds.Entry@92758522
    import: org.codehaus.classworlds.Entry@ebf2705b
    import: org.codehaus.classworlds.Entry@bb25e54
    import: org.codehaus.classworlds.Entry@bece5185
    import: org.codehaus.classworlds.Entry@3fee8e37
    import: org.codehaus.classworlds.Entry@3fee19d8
    -----------------------------------------------------
    [INFO] ------------------------------------------------------------------------
    [ERROR] BUILD ERROR
    [INFO] ------------------------------------------------------------------------
    [INFO] Internal error in the plugin manager executing goal 'org.apache.torque:torque-maven-plugin:3.3:om': Unable to load the mojo 'org.apache.torque:torque-maven-plugin:3.3:om' in the plugin 'org.apache.torque:torque-maven-plugin'. A required class is missing: org/apache/torque/task/TorqueDataModelTask
    org.apache.torque.task.TorqueDataModelTask
    [INFO] ------------------------------------------------------------------------
    [INFO] For more information, run Maven with the -e switch
    [INFO] ------------------------------------------------------------------------
    [INFO] Total time: 39 seconds
    [INFO] Finished at: Wed May 04 06:37:00 UTC 2011
    [INFO] Final Memory: 30M/72M
    [INFO] ------------------------------------------------------------------------
    ---------------------------------------------

    To subscribe to this information via syndicated feeds:
    - RSS: http://vmgump.apache.org/gump/public/turbine-core/turbine-core/rss.xml
    - Atom: http://vmgump.apache.org/gump/public/turbine-core/turbine-core/atom.xml

    ============================== Gump Tracking Only ===
    Produced by Apache Gump(TM) version 2.3.
    Gump Run 10000004052011, vmgump.apache.org:vmgump:10000004052011
    Gump E-mail Identifier (unique within run) #28.

    --
    Apache Gump
    http://gump.apache.org/ [Instance: vmgump]

    ---------------------------------------------------------------------
    To unsubscribe, e-mail: dev-unsubscribe@turbine.apache.org
    For additional commands, e-mail: dev-help@turbine.apache.org
  • Anonymous at May 5, 2011 at 7:10 am
    To whom it may engage...

    This is an automated request, but not an unsolicited one. For
    more information please visit http://gump.apache.org/nagged.html,
    and/or contact the folk at general@gump.apache.org.

    Project turbine-core has an issue affecting its community integration.
    This issue affects 2 projects,
    and has been outstanding for 130 runs.
    The current state of this project is 'Failed', with reason 'Build Failed'.
    For reference only, the following projects are affected by this:
    - turbine-core : A servlet based framework.
    - turbine-core-test : A servlet based framework.


    Full details are available at:
    http://vmgump.apache.org/gump/public/turbine-core/turbine-core/index.html

    That said, some information snippets are provided here.

    The following annotations (debug/informational/warning/error messages) were provided:
    -INFO- Optional dependency commons-fileupload prerequisite failed with reason build failed
    -INFO- Optional dependency httpunit failed with reason build failed
    -DEBUG- (Apache Gump generated) Apache Maven Settings in: /srv/gump/public/workspace/turbine-core/gump_mvn_settings.xml
    -INFO- Failed with reason build failed
    -DEBUG- Maven POM in: /srv/gump/public/workspace/turbine-core/pom.xml
    -INFO- Failed to extract fallback artifacts from Gump Repository



    The following work was performed:
    http://vmgump.apache.org/gump/public/turbine-core/turbine-core/gump_work/build_turbine-core_turbine-core.html
    Work Name: build_turbine-core_turbine-core (Type: Build)
    Work ended in a state of : Failed
    Elapsed: 35 secs
    Command Line: /opt/maven2/bin/mvn --batch-mode -DskipTests=true --settings /srv/gump/public/workspace/turbine-core/gump_mvn_settings.xml package
    [Working Directory: /srv/gump/public/workspace/turbine-core]
    M2_HOME: /opt/maven2
    ---------------------------------------------
    urls[19] = file:/srv/gump/public/workspace/mvnlocalrepo/shared/xml-apis/xml-apis/1.0.b2/xml-apis-1.0.b2.jar
    urls[20] = file:/srv/gump/public/workspace/mvnlocalrepo/shared/commons-configuration/commons-configuration/1.4/commons-configuration-1.4.jar
    urls[21] = file:/srv/gump/public/workspace/mvnlocalrepo/shared/commons-logging/commons-logging-api/1.0.4/commons-logging-api-1.0.4.jar
    urls[22] = file:/srv/gump/public/workspace/mvnlocalrepo/shared/commons-digester/commons-digester/1.8/commons-digester-1.8.jar
    urls[23] = file:/srv/gump/public/workspace/mvnlocalrepo/shared/commons-beanutils/commons-beanutils/1.7.0/commons-beanutils-1.7.0.jar
    urls[24] = file:/srv/gump/public/workspace/mvnlocalrepo/shared/commons-beanutils/commons-beanutils-core/1.7.0/commons-beanutils-core-1.7.0.jar
    urls[25] = file:/srv/gump/public/workspace/mvnlocalrepo/shared/commons-codec/commons-codec/1.3/commons-codec-1.3.jar
    urls[26] = file:/srv/gump/public/workspace/mvnlocalrepo/shared/commons-jxpath/commons-jxpath/1.2/commons-jxpath-1.2.jar
    urls[27] = file:/srv/gump/public/workspace/mvnlocalrepo/shared/xerces/xerces/1.2.3/xerces-1.2.3.jar
    urls[28] = file:/srv/gump/public/workspace/mvnlocalrepo/shared/ant/ant-optional/1.5.1/ant-optional-1.5.1.jar
    urls[29] = file:/srv/gump/public/workspace/mvnlocalrepo/shared/jdom/jdom/b9/jdom-b9.jar
    Number of imports: 10
    import: org.codehaus.classworlds.Entry@a6c57a42
    import: org.codehaus.classworlds.Entry@12f43f3b
    import: org.codehaus.classworlds.Entry@20025374
    import: org.codehaus.classworlds.Entry@f8e44ca4
    import: org.codehaus.classworlds.Entry@92758522
    import: org.codehaus.classworlds.Entry@ebf2705b
    import: org.codehaus.classworlds.Entry@bb25e54
    import: org.codehaus.classworlds.Entry@bece5185
    import: org.codehaus.classworlds.Entry@3fee8e37
    import: org.codehaus.classworlds.Entry@3fee19d8


    this realm = plexus.core
    urls[0] = file:/opt/maven2/lib/maven-2.2.1-uber.jar
    Number of imports: 10
    import: org.codehaus.classworlds.Entry@a6c57a42
    import: org.codehaus.classworlds.Entry@12f43f3b
    import: org.codehaus.classworlds.Entry@20025374
    import: org.codehaus.classworlds.Entry@f8e44ca4
    import: org.codehaus.classworlds.Entry@92758522
    import: org.codehaus.classworlds.Entry@ebf2705b
    import: org.codehaus.classworlds.Entry@bb25e54
    import: org.codehaus.classworlds.Entry@bece5185
    import: org.codehaus.classworlds.Entry@3fee8e37
    import: org.codehaus.classworlds.Entry@3fee19d8
    -----------------------------------------------------
    [INFO] ------------------------------------------------------------------------
    [ERROR] BUILD ERROR
    [INFO] ------------------------------------------------------------------------
    [INFO] Internal error in the plugin manager executing goal 'org.apache.torque:torque-maven-plugin:3.3:om': Unable to load the mojo 'org.apache.torque:torque-maven-plugin:3.3:om' in the plugin 'org.apache.torque:torque-maven-plugin'. A required class is missing: org/apache/torque/task/TorqueDataModelTask
    org.apache.torque.task.TorqueDataModelTask
    [INFO] ------------------------------------------------------------------------
    [INFO] For more information, run Maven with the -e switch
    [INFO] ------------------------------------------------------------------------
    [INFO] Total time: 34 seconds
    [INFO] Finished at: Thu May 05 07:10:28 UTC 2011
    [INFO] Final Memory: 30M/72M
    [INFO] ------------------------------------------------------------------------
    ---------------------------------------------

    To subscribe to this information via syndicated feeds:
    - RSS: http://vmgump.apache.org/gump/public/turbine-core/turbine-core/rss.xml
    - Atom: http://vmgump.apache.org/gump/public/turbine-core/turbine-core/atom.xml

    ============================== Gump Tracking Only ===
    Produced by Apache Gump(TM) version 2.3.
    Gump Run 10000005052011, vmgump.apache.org:vmgump:10000005052011
    Gump E-mail Identifier (unique within run) #29.

    --
    Apache Gump
    http://gump.apache.org/ [Instance: vmgump]

    ---------------------------------------------------------------------
    To unsubscribe, e-mail: dev-unsubscribe@turbine.apache.org
    For additional commands, e-mail: dev-help@turbine.apache.org
  • Anonymous at May 6, 2011 at 6:02 am
    To whom it may engage...

    This is an automated request, but not an unsolicited one. For
    more information please visit http://gump.apache.org/nagged.html,
    and/or contact the folk at general@gump.apache.org.

    Project turbine-core has an issue affecting its community integration.
    This issue affects 2 projects,
    and has been outstanding for 132 runs.
    The current state of this project is 'Failed', with reason 'Build Failed'.
    For reference only, the following projects are affected by this:
    - turbine-core : A servlet based framework.
    - turbine-core-test : A servlet based framework.


    Full details are available at:
    http://vmgump.apache.org/gump/public/turbine-core/turbine-core/index.html

    That said, some information snippets are provided here.

    The following annotations (debug/informational/warning/error messages) were provided:
    -INFO- Optional dependency commons-fileupload prerequisite failed with reason build failed
    -INFO- Optional dependency httpunit failed with reason build failed
    -DEBUG- (Apache Gump generated) Apache Maven Settings in: /srv/gump/public/workspace/turbine-core/gump_mvn_settings.xml
    -INFO- Failed with reason build failed
    -DEBUG- Maven POM in: /srv/gump/public/workspace/turbine-core/pom.xml
    -INFO- Failed to extract fallback artifacts from Gump Repository



    The following work was performed:
    http://vmgump.apache.org/gump/public/turbine-core/turbine-core/gump_work/build_turbine-core_turbine-core.html
    Work Name: build_turbine-core_turbine-core (Type: Build)
    Work ended in a state of : Failed
    Elapsed: 37 secs
    Command Line: /opt/maven2/bin/mvn --batch-mode -DskipTests=true --settings /srv/gump/public/workspace/turbine-core/gump_mvn_settings.xml package
    [Working Directory: /srv/gump/public/workspace/turbine-core]
    M2_HOME: /opt/maven2
    ---------------------------------------------
    urls[19] = file:/srv/gump/public/workspace/mvnlocalrepo/shared/xml-apis/xml-apis/1.0.b2/xml-apis-1.0.b2.jar
    urls[20] = file:/srv/gump/public/workspace/mvnlocalrepo/shared/commons-configuration/commons-configuration/1.4/commons-configuration-1.4.jar
    urls[21] = file:/srv/gump/public/workspace/mvnlocalrepo/shared/commons-logging/commons-logging-api/1.0.4/commons-logging-api-1.0.4.jar
    urls[22] = file:/srv/gump/public/workspace/mvnlocalrepo/shared/commons-digester/commons-digester/1.8/commons-digester-1.8.jar
    urls[23] = file:/srv/gump/public/workspace/mvnlocalrepo/shared/commons-beanutils/commons-beanutils/1.7.0/commons-beanutils-1.7.0.jar
    urls[24] = file:/srv/gump/public/workspace/mvnlocalrepo/shared/commons-beanutils/commons-beanutils-core/1.7.0/commons-beanutils-core-1.7.0.jar
    urls[25] = file:/srv/gump/public/workspace/mvnlocalrepo/shared/commons-codec/commons-codec/1.3/commons-codec-1.3.jar
    urls[26] = file:/srv/gump/public/workspace/mvnlocalrepo/shared/commons-jxpath/commons-jxpath/1.2/commons-jxpath-1.2.jar
    urls[27] = file:/srv/gump/public/workspace/mvnlocalrepo/shared/xerces/xerces/1.2.3/xerces-1.2.3.jar
    urls[28] = file:/srv/gump/public/workspace/mvnlocalrepo/shared/ant/ant-optional/1.5.1/ant-optional-1.5.1.jar
    urls[29] = file:/srv/gump/public/workspace/mvnlocalrepo/shared/jdom/jdom/b9/jdom-b9.jar
    Number of imports: 10
    import: org.codehaus.classworlds.Entry@a6c57a42
    import: org.codehaus.classworlds.Entry@12f43f3b
    import: org.codehaus.classworlds.Entry@20025374
    import: org.codehaus.classworlds.Entry@f8e44ca4
    import: org.codehaus.classworlds.Entry@92758522
    import: org.codehaus.classworlds.Entry@ebf2705b
    import: org.codehaus.classworlds.Entry@bb25e54
    import: org.codehaus.classworlds.Entry@bece5185
    import: org.codehaus.classworlds.Entry@3fee8e37
    import: org.codehaus.classworlds.Entry@3fee19d8


    this realm = plexus.core
    urls[0] = file:/opt/maven2/lib/maven-2.2.1-uber.jar
    Number of imports: 10
    import: org.codehaus.classworlds.Entry@a6c57a42
    import: org.codehaus.classworlds.Entry@12f43f3b
    import: org.codehaus.classworlds.Entry@20025374
    import: org.codehaus.classworlds.Entry@f8e44ca4
    import: org.codehaus.classworlds.Entry@92758522
    import: org.codehaus.classworlds.Entry@ebf2705b
    import: org.codehaus.classworlds.Entry@bb25e54
    import: org.codehaus.classworlds.Entry@bece5185
    import: org.codehaus.classworlds.Entry@3fee8e37
    import: org.codehaus.classworlds.Entry@3fee19d8
    -----------------------------------------------------
    [INFO] ------------------------------------------------------------------------
    [ERROR] BUILD ERROR
    [INFO] ------------------------------------------------------------------------
    [INFO] Internal error in the plugin manager executing goal 'org.apache.torque:torque-maven-plugin:3.3:om': Unable to load the mojo 'org.apache.torque:torque-maven-plugin:3.3:om' in the plugin 'org.apache.torque:torque-maven-plugin'. A required class is missing: org/apache/torque/task/TorqueDataModelTask
    org.apache.torque.task.TorqueDataModelTask
    [INFO] ------------------------------------------------------------------------
    [INFO] For more information, run Maven with the -e switch
    [INFO] ------------------------------------------------------------------------
    [INFO] Total time: 36 seconds
    [INFO] Finished at: Fri May 06 06:01:59 UTC 2011
    [INFO] Final Memory: 30M/72M
    [INFO] ------------------------------------------------------------------------
    ---------------------------------------------

    To subscribe to this information via syndicated feeds:
    - RSS: http://vmgump.apache.org/gump/public/turbine-core/turbine-core/rss.xml
    - Atom: http://vmgump.apache.org/gump/public/turbine-core/turbine-core/atom.xml

    ============================== Gump Tracking Only ===
    Produced by Apache Gump(TM) version 2.3.
    Gump Run 10000006052011, vmgump.apache.org:vmgump:10000006052011
    Gump E-mail Identifier (unique within run) #31.

    --
    Apache Gump
    http://gump.apache.org/ [Instance: vmgump]

    ---------------------------------------------------------------------
    To unsubscribe, e-mail: dev-unsubscribe@turbine.apache.org
    For additional commands, e-mail: dev-help@turbine.apache.org
  • Anonymous at May 7, 2011 at 6:37 am
    To whom it may engage...

    This is an automated request, but not an unsolicited one. For
    more information please visit http://gump.apache.org/nagged.html,
    and/or contact the folk at general@gump.apache.org.

    Project turbine-core has an issue affecting its community integration.
    This issue affects 2 projects,
    and has been outstanding for 134 runs.
    The current state of this project is 'Failed', with reason 'Build Failed'.
    For reference only, the following projects are affected by this:
    - turbine-core : A servlet based framework.
    - turbine-core-test : A servlet based framework.


    Full details are available at:
    http://vmgump.apache.org/gump/public/turbine-core/turbine-core/index.html

    That said, some information snippets are provided here.

    The following annotations (debug/informational/warning/error messages) were provided:
    -INFO- Optional dependency commons-fileupload prerequisite failed with reason build failed
    -INFO- Optional dependency httpunit failed with reason build failed
    -DEBUG- (Apache Gump generated) Apache Maven Settings in: /srv/gump/public/workspace/turbine-core/gump_mvn_settings.xml
    -INFO- Failed with reason build failed
    -DEBUG- Maven POM in: /srv/gump/public/workspace/turbine-core/pom.xml
    -INFO- Failed to extract fallback artifacts from Gump Repository



    The following work was performed:
    http://vmgump.apache.org/gump/public/turbine-core/turbine-core/gump_work/build_turbine-core_turbine-core.html
    Work Name: build_turbine-core_turbine-core (Type: Build)
    Work ended in a state of : Failed
    Elapsed: 42 secs
    Command Line: /opt/maven2/bin/mvn --batch-mode -DskipTests=true --settings /srv/gump/public/workspace/turbine-core/gump_mvn_settings.xml package
    [Working Directory: /srv/gump/public/workspace/turbine-core]
    M2_HOME: /opt/maven2
    ---------------------------------------------
    urls[19] = file:/srv/gump/public/workspace/mvnlocalrepo/shared/xml-apis/xml-apis/1.0.b2/xml-apis-1.0.b2.jar
    urls[20] = file:/srv/gump/public/workspace/mvnlocalrepo/shared/commons-configuration/commons-configuration/1.4/commons-configuration-1.4.jar
    urls[21] = file:/srv/gump/public/workspace/mvnlocalrepo/shared/commons-logging/commons-logging-api/1.0.4/commons-logging-api-1.0.4.jar
    urls[22] = file:/srv/gump/public/workspace/mvnlocalrepo/shared/commons-digester/commons-digester/1.8/commons-digester-1.8.jar
    urls[23] = file:/srv/gump/public/workspace/mvnlocalrepo/shared/commons-beanutils/commons-beanutils/1.7.0/commons-beanutils-1.7.0.jar
    urls[24] = file:/srv/gump/public/workspace/mvnlocalrepo/shared/commons-beanutils/commons-beanutils-core/1.7.0/commons-beanutils-core-1.7.0.jar
    urls[25] = file:/srv/gump/public/workspace/mvnlocalrepo/shared/commons-codec/commons-codec/1.3/commons-codec-1.3.jar
    urls[26] = file:/srv/gump/public/workspace/mvnlocalrepo/shared/commons-jxpath/commons-jxpath/1.2/commons-jxpath-1.2.jar
    urls[27] = file:/srv/gump/public/workspace/mvnlocalrepo/shared/xerces/xerces/1.2.3/xerces-1.2.3.jar
    urls[28] = file:/srv/gump/public/workspace/mvnlocalrepo/shared/ant/ant-optional/1.5.1/ant-optional-1.5.1.jar
    urls[29] = file:/srv/gump/public/workspace/mvnlocalrepo/shared/jdom/jdom/b9/jdom-b9.jar
    Number of imports: 10
    import: org.codehaus.classworlds.Entry@a6c57a42
    import: org.codehaus.classworlds.Entry@12f43f3b
    import: org.codehaus.classworlds.Entry@20025374
    import: org.codehaus.classworlds.Entry@f8e44ca4
    import: org.codehaus.classworlds.Entry@92758522
    import: org.codehaus.classworlds.Entry@ebf2705b
    import: org.codehaus.classworlds.Entry@bb25e54
    import: org.codehaus.classworlds.Entry@bece5185
    import: org.codehaus.classworlds.Entry@3fee8e37
    import: org.codehaus.classworlds.Entry@3fee19d8


    this realm = plexus.core
    urls[0] = file:/opt/maven2/lib/maven-2.2.1-uber.jar
    Number of imports: 10
    import: org.codehaus.classworlds.Entry@a6c57a42
    import: org.codehaus.classworlds.Entry@12f43f3b
    import: org.codehaus.classworlds.Entry@20025374
    import: org.codehaus.classworlds.Entry@f8e44ca4
    import: org.codehaus.classworlds.Entry@92758522
    import: org.codehaus.classworlds.Entry@ebf2705b
    import: org.codehaus.classworlds.Entry@bb25e54
    import: org.codehaus.classworlds.Entry@bece5185
    import: org.codehaus.classworlds.Entry@3fee8e37
    import: org.codehaus.classworlds.Entry@3fee19d8
    -----------------------------------------------------
    [INFO] ------------------------------------------------------------------------
    [ERROR] BUILD ERROR
    [INFO] ------------------------------------------------------------------------
    [INFO] Internal error in the plugin manager executing goal 'org.apache.torque:torque-maven-plugin:3.3:om': Unable to load the mojo 'org.apache.torque:torque-maven-plugin:3.3:om' in the plugin 'org.apache.torque:torque-maven-plugin'. A required class is missing: org/apache/torque/task/TorqueDataModelTask
    org.apache.torque.task.TorqueDataModelTask
    [INFO] ------------------------------------------------------------------------
    [INFO] For more information, run Maven with the -e switch
    [INFO] ------------------------------------------------------------------------
    [INFO] Total time: 41 seconds
    [INFO] Finished at: Sat May 07 06:37:06 UTC 2011
    [INFO] Final Memory: 30M/72M
    [INFO] ------------------------------------------------------------------------
    ---------------------------------------------

    To subscribe to this information via syndicated feeds:
    - RSS: http://vmgump.apache.org/gump/public/turbine-core/turbine-core/rss.xml
    - Atom: http://vmgump.apache.org/gump/public/turbine-core/turbine-core/atom.xml

    ============================== Gump Tracking Only ===
    Produced by Apache Gump(TM) version 2.3.
    Gump Run 11000007052011, vmgump.apache.org:vmgump:11000007052011
    Gump E-mail Identifier (unique within run) #36.

    --
    Apache Gump
    http://gump.apache.org/ [Instance: vmgump]

    ---------------------------------------------------------------------
    To unsubscribe, e-mail: dev-unsubscribe@turbine.apache.org
    For additional commands, e-mail: dev-help@turbine.apache.org
  • Anonymous at May 8, 2011 at 6:25 am
    To whom it may engage...

    This is an automated request, but not an unsolicited one. For
    more information please visit http://gump.apache.org/nagged.html,
    and/or contact the folk at general@gump.apache.org.

    Project turbine-core has an issue affecting its community integration.
    This issue affects 2 projects,
    and has been outstanding for 136 runs.
    The current state of this project is 'Failed', with reason 'Build Failed'.
    For reference only, the following projects are affected by this:
    - turbine-core : A servlet based framework.
    - turbine-core-test : A servlet based framework.


    Full details are available at:
    http://vmgump.apache.org/gump/public/turbine-core/turbine-core/index.html

    That said, some information snippets are provided here.

    The following annotations (debug/informational/warning/error messages) were provided:
    -INFO- Optional dependency commons-fileupload prerequisite failed with reason build failed
    -INFO- Optional dependency httpunit failed with reason build failed
    -DEBUG- (Apache Gump generated) Apache Maven Settings in: /srv/gump/public/workspace/turbine-core/gump_mvn_settings.xml
    -INFO- Failed with reason build failed
    -DEBUG- Maven POM in: /srv/gump/public/workspace/turbine-core/pom.xml
    -INFO- Failed to extract fallback artifacts from Gump Repository



    The following work was performed:
    http://vmgump.apache.org/gump/public/turbine-core/turbine-core/gump_work/build_turbine-core_turbine-core.html
    Work Name: build_turbine-core_turbine-core (Type: Build)
    Work ended in a state of : Failed
    Elapsed: 39 secs
    Command Line: /opt/maven2/bin/mvn --batch-mode -DskipTests=true --settings /srv/gump/public/workspace/turbine-core/gump_mvn_settings.xml package
    [Working Directory: /srv/gump/public/workspace/turbine-core]
    M2_HOME: /opt/maven2
    ---------------------------------------------
    urls[19] = file:/srv/gump/public/workspace/mvnlocalrepo/shared/xml-apis/xml-apis/1.0.b2/xml-apis-1.0.b2.jar
    urls[20] = file:/srv/gump/public/workspace/mvnlocalrepo/shared/commons-configuration/commons-configuration/1.4/commons-configuration-1.4.jar
    urls[21] = file:/srv/gump/public/workspace/mvnlocalrepo/shared/commons-logging/commons-logging-api/1.0.4/commons-logging-api-1.0.4.jar
    urls[22] = file:/srv/gump/public/workspace/mvnlocalrepo/shared/commons-digester/commons-digester/1.8/commons-digester-1.8.jar
    urls[23] = file:/srv/gump/public/workspace/mvnlocalrepo/shared/commons-beanutils/commons-beanutils/1.7.0/commons-beanutils-1.7.0.jar
    urls[24] = file:/srv/gump/public/workspace/mvnlocalrepo/shared/commons-beanutils/commons-beanutils-core/1.7.0/commons-beanutils-core-1.7.0.jar
    urls[25] = file:/srv/gump/public/workspace/mvnlocalrepo/shared/commons-codec/commons-codec/1.3/commons-codec-1.3.jar
    urls[26] = file:/srv/gump/public/workspace/mvnlocalrepo/shared/commons-jxpath/commons-jxpath/1.2/commons-jxpath-1.2.jar
    urls[27] = file:/srv/gump/public/workspace/mvnlocalrepo/shared/xerces/xerces/1.2.3/xerces-1.2.3.jar
    urls[28] = file:/srv/gump/public/workspace/mvnlocalrepo/shared/ant/ant-optional/1.5.1/ant-optional-1.5.1.jar
    urls[29] = file:/srv/gump/public/workspace/mvnlocalrepo/shared/jdom/jdom/b9/jdom-b9.jar
    Number of imports: 10
    import: org.codehaus.classworlds.Entry@a6c57a42
    import: org.codehaus.classworlds.Entry@12f43f3b
    import: org.codehaus.classworlds.Entry@20025374
    import: org.codehaus.classworlds.Entry@f8e44ca4
    import: org.codehaus.classworlds.Entry@92758522
    import: org.codehaus.classworlds.Entry@ebf2705b
    import: org.codehaus.classworlds.Entry@bb25e54
    import: org.codehaus.classworlds.Entry@bece5185
    import: org.codehaus.classworlds.Entry@3fee8e37
    import: org.codehaus.classworlds.Entry@3fee19d8


    this realm = plexus.core
    urls[0] = file:/opt/maven2/lib/maven-2.2.1-uber.jar
    Number of imports: 10
    import: org.codehaus.classworlds.Entry@a6c57a42
    import: org.codehaus.classworlds.Entry@12f43f3b
    import: org.codehaus.classworlds.Entry@20025374
    import: org.codehaus.classworlds.Entry@f8e44ca4
    import: org.codehaus.classworlds.Entry@92758522
    import: org.codehaus.classworlds.Entry@ebf2705b
    import: org.codehaus.classworlds.Entry@bb25e54
    import: org.codehaus.classworlds.Entry@bece5185
    import: org.codehaus.classworlds.Entry@3fee8e37
    import: org.codehaus.classworlds.Entry@3fee19d8
    -----------------------------------------------------
    [INFO] ------------------------------------------------------------------------
    [ERROR] BUILD ERROR
    [INFO] ------------------------------------------------------------------------
    [INFO] Internal error in the plugin manager executing goal 'org.apache.torque:torque-maven-plugin:3.3:om': Unable to load the mojo 'org.apache.torque:torque-maven-plugin:3.3:om' in the plugin 'org.apache.torque:torque-maven-plugin'. A required class is missing: org/apache/torque/task/TorqueDataModelTask
    org.apache.torque.task.TorqueDataModelTask
    [INFO] ------------------------------------------------------------------------
    [INFO] For more information, run Maven with the -e switch
    [INFO] ------------------------------------------------------------------------
    [INFO] Total time: 38 seconds
    [INFO] Finished at: Sun May 08 06:24:39 UTC 2011
    [INFO] Final Memory: 30M/72M
    [INFO] ------------------------------------------------------------------------
    ---------------------------------------------

    To subscribe to this information via syndicated feeds:
    - RSS: http://vmgump.apache.org/gump/public/turbine-core/turbine-core/rss.xml
    - Atom: http://vmgump.apache.org/gump/public/turbine-core/turbine-core/atom.xml

    ============================== Gump Tracking Only ===
    Produced by Apache Gump(TM) version 2.3.
    Gump Run 09000008052011, vmgump.apache.org:vmgump:09000008052011
    Gump E-mail Identifier (unique within run) #31.

    --
    Apache Gump
    http://gump.apache.org/ [Instance: vmgump]

    ---------------------------------------------------------------------
    To unsubscribe, e-mail: dev-unsubscribe@turbine.apache.org
    For additional commands, e-mail: dev-help@turbine.apache.org
  • Anonymous at May 9, 2011 at 6:26 am
    To whom it may engage...

    This is an automated request, but not an unsolicited one. For
    more information please visit http://gump.apache.org/nagged.html,
    and/or contact the folk at general@gump.apache.org.

    Project turbine-core has an issue affecting its community integration.
    This issue affects 2 projects,
    and has been outstanding for 138 runs.
    The current state of this project is 'Failed', with reason 'Build Failed'.
    For reference only, the following projects are affected by this:
    - turbine-core : A servlet based framework.
    - turbine-core-test : A servlet based framework.


    Full details are available at:
    http://vmgump.apache.org/gump/public/turbine-core/turbine-core/index.html

    That said, some information snippets are provided here.

    The following annotations (debug/informational/warning/error messages) were provided:
    -INFO- Optional dependency commons-fileupload prerequisite failed with reason build failed
    -INFO- Optional dependency httpunit failed with reason build failed
    -DEBUG- (Apache Gump generated) Apache Maven Settings in: /srv/gump/public/workspace/turbine-core/gump_mvn_settings.xml
    -INFO- Failed with reason build failed
    -DEBUG- Maven POM in: /srv/gump/public/workspace/turbine-core/pom.xml
    -INFO- Failed to extract fallback artifacts from Gump Repository



    The following work was performed:
    http://vmgump.apache.org/gump/public/turbine-core/turbine-core/gump_work/build_turbine-core_turbine-core.html
    Work Name: build_turbine-core_turbine-core (Type: Build)
    Work ended in a state of : Failed
    Elapsed: 38 secs
    Command Line: /opt/maven2/bin/mvn --batch-mode -DskipTests=true --settings /srv/gump/public/workspace/turbine-core/gump_mvn_settings.xml package
    [Working Directory: /srv/gump/public/workspace/turbine-core]
    M2_HOME: /opt/maven2
    ---------------------------------------------
    urls[19] = file:/srv/gump/public/workspace/mvnlocalrepo/shared/xml-apis/xml-apis/1.0.b2/xml-apis-1.0.b2.jar
    urls[20] = file:/srv/gump/public/workspace/mvnlocalrepo/shared/commons-configuration/commons-configuration/1.4/commons-configuration-1.4.jar
    urls[21] = file:/srv/gump/public/workspace/mvnlocalrepo/shared/commons-logging/commons-logging-api/1.0.4/commons-logging-api-1.0.4.jar
    urls[22] = file:/srv/gump/public/workspace/mvnlocalrepo/shared/commons-digester/commons-digester/1.8/commons-digester-1.8.jar
    urls[23] = file:/srv/gump/public/workspace/mvnlocalrepo/shared/commons-beanutils/commons-beanutils/1.7.0/commons-beanutils-1.7.0.jar
    urls[24] = file:/srv/gump/public/workspace/mvnlocalrepo/shared/commons-beanutils/commons-beanutils-core/1.7.0/commons-beanutils-core-1.7.0.jar
    urls[25] = file:/srv/gump/public/workspace/mvnlocalrepo/shared/commons-codec/commons-codec/1.3/commons-codec-1.3.jar
    urls[26] = file:/srv/gump/public/workspace/mvnlocalrepo/shared/commons-jxpath/commons-jxpath/1.2/commons-jxpath-1.2.jar
    urls[27] = file:/srv/gump/public/workspace/mvnlocalrepo/shared/xerces/xerces/1.2.3/xerces-1.2.3.jar
    urls[28] = file:/srv/gump/public/workspace/mvnlocalrepo/shared/ant/ant-optional/1.5.1/ant-optional-1.5.1.jar
    urls[29] = file:/srv/gump/public/workspace/mvnlocalrepo/shared/jdom/jdom/b9/jdom-b9.jar
    Number of imports: 10
    import: org.codehaus.classworlds.Entry@a6c57a42
    import: org.codehaus.classworlds.Entry@12f43f3b
    import: org.codehaus.classworlds.Entry@20025374
    import: org.codehaus.classworlds.Entry@f8e44ca4
    import: org.codehaus.classworlds.Entry@92758522
    import: org.codehaus.classworlds.Entry@ebf2705b
    import: org.codehaus.classworlds.Entry@bb25e54
    import: org.codehaus.classworlds.Entry@bece5185
    import: org.codehaus.classworlds.Entry@3fee8e37
    import: org.codehaus.classworlds.Entry@3fee19d8


    this realm = plexus.core
    urls[0] = file:/opt/maven2/lib/maven-2.2.1-uber.jar
    Number of imports: 10
    import: org.codehaus.classworlds.Entry@a6c57a42
    import: org.codehaus.classworlds.Entry@12f43f3b
    import: org.codehaus.classworlds.Entry@20025374
    import: org.codehaus.classworlds.Entry@f8e44ca4
    import: org.codehaus.classworlds.Entry@92758522
    import: org.codehaus.classworlds.Entry@ebf2705b
    import: org.codehaus.classworlds.Entry@bb25e54
    import: org.codehaus.classworlds.Entry@bece5185
    import: org.codehaus.classworlds.Entry@3fee8e37
    import: org.codehaus.classworlds.Entry@3fee19d8
    -----------------------------------------------------
    [INFO] ------------------------------------------------------------------------
    [ERROR] BUILD ERROR
    [INFO] ------------------------------------------------------------------------
    [INFO] Internal error in the plugin manager executing goal 'org.apache.torque:torque-maven-plugin:3.3:om': Unable to load the mojo 'org.apache.torque:torque-maven-plugin:3.3:om' in the plugin 'org.apache.torque:torque-maven-plugin'. A required class is missing: org/apache/torque/task/TorqueDataModelTask
    org.apache.torque.task.TorqueDataModelTask
    [INFO] ------------------------------------------------------------------------
    [INFO] For more information, run Maven with the -e switch
    [INFO] ------------------------------------------------------------------------
    [INFO] Total time: 37 seconds
    [INFO] Finished at: Mon May 09 06:25:33 UTC 2011
    [INFO] Final Memory: 30M/72M
    [INFO] ------------------------------------------------------------------------
    ---------------------------------------------

    To subscribe to this information via syndicated feeds:
    - RSS: http://vmgump.apache.org/gump/public/turbine-core/turbine-core/rss.xml
    - Atom: http://vmgump.apache.org/gump/public/turbine-core/turbine-core/atom.xml

    ============================== Gump Tracking Only ===
    Produced by Apache Gump(TM) version 2.3.
    Gump Run 10000009052011, vmgump.apache.org:vmgump:10000009052011
    Gump E-mail Identifier (unique within run) #29.

    --
    Apache Gump
    http://gump.apache.org/ [Instance: vmgump]

    ---------------------------------------------------------------------
    To unsubscribe, e-mail: dev-unsubscribe@turbine.apache.org
    For additional commands, e-mail: dev-help@turbine.apache.org
  • Anonymous at May 10, 2011 at 6:17 am
    To whom it may engage...

    This is an automated request, but not an unsolicited one. For
    more information please visit http://gump.apache.org/nagged.html,
    and/or contact the folk at general@gump.apache.org.

    Project turbine-core has an issue affecting its community integration.
    This issue affects 2 projects,
    and has been outstanding for 140 runs.
    The current state of this project is 'Failed', with reason 'Build Failed'.
    For reference only, the following projects are affected by this:
    - turbine-core : A servlet based framework.
    - turbine-core-test : A servlet based framework.


    Full details are available at:
    http://vmgump.apache.org/gump/public/turbine-core/turbine-core/index.html

    That said, some information snippets are provided here.

    The following annotations (debug/informational/warning/error messages) were provided:
    -INFO- Optional dependency commons-fileupload prerequisite failed with reason build failed
    -INFO- Optional dependency httpunit failed with reason build failed
    -DEBUG- (Apache Gump generated) Apache Maven Settings in: /srv/gump/public/workspace/turbine-core/gump_mvn_settings.xml
    -INFO- Failed with reason build failed
    -DEBUG- Maven POM in: /srv/gump/public/workspace/turbine-core/pom.xml
    -INFO- Failed to extract fallback artifacts from Gump Repository



    The following work was performed:
    http://vmgump.apache.org/gump/public/turbine-core/turbine-core/gump_work/build_turbine-core_turbine-core.html
    Work Name: build_turbine-core_turbine-core (Type: Build)
    Work ended in a state of : Failed
    Elapsed: 26 secs
    Command Line: /opt/maven2/bin/mvn --batch-mode -DskipTests=true --settings /srv/gump/public/workspace/turbine-core/gump_mvn_settings.xml package
    [Working Directory: /srv/gump/public/workspace/turbine-core]
    M2_HOME: /opt/maven2
    ---------------------------------------------
    urls[19] = file:/srv/gump/public/workspace/mvnlocalrepo/shared/xml-apis/xml-apis/1.0.b2/xml-apis-1.0.b2.jar
    urls[20] = file:/srv/gump/public/workspace/mvnlocalrepo/shared/commons-configuration/commons-configuration/1.4/commons-configuration-1.4.jar
    urls[21] = file:/srv/gump/public/workspace/mvnlocalrepo/shared/commons-logging/commons-logging-api/1.0.4/commons-logging-api-1.0.4.jar
    urls[22] = file:/srv/gump/public/workspace/mvnlocalrepo/shared/commons-digester/commons-digester/1.8/commons-digester-1.8.jar
    urls[23] = file:/srv/gump/public/workspace/mvnlocalrepo/shared/commons-beanutils/commons-beanutils/1.7.0/commons-beanutils-1.7.0.jar
    urls[24] = file:/srv/gump/public/workspace/mvnlocalrepo/shared/commons-beanutils/commons-beanutils-core/1.7.0/commons-beanutils-core-1.7.0.jar
    urls[25] = file:/srv/gump/public/workspace/mvnlocalrepo/shared/commons-codec/commons-codec/1.3/commons-codec-1.3.jar
    urls[26] = file:/srv/gump/public/workspace/mvnlocalrepo/shared/commons-jxpath/commons-jxpath/1.2/commons-jxpath-1.2.jar
    urls[27] = file:/srv/gump/public/workspace/mvnlocalrepo/shared/xerces/xerces/1.2.3/xerces-1.2.3.jar
    urls[28] = file:/srv/gump/public/workspace/mvnlocalrepo/shared/ant/ant-optional/1.5.1/ant-optional-1.5.1.jar
    urls[29] = file:/srv/gump/public/workspace/mvnlocalrepo/shared/jdom/jdom/b9/jdom-b9.jar
    Number of imports: 10
    import: org.codehaus.classworlds.Entry@a6c57a42
    import: org.codehaus.classworlds.Entry@12f43f3b
    import: org.codehaus.classworlds.Entry@20025374
    import: org.codehaus.classworlds.Entry@f8e44ca4
    import: org.codehaus.classworlds.Entry@92758522
    import: org.codehaus.classworlds.Entry@ebf2705b
    import: org.codehaus.classworlds.Entry@bb25e54
    import: org.codehaus.classworlds.Entry@bece5185
    import: org.codehaus.classworlds.Entry@3fee8e37
    import: org.codehaus.classworlds.Entry@3fee19d8


    this realm = plexus.core
    urls[0] = file:/opt/maven2/lib/maven-2.2.1-uber.jar
    Number of imports: 10
    import: org.codehaus.classworlds.Entry@a6c57a42
    import: org.codehaus.classworlds.Entry@12f43f3b
    import: org.codehaus.classworlds.Entry@20025374
    import: org.codehaus.classworlds.Entry@f8e44ca4
    import: org.codehaus.classworlds.Entry@92758522
    import: org.codehaus.classworlds.Entry@ebf2705b
    import: org.codehaus.classworlds.Entry@bb25e54
    import: org.codehaus.classworlds.Entry@bece5185
    import: org.codehaus.classworlds.Entry@3fee8e37
    import: org.codehaus.classworlds.Entry@3fee19d8
    -----------------------------------------------------
    [INFO] ------------------------------------------------------------------------
    [ERROR] BUILD ERROR
    [INFO] ------------------------------------------------------------------------
    [INFO] Internal error in the plugin manager executing goal 'org.apache.torque:torque-maven-plugin:3.3:om': Unable to load the mojo 'org.apache.torque:torque-maven-plugin:3.3:om' in the plugin 'org.apache.torque:torque-maven-plugin'. A required class is missing: org/apache/torque/task/TorqueDataModelTask
    org.apache.torque.task.TorqueDataModelTask
    [INFO] ------------------------------------------------------------------------
    [INFO] For more information, run Maven with the -e switch
    [INFO] ------------------------------------------------------------------------
    [INFO] Total time: 25 seconds
    [INFO] Finished at: Tue May 10 06:16:39 UTC 2011
    [INFO] Final Memory: 30M/72M
    [INFO] ------------------------------------------------------------------------
    ---------------------------------------------

    To subscribe to this information via syndicated feeds:
    - RSS: http://vmgump.apache.org/gump/public/turbine-core/turbine-core/rss.xml
    - Atom: http://vmgump.apache.org/gump/public/turbine-core/turbine-core/atom.xml

    ============================== Gump Tracking Only ===
    Produced by Apache Gump(TM) version 2.3.
    Gump Run 10000010052011, vmgump.apache.org:vmgump:10000010052011
    Gump E-mail Identifier (unique within run) #28.

    --
    Apache Gump
    http://gump.apache.org/ [Instance: vmgump]

    ---------------------------------------------------------------------
    To unsubscribe, e-mail: dev-unsubscribe@turbine.apache.org
    For additional commands, e-mail: dev-help@turbine.apache.org
  • Anonymous at May 11, 2011 at 6:33 am
    To whom it may engage...

    This is an automated request, but not an unsolicited one. For
    more information please visit http://gump.apache.org/nagged.html,
    and/or contact the folk at general@gump.apache.org.

    Project turbine-core has an issue affecting its community integration.
    This issue affects 2 projects,
    and has been outstanding for 141 runs.
    The current state of this project is 'Failed', with reason 'Build Failed'.
    For reference only, the following projects are affected by this:
    - turbine-core : A servlet based framework.
    - turbine-core-test : A servlet based framework.


    Full details are available at:
    http://vmgump.apache.org/gump/public/turbine-core/turbine-core/index.html

    That said, some information snippets are provided here.

    The following annotations (debug/informational/warning/error messages) were provided:
    -INFO- Optional dependency commons-fileupload prerequisite failed with reason build failed
    -INFO- Optional dependency httpunit failed with reason build failed
    -DEBUG- (Apache Gump generated) Apache Maven Settings in: /srv/gump/public/workspace/turbine-core/gump_mvn_settings.xml
    -INFO- Failed with reason build failed
    -DEBUG- Maven POM in: /srv/gump/public/workspace/turbine-core/pom.xml
    -INFO- Failed to extract fallback artifacts from Gump Repository



    The following work was performed:
    http://vmgump.apache.org/gump/public/turbine-core/turbine-core/gump_work/build_turbine-core_turbine-core.html
    Work Name: build_turbine-core_turbine-core (Type: Build)
    Work ended in a state of : Failed
    Elapsed: 26 secs
    Command Line: /opt/maven2/bin/mvn --batch-mode -DskipTests=true --settings /srv/gump/public/workspace/turbine-core/gump_mvn_settings.xml package
    [Working Directory: /srv/gump/public/workspace/turbine-core]
    M2_HOME: /opt/maven2
    ---------------------------------------------
    urls[19] = file:/srv/gump/public/workspace/mvnlocalrepo/shared/xml-apis/xml-apis/1.0.b2/xml-apis-1.0.b2.jar
    urls[20] = file:/srv/gump/public/workspace/mvnlocalrepo/shared/commons-configuration/commons-configuration/1.4/commons-configuration-1.4.jar
    urls[21] = file:/srv/gump/public/workspace/mvnlocalrepo/shared/commons-logging/commons-logging-api/1.0.4/commons-logging-api-1.0.4.jar
    urls[22] = file:/srv/gump/public/workspace/mvnlocalrepo/shared/commons-digester/commons-digester/1.8/commons-digester-1.8.jar
    urls[23] = file:/srv/gump/public/workspace/mvnlocalrepo/shared/commons-beanutils/commons-beanutils/1.7.0/commons-beanutils-1.7.0.jar
    urls[24] = file:/srv/gump/public/workspace/mvnlocalrepo/shared/commons-beanutils/commons-beanutils-core/1.7.0/commons-beanutils-core-1.7.0.jar
    urls[25] = file:/srv/gump/public/workspace/mvnlocalrepo/shared/commons-codec/commons-codec/1.3/commons-codec-1.3.jar
    urls[26] = file:/srv/gump/public/workspace/mvnlocalrepo/shared/commons-jxpath/commons-jxpath/1.2/commons-jxpath-1.2.jar
    urls[27] = file:/srv/gump/public/workspace/mvnlocalrepo/shared/xerces/xerces/1.2.3/xerces-1.2.3.jar
    urls[28] = file:/srv/gump/public/workspace/mvnlocalrepo/shared/ant/ant-optional/1.5.1/ant-optional-1.5.1.jar
    urls[29] = file:/srv/gump/public/workspace/mvnlocalrepo/shared/jdom/jdom/b9/jdom-b9.jar
    Number of imports: 10
    import: org.codehaus.classworlds.Entry@a6c57a42
    import: org.codehaus.classworlds.Entry@12f43f3b
    import: org.codehaus.classworlds.Entry@20025374
    import: org.codehaus.classworlds.Entry@f8e44ca4
    import: org.codehaus.classworlds.Entry@92758522
    import: org.codehaus.classworlds.Entry@ebf2705b
    import: org.codehaus.classworlds.Entry@bb25e54
    import: org.codehaus.classworlds.Entry@bece5185
    import: org.codehaus.classworlds.Entry@3fee8e37
    import: org.codehaus.classworlds.Entry@3fee19d8


    this realm = plexus.core
    urls[0] = file:/opt/maven2/lib/maven-2.2.1-uber.jar
    Number of imports: 10
    import: org.codehaus.classworlds.Entry@a6c57a42
    import: org.codehaus.classworlds.Entry@12f43f3b
    import: org.codehaus.classworlds.Entry@20025374
    import: org.codehaus.classworlds.Entry@f8e44ca4
    import: org.codehaus.classworlds.Entry@92758522
    import: org.codehaus.classworlds.Entry@ebf2705b
    import: org.codehaus.classworlds.Entry@bb25e54
    import: org.codehaus.classworlds.Entry@bece5185
    import: org.codehaus.classworlds.Entry@3fee8e37
    import: org.codehaus.classworlds.Entry@3fee19d8
    -----------------------------------------------------
    [INFO] ------------------------------------------------------------------------
    [ERROR] BUILD ERROR
    [INFO] ------------------------------------------------------------------------
    [INFO] Internal error in the plugin manager executing goal 'org.apache.torque:torque-maven-plugin:3.3:om': Unable to load the mojo 'org.apache.torque:torque-maven-plugin:3.3:om' in the plugin 'org.apache.torque:torque-maven-plugin'. A required class is missing: org/apache/torque/task/TorqueDataModelTask
    org.apache.torque.task.TorqueDataModelTask
    [INFO] ------------------------------------------------------------------------
    [INFO] For more information, run Maven with the -e switch
    [INFO] ------------------------------------------------------------------------
    [INFO] Total time: 25 seconds
    [INFO] Finished at: Wed May 11 06:32:37 UTC 2011
    [INFO] Final Memory: 30M/72M
    [INFO] ------------------------------------------------------------------------
    ---------------------------------------------

    To subscribe to this information via syndicated feeds:
    - RSS: http://vmgump.apache.org/gump/public/turbine-core/turbine-core/rss.xml
    - Atom: http://vmgump.apache.org/gump/public/turbine-core/turbine-core/atom.xml

    ============================== Gump Tracking Only ===
    Produced by Apache Gump(TM) version 2.3.
    Gump Run 10000011052011, vmgump.apache.org:vmgump:10000011052011
    Gump E-mail Identifier (unique within run) #30.

    --
    Apache Gump
    http://gump.apache.org/ [Instance: vmgump]

    ---------------------------------------------------------------------
    To unsubscribe, e-mail: dev-unsubscribe@turbine.apache.org
    For additional commands, e-mail: dev-help@turbine.apache.org
  • Anonymous at May 12, 2011 at 6:10 am
    To whom it may engage...

    This is an automated request, but not an unsolicited one. For
    more information please visit http://gump.apache.org/nagged.html,
    and/or contact the folk at general@gump.apache.org.

    Project turbine-core has an issue affecting its community integration.
    This issue affects 2 projects,
    and has been outstanding for 143 runs.
    The current state of this project is 'Failed', with reason 'Build Failed'.
    For reference only, the following projects are affected by this:
    - turbine-core : A servlet based framework.
    - turbine-core-test : A servlet based framework.


    Full details are available at:
    http://vmgump.apache.org/gump/public/turbine-core/turbine-core/index.html

    That said, some information snippets are provided here.

    The following annotations (debug/informational/warning/error messages) were provided:
    -INFO- Optional dependency commons-fileupload prerequisite failed with reason build failed
    -INFO- Optional dependency httpunit failed with reason build failed
    -DEBUG- (Apache Gump generated) Apache Maven Settings in: /srv/gump/public/workspace/turbine-core/gump_mvn_settings.xml
    -INFO- Failed with reason build failed
    -DEBUG- Maven POM in: /srv/gump/public/workspace/turbine-core/pom.xml
    -INFO- Failed to extract fallback artifacts from Gump Repository



    The following work was performed:
    http://vmgump.apache.org/gump/public/turbine-core/turbine-core/gump_work/build_turbine-core_turbine-core.html
    Work Name: build_turbine-core_turbine-core (Type: Build)
    Work ended in a state of : Failed
    Elapsed: 25 secs
    Command Line: /opt/maven2/bin/mvn --batch-mode -DskipTests=true --settings /srv/gump/public/workspace/turbine-core/gump_mvn_settings.xml package
    [Working Directory: /srv/gump/public/workspace/turbine-core]
    M2_HOME: /opt/maven2
    ---------------------------------------------
    urls[19] = file:/srv/gump/public/workspace/mvnlocalrepo/shared/xml-apis/xml-apis/1.0.b2/xml-apis-1.0.b2.jar
    urls[20] = file:/srv/gump/public/workspace/mvnlocalrepo/shared/commons-configuration/commons-configuration/1.4/commons-configuration-1.4.jar
    urls[21] = file:/srv/gump/public/workspace/mvnlocalrepo/shared/commons-logging/commons-logging-api/1.0.4/commons-logging-api-1.0.4.jar
    urls[22] = file:/srv/gump/public/workspace/mvnlocalrepo/shared/commons-digester/commons-digester/1.8/commons-digester-1.8.jar
    urls[23] = file:/srv/gump/public/workspace/mvnlocalrepo/shared/commons-beanutils/commons-beanutils/1.7.0/commons-beanutils-1.7.0.jar
    urls[24] = file:/srv/gump/public/workspace/mvnlocalrepo/shared/commons-beanutils/commons-beanutils-core/1.7.0/commons-beanutils-core-1.7.0.jar
    urls[25] = file:/srv/gump/public/workspace/mvnlocalrepo/shared/commons-codec/commons-codec/1.3/commons-codec-1.3.jar
    urls[26] = file:/srv/gump/public/workspace/mvnlocalrepo/shared/commons-jxpath/commons-jxpath/1.2/commons-jxpath-1.2.jar
    urls[27] = file:/srv/gump/public/workspace/mvnlocalrepo/shared/xerces/xerces/1.2.3/xerces-1.2.3.jar
    urls[28] = file:/srv/gump/public/workspace/mvnlocalrepo/shared/ant/ant-optional/1.5.1/ant-optional-1.5.1.jar
    urls[29] = file:/srv/gump/public/workspace/mvnlocalrepo/shared/jdom/jdom/b9/jdom-b9.jar
    Number of imports: 10
    import: org.codehaus.classworlds.Entry@a6c57a42
    import: org.codehaus.classworlds.Entry@12f43f3b
    import: org.codehaus.classworlds.Entry@20025374
    import: org.codehaus.classworlds.Entry@f8e44ca4
    import: org.codehaus.classworlds.Entry@92758522
    import: org.codehaus.classworlds.Entry@ebf2705b
    import: org.codehaus.classworlds.Entry@bb25e54
    import: org.codehaus.classworlds.Entry@bece5185
    import: org.codehaus.classworlds.Entry@3fee8e37
    import: org.codehaus.classworlds.Entry@3fee19d8


    this realm = plexus.core
    urls[0] = file:/opt/maven2/lib/maven-2.2.1-uber.jar
    Number of imports: 10
    import: org.codehaus.classworlds.Entry@a6c57a42
    import: org.codehaus.classworlds.Entry@12f43f3b
    import: org.codehaus.classworlds.Entry@20025374
    import: org.codehaus.classworlds.Entry@f8e44ca4
    import: org.codehaus.classworlds.Entry@92758522
    import: org.codehaus.classworlds.Entry@ebf2705b
    import: org.codehaus.classworlds.Entry@bb25e54
    import: org.codehaus.classworlds.Entry@bece5185
    import: org.codehaus.classworlds.Entry@3fee8e37
    import: org.codehaus.classworlds.Entry@3fee19d8
    -----------------------------------------------------
    [INFO] ------------------------------------------------------------------------
    [ERROR] BUILD ERROR
    [INFO] ------------------------------------------------------------------------
    [INFO] Internal error in the plugin manager executing goal 'org.apache.torque:torque-maven-plugin:3.3:om': Unable to load the mojo 'org.apache.torque:torque-maven-plugin:3.3:om' in the plugin 'org.apache.torque:torque-maven-plugin'. A required class is missing: org/apache/torque/task/TorqueDataModelTask
    org.apache.torque.task.TorqueDataModelTask
    [INFO] ------------------------------------------------------------------------
    [INFO] For more information, run Maven with the -e switch
    [INFO] ------------------------------------------------------------------------
    [INFO] Total time: 24 seconds
    [INFO] Finished at: Thu May 12 06:09:59 UTC 2011
    [INFO] Final Memory: 30M/72M
    [INFO] ------------------------------------------------------------------------
    ---------------------------------------------

    To subscribe to this information via syndicated feeds:
    - RSS: http://vmgump.apache.org/gump/public/turbine-core/turbine-core/rss.xml
    - Atom: http://vmgump.apache.org/gump/public/turbine-core/turbine-core/atom.xml

    ============================== Gump Tracking Only ===
    Produced by Apache Gump(TM) version 2.3.
    Gump Run 13000012052011, vmgump.apache.org:vmgump:13000012052011
    Gump E-mail Identifier (unique within run) #32.

    --
    Apache Gump
    http://gump.apache.org/ [Instance: vmgump]

    ---------------------------------------------------------------------
    To unsubscribe, e-mail: dev-unsubscribe@turbine.apache.org
    For additional commands, e-mail: dev-help@turbine.apache.org
  • Anonymous at May 13, 2011 at 6:03 am
    To whom it may engage...

    This is an automated request, but not an unsolicited one. For
    more information please visit http://gump.apache.org/nagged.html,
    and/or contact the folk at general@gump.apache.org.

    Project turbine-core has an issue affecting its community integration.
    This issue affects 2 projects,
    and has been outstanding for 145 runs.
    The current state of this project is 'Failed', with reason 'Build Failed'.
    For reference only, the following projects are affected by this:
    - turbine-core : A servlet based framework.
    - turbine-core-test : A servlet based framework.


    Full details are available at:
    http://vmgump.apache.org/gump/public/turbine-core/turbine-core/index.html

    That said, some information snippets are provided here.

    The following annotations (debug/informational/warning/error messages) were provided:
    -INFO- Optional dependency commons-fileupload prerequisite failed with reason build failed
    -INFO- Optional dependency httpunit failed with reason build failed
    -DEBUG- (Apache Gump generated) Apache Maven Settings in: /srv/gump/public/workspace/turbine-core/gump_mvn_settings.xml
    -INFO- Failed with reason build failed
    -DEBUG- Maven POM in: /srv/gump/public/workspace/turbine-core/pom.xml
    -INFO- Failed to extract fallback artifacts from Gump Repository



    The following work was performed:
    http://vmgump.apache.org/gump/public/turbine-core/turbine-core/gump_work/build_turbine-core_turbine-core.html
    Work Name: build_turbine-core_turbine-core (Type: Build)
    Work ended in a state of : Failed
    Elapsed: 27 secs
    Command Line: /opt/maven2/bin/mvn --batch-mode -DskipTests=true --settings /srv/gump/public/workspace/turbine-core/gump_mvn_settings.xml package
    [Working Directory: /srv/gump/public/workspace/turbine-core]
    M2_HOME: /opt/maven2
    ---------------------------------------------
    urls[19] = file:/srv/gump/public/workspace/mvnlocalrepo/shared/xml-apis/xml-apis/1.0.b2/xml-apis-1.0.b2.jar
    urls[20] = file:/srv/gump/public/workspace/mvnlocalrepo/shared/commons-configuration/commons-configuration/1.4/commons-configuration-1.4.jar
    urls[21] = file:/srv/gump/public/workspace/mvnlocalrepo/shared/commons-logging/commons-logging-api/1.0.4/commons-logging-api-1.0.4.jar
    urls[22] = file:/srv/gump/public/workspace/mvnlocalrepo/shared/commons-digester/commons-digester/1.8/commons-digester-1.8.jar
    urls[23] = file:/srv/gump/public/workspace/mvnlocalrepo/shared/commons-beanutils/commons-beanutils/1.7.0/commons-beanutils-1.7.0.jar
    urls[24] = file:/srv/gump/public/workspace/mvnlocalrepo/shared/commons-beanutils/commons-beanutils-core/1.7.0/commons-beanutils-core-1.7.0.jar
    urls[25] = file:/srv/gump/public/workspace/mvnlocalrepo/shared/commons-codec/commons-codec/1.3/commons-codec-1.3.jar
    urls[26] = file:/srv/gump/public/workspace/mvnlocalrepo/shared/commons-jxpath/commons-jxpath/1.2/commons-jxpath-1.2.jar
    urls[27] = file:/srv/gump/public/workspace/mvnlocalrepo/shared/xerces/xerces/1.2.3/xerces-1.2.3.jar
    urls[28] = file:/srv/gump/public/workspace/mvnlocalrepo/shared/ant/ant-optional/1.5.1/ant-optional-1.5.1.jar
    urls[29] = file:/srv/gump/public/workspace/mvnlocalrepo/shared/jdom/jdom/b9/jdom-b9.jar
    Number of imports: 10
    import: org.codehaus.classworlds.Entry@a6c57a42
    import: org.codehaus.classworlds.Entry@12f43f3b
    import: org.codehaus.classworlds.Entry@20025374
    import: org.codehaus.classworlds.Entry@f8e44ca4
    import: org.codehaus.classworlds.Entry@92758522
    import: org.codehaus.classworlds.Entry@ebf2705b
    import: org.codehaus.classworlds.Entry@bb25e54
    import: org.codehaus.classworlds.Entry@bece5185
    import: org.codehaus.classworlds.Entry@3fee8e37
    import: org.codehaus.classworlds.Entry@3fee19d8


    this realm = plexus.core
    urls[0] = file:/opt/maven2/lib/maven-2.2.1-uber.jar
    Number of imports: 10
    import: org.codehaus.classworlds.Entry@a6c57a42
    import: org.codehaus.classworlds.Entry@12f43f3b
    import: org.codehaus.classworlds.Entry@20025374
    import: org.codehaus.classworlds.Entry@f8e44ca4
    import: org.codehaus.classworlds.Entry@92758522
    import: org.codehaus.classworlds.Entry@ebf2705b
    import: org.codehaus.classworlds.Entry@bb25e54
    import: org.codehaus.classworlds.Entry@bece5185
    import: org.codehaus.classworlds.Entry@3fee8e37
    import: org.codehaus.classworlds.Entry@3fee19d8
    -----------------------------------------------------
    [INFO] ------------------------------------------------------------------------
    [ERROR] BUILD ERROR
    [INFO] ------------------------------------------------------------------------
    [INFO] Internal error in the plugin manager executing goal 'org.apache.torque:torque-maven-plugin:3.3:om': Unable to load the mojo 'org.apache.torque:torque-maven-plugin:3.3:om' in the plugin 'org.apache.torque:torque-maven-plugin'. A required class is missing: org/apache/torque/task/TorqueDataModelTask
    org.apache.torque.task.TorqueDataModelTask
    [INFO] ------------------------------------------------------------------------
    [INFO] For more information, run Maven with the -e switch
    [INFO] ------------------------------------------------------------------------
    [INFO] Total time: 26 seconds
    [INFO] Finished at: Fri May 13 06:02:47 UTC 2011
    [INFO] Final Memory: 30M/72M
    [INFO] ------------------------------------------------------------------------
    ---------------------------------------------

    To subscribe to this information via syndicated feeds:
    - RSS: http://vmgump.apache.org/gump/public/turbine-core/turbine-core/rss.xml
    - Atom: http://vmgump.apache.org/gump/public/turbine-core/turbine-core/atom.xml

    ============================== Gump Tracking Only ===
    Produced by Apache Gump(TM) version 2.3.
    Gump Run 10000013052011, vmgump.apache.org:vmgump:10000013052011
    Gump E-mail Identifier (unique within run) #32.

    --
    Apache Gump
    http://gump.apache.org/ [Instance: vmgump]

    ---------------------------------------------------------------------
    To unsubscribe, e-mail: dev-unsubscribe@turbine.apache.org
    For additional commands, e-mail: dev-help@turbine.apache.org
  • Anonymous at May 14, 2011 at 7:16 am
    To whom it may engage...

    This is an automated request, but not an unsolicited one. For
    more information please visit http://gump.apache.org/nagged.html,
    and/or contact the folk at general@gump.apache.org.

    Project turbine-core has an issue affecting its community integration.
    This issue affects 2 projects,
    and has been outstanding for 147 runs.
    The current state of this project is 'Failed', with reason 'Build Failed'.
    For reference only, the following projects are affected by this:
    - turbine-core : A servlet based framework.
    - turbine-core-test : A servlet based framework.


    Full details are available at:
    http://vmgump.apache.org/gump/public/turbine-core/turbine-core/index.html

    That said, some information snippets are provided here.

    The following annotations (debug/informational/warning/error messages) were provided:
    -INFO- Optional dependency dom4j prerequisite failed with reason build timed out
    -INFO- Optional dependency commons-fileupload prerequisite failed with reason build failed
    -INFO- Optional dependency httpunit failed with reason build failed
    -DEBUG- (Apache Gump generated) Apache Maven Settings in: /srv/gump/public/workspace/turbine-core/gump_mvn_settings.xml
    -INFO- Failed with reason build failed
    -DEBUG- Maven POM in: /srv/gump/public/workspace/turbine-core/pom.xml
    -INFO- Failed to extract fallback artifacts from Gump Repository



    The following work was performed:
    http://vmgump.apache.org/gump/public/turbine-core/turbine-core/gump_work/build_turbine-core_turbine-core.html
    Work Name: build_turbine-core_turbine-core (Type: Build)
    Work ended in a state of : Failed
    Elapsed: 27 secs
    Command Line: /opt/maven2/bin/mvn --batch-mode -DskipTests=true --settings /srv/gump/public/workspace/turbine-core/gump_mvn_settings.xml package
    [Working Directory: /srv/gump/public/workspace/turbine-core]
    M2_HOME: /opt/maven2
    ---------------------------------------------
    urls[19] = file:/srv/gump/public/workspace/mvnlocalrepo/shared/xml-apis/xml-apis/1.0.b2/xml-apis-1.0.b2.jar
    urls[20] = file:/srv/gump/public/workspace/mvnlocalrepo/shared/commons-configuration/commons-configuration/1.4/commons-configuration-1.4.jar
    urls[21] = file:/srv/gump/public/workspace/mvnlocalrepo/shared/commons-logging/commons-logging-api/1.0.4/commons-logging-api-1.0.4.jar
    urls[22] = file:/srv/gump/public/workspace/mvnlocalrepo/shared/commons-digester/commons-digester/1.8/commons-digester-1.8.jar
    urls[23] = file:/srv/gump/public/workspace/mvnlocalrepo/shared/commons-beanutils/commons-beanutils/1.7.0/commons-beanutils-1.7.0.jar
    urls[24] = file:/srv/gump/public/workspace/mvnlocalrepo/shared/commons-beanutils/commons-beanutils-core/1.7.0/commons-beanutils-core-1.7.0.jar
    urls[25] = file:/srv/gump/public/workspace/mvnlocalrepo/shared/commons-codec/commons-codec/1.3/commons-codec-1.3.jar
    urls[26] = file:/srv/gump/public/workspace/mvnlocalrepo/shared/commons-jxpath/commons-jxpath/1.2/commons-jxpath-1.2.jar
    urls[27] = file:/srv/gump/public/workspace/mvnlocalrepo/shared/xerces/xerces/1.2.3/xerces-1.2.3.jar
    urls[28] = file:/srv/gump/public/workspace/mvnlocalrepo/shared/ant/ant-optional/1.5.1/ant-optional-1.5.1.jar
    urls[29] = file:/srv/gump/public/workspace/mvnlocalrepo/shared/jdom/jdom/b9/jdom-b9.jar
    Number of imports: 10
    import: org.codehaus.classworlds.Entry@a6c57a42
    import: org.codehaus.classworlds.Entry@12f43f3b
    import: org.codehaus.classworlds.Entry@20025374
    import: org.codehaus.classworlds.Entry@f8e44ca4
    import: org.codehaus.classworlds.Entry@92758522
    import: org.codehaus.classworlds.Entry@ebf2705b
    import: org.codehaus.classworlds.Entry@bb25e54
    import: org.codehaus.classworlds.Entry@bece5185
    import: org.codehaus.classworlds.Entry@3fee8e37
    import: org.codehaus.classworlds.Entry@3fee19d8


    this realm = plexus.core
    urls[0] = file:/opt/maven2/lib/maven-2.2.1-uber.jar
    Number of imports: 10
    import: org.codehaus.classworlds.Entry@a6c57a42
    import: org.codehaus.classworlds.Entry@12f43f3b
    import: org.codehaus.classworlds.Entry@20025374
    import: org.codehaus.classworlds.Entry@f8e44ca4
    import: org.codehaus.classworlds.Entry@92758522
    import: org.codehaus.classworlds.Entry@ebf2705b
    import: org.codehaus.classworlds.Entry@bb25e54
    import: org.codehaus.classworlds.Entry@bece5185
    import: org.codehaus.classworlds.Entry@3fee8e37
    import: org.codehaus.classworlds.Entry@3fee19d8
    -----------------------------------------------------
    [INFO] ------------------------------------------------------------------------
    [ERROR] BUILD ERROR
    [INFO] ------------------------------------------------------------------------
    [INFO] Internal error in the plugin manager executing goal 'org.apache.torque:torque-maven-plugin:3.3:om': Unable to load the mojo 'org.apache.torque:torque-maven-plugin:3.3:om' in the plugin 'org.apache.torque:torque-maven-plugin'. A required class is missing: org/apache/torque/task/TorqueDataModelTask
    org.apache.torque.task.TorqueDataModelTask
    [INFO] ------------------------------------------------------------------------
    [INFO] For more information, run Maven with the -e switch
    [INFO] ------------------------------------------------------------------------
    [INFO] Total time: 26 seconds
    [INFO] Finished at: Sat May 14 07:16:20 UTC 2011
    [INFO] Final Memory: 30M/72M
    [INFO] ------------------------------------------------------------------------
    ---------------------------------------------

    To subscribe to this information via syndicated feeds:
    - RSS: http://vmgump.apache.org/gump/public/turbine-core/turbine-core/rss.xml
    - Atom: http://vmgump.apache.org/gump/public/turbine-core/turbine-core/atom.xml

    ============================== Gump Tracking Only ===
    Produced by Apache Gump(TM) version 2.3.
    Gump Run 10000014052011, vmgump.apache.org:vmgump:10000014052011
    Gump E-mail Identifier (unique within run) #30.

    --
    Apache Gump
    http://gump.apache.org/ [Instance: vmgump]

    ---------------------------------------------------------------------
    To unsubscribe, e-mail: dev-unsubscribe@turbine.apache.org
    For additional commands, e-mail: dev-help@turbine.apache.org
  • Anonymous at May 15, 2011 at 6:15 am
    To whom it may engage...

    This is an automated request, but not an unsolicited one. For
    more information please visit http://gump.apache.org/nagged.html,
    and/or contact the folk at general@gump.apache.org.

    Project turbine-core has an issue affecting its community integration.
    This issue affects 2 projects,
    and has been outstanding for 149 runs.
    The current state of this project is 'Failed', with reason 'Build Failed'.
    For reference only, the following projects are affected by this:
    - turbine-core : A servlet based framework.
    - turbine-core-test : A servlet based framework.


    Full details are available at:
    http://vmgump.apache.org/gump/public/turbine-core/turbine-core/index.html

    That said, some information snippets are provided here.

    The following annotations (debug/informational/warning/error messages) were provided:
    -INFO- Optional dependency commons-fileupload prerequisite failed with reason build failed
    -INFO- Optional dependency httpunit failed with reason build failed
    -DEBUG- (Apache Gump generated) Apache Maven Settings in: /srv/gump/public/workspace/turbine-core/gump_mvn_settings.xml
    -INFO- Failed with reason build failed
    -DEBUG- Maven POM in: /srv/gump/public/workspace/turbine-core/pom.xml
    -INFO- Failed to extract fallback artifacts from Gump Repository



    The following work was performed:
    http://vmgump.apache.org/gump/public/turbine-core/turbine-core/gump_work/build_turbine-core_turbine-core.html
    Work Name: build_turbine-core_turbine-core (Type: Build)
    Work ended in a state of : Failed
    Elapsed: 25 secs
    Command Line: /opt/maven2/bin/mvn --batch-mode -DskipTests=true --settings /srv/gump/public/workspace/turbine-core/gump_mvn_settings.xml package
    [Working Directory: /srv/gump/public/workspace/turbine-core]
    M2_HOME: /opt/maven2
    ---------------------------------------------
    urls[19] = file:/srv/gump/public/workspace/mvnlocalrepo/shared/xml-apis/xml-apis/1.0.b2/xml-apis-1.0.b2.jar
    urls[20] = file:/srv/gump/public/workspace/mvnlocalrepo/shared/commons-configuration/commons-configuration/1.4/commons-configuration-1.4.jar
    urls[21] = file:/srv/gump/public/workspace/mvnlocalrepo/shared/commons-logging/commons-logging-api/1.0.4/commons-logging-api-1.0.4.jar
    urls[22] = file:/srv/gump/public/workspace/mvnlocalrepo/shared/commons-digester/commons-digester/1.8/commons-digester-1.8.jar
    urls[23] = file:/srv/gump/public/workspace/mvnlocalrepo/shared/commons-beanutils/commons-beanutils/1.7.0/commons-beanutils-1.7.0.jar
    urls[24] = file:/srv/gump/public/workspace/mvnlocalrepo/shared/commons-beanutils/commons-beanutils-core/1.7.0/commons-beanutils-core-1.7.0.jar
    urls[25] = file:/srv/gump/public/workspace/mvnlocalrepo/shared/commons-codec/commons-codec/1.3/commons-codec-1.3.jar
    urls[26] = file:/srv/gump/public/workspace/mvnlocalrepo/shared/commons-jxpath/commons-jxpath/1.2/commons-jxpath-1.2.jar
    urls[27] = file:/srv/gump/public/workspace/mvnlocalrepo/shared/xerces/xerces/1.2.3/xerces-1.2.3.jar
    urls[28] = file:/srv/gump/public/workspace/mvnlocalrepo/shared/ant/ant-optional/1.5.1/ant-optional-1.5.1.jar
    urls[29] = file:/srv/gump/public/workspace/mvnlocalrepo/shared/jdom/jdom/b9/jdom-b9.jar
    Number of imports: 10
    import: org.codehaus.classworlds.Entry@a6c57a42
    import: org.codehaus.classworlds.Entry@12f43f3b
    import: org.codehaus.classworlds.Entry@20025374
    import: org.codehaus.classworlds.Entry@f8e44ca4
    import: org.codehaus.classworlds.Entry@92758522
    import: org.codehaus.classworlds.Entry@ebf2705b
    import: org.codehaus.classworlds.Entry@bb25e54
    import: org.codehaus.classworlds.Entry@bece5185
    import: org.codehaus.classworlds.Entry@3fee8e37
    import: org.codehaus.classworlds.Entry@3fee19d8


    this realm = plexus.core
    urls[0] = file:/opt/maven2/lib/maven-2.2.1-uber.jar
    Number of imports: 10
    import: org.codehaus.classworlds.Entry@a6c57a42
    import: org.codehaus.classworlds.Entry@12f43f3b
    import: org.codehaus.classworlds.Entry@20025374
    import: org.codehaus.classworlds.Entry@f8e44ca4
    import: org.codehaus.classworlds.Entry@92758522
    import: org.codehaus.classworlds.Entry@ebf2705b
    import: org.codehaus.classworlds.Entry@bb25e54
    import: org.codehaus.classworlds.Entry@bece5185
    import: org.codehaus.classworlds.Entry@3fee8e37
    import: org.codehaus.classworlds.Entry@3fee19d8
    -----------------------------------------------------
    [INFO] ------------------------------------------------------------------------
    [ERROR] BUILD ERROR
    [INFO] ------------------------------------------------------------------------
    [INFO] Internal error in the plugin manager executing goal 'org.apache.torque:torque-maven-plugin:3.3:om': Unable to load the mojo 'org.apache.torque:torque-maven-plugin:3.3:om' in the plugin 'org.apache.torque:torque-maven-plugin'. A required class is missing: org/apache/torque/task/TorqueDataModelTask
    org.apache.torque.task.TorqueDataModelTask
    [INFO] ------------------------------------------------------------------------
    [INFO] For more information, run Maven with the -e switch
    [INFO] ------------------------------------------------------------------------
    [INFO] Total time: 24 seconds
    [INFO] Finished at: Sun May 15 06:14:52 UTC 2011
    [INFO] Final Memory: 30M/72M
    [INFO] ------------------------------------------------------------------------
    ---------------------------------------------

    To subscribe to this information via syndicated feeds:
    - RSS: http://vmgump.apache.org/gump/public/turbine-core/turbine-core/rss.xml
    - Atom: http://vmgump.apache.org/gump/public/turbine-core/turbine-core/atom.xml

    ============================== Gump Tracking Only ===
    Produced by Apache Gump(TM) version 2.3.
    Gump Run 09000015052011, vmgump.apache.org:vmgump:09000015052011
    Gump E-mail Identifier (unique within run) #35.

    --
    Apache Gump
    http://gump.apache.org/ [Instance: vmgump]

    ---------------------------------------------------------------------
    To unsubscribe, e-mail: dev-unsubscribe@turbine.apache.org
    For additional commands, e-mail: dev-help@turbine.apache.org
  • Anonymous at May 16, 2011 at 6:27 am
    To whom it may engage...

    This is an automated request, but not an unsolicited one. For
    more information please visit http://gump.apache.org/nagged.html,
    and/or contact the folk at general@gump.apache.org.

    Project turbine-core has an issue affecting its community integration.
    This issue affects 2 projects,
    and has been outstanding for 151 runs.
    The current state of this project is 'Failed', with reason 'Build Failed'.
    For reference only, the following projects are affected by this:
    - turbine-core : A servlet based framework.
    - turbine-core-test : A servlet based framework.


    Full details are available at:
    http://vmgump.apache.org/gump/public/turbine-core/turbine-core/index.html

    That said, some information snippets are provided here.

    The following annotations (debug/informational/warning/error messages) were provided:
    -INFO- Optional dependency commons-fileupload prerequisite failed with reason build failed
    -INFO- Optional dependency httpunit failed with reason build failed
    -DEBUG- (Apache Gump generated) Apache Maven Settings in: /srv/gump/public/workspace/turbine-core/gump_mvn_settings.xml
    -INFO- Failed with reason build failed
    -DEBUG- Maven POM in: /srv/gump/public/workspace/turbine-core/pom.xml
    -INFO- Failed to extract fallback artifacts from Gump Repository



    The following work was performed:
    http://vmgump.apache.org/gump/public/turbine-core/turbine-core/gump_work/build_turbine-core_turbine-core.html
    Work Name: build_turbine-core_turbine-core (Type: Build)
    Work ended in a state of : Failed
    Elapsed: 28 secs
    Command Line: /opt/maven2/bin/mvn --batch-mode -DskipTests=true --settings /srv/gump/public/workspace/turbine-core/gump_mvn_settings.xml package
    [Working Directory: /srv/gump/public/workspace/turbine-core]
    M2_HOME: /opt/maven2
    ---------------------------------------------
    urls[19] = file:/srv/gump/public/workspace/mvnlocalrepo/shared/xml-apis/xml-apis/1.0.b2/xml-apis-1.0.b2.jar
    urls[20] = file:/srv/gump/public/workspace/mvnlocalrepo/shared/commons-configuration/commons-configuration/1.4/commons-configuration-1.4.jar
    urls[21] = file:/srv/gump/public/workspace/mvnlocalrepo/shared/commons-logging/commons-logging-api/1.0.4/commons-logging-api-1.0.4.jar
    urls[22] = file:/srv/gump/public/workspace/mvnlocalrepo/shared/commons-digester/commons-digester/1.8/commons-digester-1.8.jar
    urls[23] = file:/srv/gump/public/workspace/mvnlocalrepo/shared/commons-beanutils/commons-beanutils/1.7.0/commons-beanutils-1.7.0.jar
    urls[24] = file:/srv/gump/public/workspace/mvnlocalrepo/shared/commons-beanutils/commons-beanutils-core/1.7.0/commons-beanutils-core-1.7.0.jar
    urls[25] = file:/srv/gump/public/workspace/mvnlocalrepo/shared/commons-codec/commons-codec/1.3/commons-codec-1.3.jar
    urls[26] = file:/srv/gump/public/workspace/mvnlocalrepo/shared/commons-jxpath/commons-jxpath/1.2/commons-jxpath-1.2.jar
    urls[27] = file:/srv/gump/public/workspace/mvnlocalrepo/shared/xerces/xerces/1.2.3/xerces-1.2.3.jar
    urls[28] = file:/srv/gump/public/workspace/mvnlocalrepo/shared/ant/ant-optional/1.5.1/ant-optional-1.5.1.jar
    urls[29] = file:/srv/gump/public/workspace/mvnlocalrepo/shared/jdom/jdom/b9/jdom-b9.jar
    Number of imports: 10
    import: org.codehaus.classworlds.Entry@a6c57a42
    import: org.codehaus.classworlds.Entry@12f43f3b
    import: org.codehaus.classworlds.Entry@20025374
    import: org.codehaus.classworlds.Entry@f8e44ca4
    import: org.codehaus.classworlds.Entry@92758522
    import: org.codehaus.classworlds.Entry@ebf2705b
    import: org.codehaus.classworlds.Entry@bb25e54
    import: org.codehaus.classworlds.Entry@bece5185
    import: org.codehaus.classworlds.Entry@3fee8e37
    import: org.codehaus.classworlds.Entry@3fee19d8


    this realm = plexus.core
    urls[0] = file:/opt/maven2/lib/maven-2.2.1-uber.jar
    Number of imports: 10
    import: org.codehaus.classworlds.Entry@a6c57a42
    import: org.codehaus.classworlds.Entry@12f43f3b
    import: org.codehaus.classworlds.Entry@20025374
    import: org.codehaus.classworlds.Entry@f8e44ca4
    import: org.codehaus.classworlds.Entry@92758522
    import: org.codehaus.classworlds.Entry@ebf2705b
    import: org.codehaus.classworlds.Entry@bb25e54
    import: org.codehaus.classworlds.Entry@bece5185
    import: org.codehaus.classworlds.Entry@3fee8e37
    import: org.codehaus.classworlds.Entry@3fee19d8
    -----------------------------------------------------
    [INFO] ------------------------------------------------------------------------
    [ERROR] BUILD ERROR
    [INFO] ------------------------------------------------------------------------
    [INFO] Internal error in the plugin manager executing goal 'org.apache.torque:torque-maven-plugin:3.3:om': Unable to load the mojo 'org.apache.torque:torque-maven-plugin:3.3:om' in the plugin 'org.apache.torque:torque-maven-plugin'. A required class is missing: org/apache/torque/task/TorqueDataModelTask
    org.apache.torque.task.TorqueDataModelTask
    [INFO] ------------------------------------------------------------------------
    [INFO] For more information, run Maven with the -e switch
    [INFO] ------------------------------------------------------------------------
    [INFO] Total time: 27 seconds
    [INFO] Finished at: Mon May 16 06:27:24 UTC 2011
    [INFO] Final Memory: 30M/72M
    [INFO] ------------------------------------------------------------------------
    ---------------------------------------------

    To subscribe to this information via syndicated feeds:
    - RSS: http://vmgump.apache.org/gump/public/turbine-core/turbine-core/rss.xml
    - Atom: http://vmgump.apache.org/gump/public/turbine-core/turbine-core/atom.xml

    ============================== Gump Tracking Only ===
    Produced by Apache Gump(TM) version 2.3.
    Gump Run 09000016052011, vmgump.apache.org:vmgump:09000016052011
    Gump E-mail Identifier (unique within run) #33.

    --
    Apache Gump
    http://gump.apache.org/ [Instance: vmgump]

    ---------------------------------------------------------------------
    To unsubscribe, e-mail: dev-unsubscribe@turbine.apache.org
    For additional commands, e-mail: dev-help@turbine.apache.org
  • Anonymous at May 17, 2011 at 6:13 am
    To whom it may engage...

    This is an automated request, but not an unsolicited one. For
    more information please visit http://gump.apache.org/nagged.html,
    and/or contact the folk at general@gump.apache.org.

    Project turbine-core has an issue affecting its community integration.
    This issue affects 2 projects,
    and has been outstanding for 153 runs.
    The current state of this project is 'Failed', with reason 'Build Failed'.
    For reference only, the following projects are affected by this:
    - turbine-core : A servlet based framework.
    - turbine-core-test : A servlet based framework.


    Full details are available at:
    http://vmgump.apache.org/gump/public/turbine-core/turbine-core/index.html

    That said, some information snippets are provided here.

    The following annotations (debug/informational/warning/error messages) were provided:
    -INFO- Optional dependency commons-fileupload prerequisite failed with reason build failed
    -INFO- Optional dependency httpunit failed with reason build failed
    -DEBUG- (Apache Gump generated) Apache Maven Settings in: /srv/gump/public/workspace/turbine-core/gump_mvn_settings.xml
    -INFO- Failed with reason build failed
    -DEBUG- Maven POM in: /srv/gump/public/workspace/turbine-core/pom.xml
    -INFO- Failed to extract fallback artifacts from Gump Repository



    The following work was performed:
    http://vmgump.apache.org/gump/public/turbine-core/turbine-core/gump_work/build_turbine-core_turbine-core.html
    Work Name: build_turbine-core_turbine-core (Type: Build)
    Work ended in a state of : Failed
    Elapsed: 25 secs
    Command Line: /opt/maven2/bin/mvn --batch-mode -DskipTests=true --settings /srv/gump/public/workspace/turbine-core/gump_mvn_settings.xml package
    [Working Directory: /srv/gump/public/workspace/turbine-core]
    M2_HOME: /opt/maven2
    ---------------------------------------------
    urls[19] = file:/srv/gump/public/workspace/mvnlocalrepo/shared/xml-apis/xml-apis/1.0.b2/xml-apis-1.0.b2.jar
    urls[20] = file:/srv/gump/public/workspace/mvnlocalrepo/shared/commons-configuration/commons-configuration/1.4/commons-configuration-1.4.jar
    urls[21] = file:/srv/gump/public/workspace/mvnlocalrepo/shared/commons-logging/commons-logging-api/1.0.4/commons-logging-api-1.0.4.jar
    urls[22] = file:/srv/gump/public/workspace/mvnlocalrepo/shared/commons-digester/commons-digester/1.8/commons-digester-1.8.jar
    urls[23] = file:/srv/gump/public/workspace/mvnlocalrepo/shared/commons-beanutils/commons-beanutils/1.7.0/commons-beanutils-1.7.0.jar
    urls[24] = file:/srv/gump/public/workspace/mvnlocalrepo/shared/commons-beanutils/commons-beanutils-core/1.7.0/commons-beanutils-core-1.7.0.jar
    urls[25] = file:/srv/gump/public/workspace/mvnlocalrepo/shared/commons-codec/commons-codec/1.3/commons-codec-1.3.jar
    urls[26] = file:/srv/gump/public/workspace/mvnlocalrepo/shared/commons-jxpath/commons-jxpath/1.2/commons-jxpath-1.2.jar
    urls[27] = file:/srv/gump/public/workspace/mvnlocalrepo/shared/xerces/xerces/1.2.3/xerces-1.2.3.jar
    urls[28] = file:/srv/gump/public/workspace/mvnlocalrepo/shared/ant/ant-optional/1.5.1/ant-optional-1.5.1.jar
    urls[29] = file:/srv/gump/public/workspace/mvnlocalrepo/shared/jdom/jdom/b9/jdom-b9.jar
    Number of imports: 10
    import: org.codehaus.classworlds.Entry@a6c57a42
    import: org.codehaus.classworlds.Entry@12f43f3b
    import: org.codehaus.classworlds.Entry@20025374
    import: org.codehaus.classworlds.Entry@f8e44ca4
    import: org.codehaus.classworlds.Entry@92758522
    import: org.codehaus.classworlds.Entry@ebf2705b
    import: org.codehaus.classworlds.Entry@bb25e54
    import: org.codehaus.classworlds.Entry@bece5185
    import: org.codehaus.classworlds.Entry@3fee8e37
    import: org.codehaus.classworlds.Entry@3fee19d8


    this realm = plexus.core
    urls[0] = file:/opt/maven2/lib/maven-2.2.1-uber.jar
    Number of imports: 10
    import: org.codehaus.classworlds.Entry@a6c57a42
    import: org.codehaus.classworlds.Entry@12f43f3b
    import: org.codehaus.classworlds.Entry@20025374
    import: org.codehaus.classworlds.Entry@f8e44ca4
    import: org.codehaus.classworlds.Entry@92758522
    import: org.codehaus.classworlds.Entry@ebf2705b
    import: org.codehaus.classworlds.Entry@bb25e54
    import: org.codehaus.classworlds.Entry@bece5185
    import: org.codehaus.classworlds.Entry@3fee8e37
    import: org.codehaus.classworlds.Entry@3fee19d8
    -----------------------------------------------------
    [INFO] ------------------------------------------------------------------------
    [ERROR] BUILD ERROR
    [INFO] ------------------------------------------------------------------------
    [INFO] Internal error in the plugin manager executing goal 'org.apache.torque:torque-maven-plugin:3.3:om': Unable to load the mojo 'org.apache.torque:torque-maven-plugin:3.3:om' in the plugin 'org.apache.torque:torque-maven-plugin'. A required class is missing: org/apache/torque/task/TorqueDataModelTask
    org.apache.torque.task.TorqueDataModelTask
    [INFO] ------------------------------------------------------------------------
    [INFO] For more information, run Maven with the -e switch
    [INFO] ------------------------------------------------------------------------
    [INFO] Total time: 24 seconds
    [INFO] Finished at: Tue May 17 06:13:06 UTC 2011
    [INFO] Final Memory: 30M/72M
    [INFO] ------------------------------------------------------------------------
    ---------------------------------------------

    To subscribe to this information via syndicated feeds:
    - RSS: http://vmgump.apache.org/gump/public/turbine-core/turbine-core/rss.xml
    - Atom: http://vmgump.apache.org/gump/public/turbine-core/turbine-core/atom.xml

    ============================== Gump Tracking Only ===
    Produced by Apache Gump(TM) version 2.3.
    Gump Run 09000017052011, vmgump.apache.org:vmgump:09000017052011
    Gump E-mail Identifier (unique within run) #34.

    --
    Apache Gump
    http://gump.apache.org/ [Instance: vmgump]

    ---------------------------------------------------------------------
    To unsubscribe, e-mail: dev-unsubscribe@turbine.apache.org
    For additional commands, e-mail: dev-help@turbine.apache.org
  • Anonymous at May 18, 2011 at 6:01 am
    To whom it may engage...

    This is an automated request, but not an unsolicited one. For
    more information please visit http://gump.apache.org/nagged.html,
    and/or contact the folk at general@gump.apache.org.

    Project turbine-core has an issue affecting its community integration.
    This issue affects 2 projects,
    and has been outstanding for 155 runs.
    The current state of this project is 'Failed', with reason 'Build Failed'.
    For reference only, the following projects are affected by this:
    - turbine-core : A servlet based framework.
    - turbine-core-test : A servlet based framework.


    Full details are available at:
    http://vmgump.apache.org/gump/public/turbine-core/turbine-core/index.html

    That said, some information snippets are provided here.

    The following annotations (debug/informational/warning/error messages) were provided:
    -INFO- Optional dependency commons-fileupload prerequisite failed with reason build failed
    -INFO- Optional dependency httpunit failed with reason build failed
    -DEBUG- (Apache Gump generated) Apache Maven Settings in: /srv/gump/public/workspace/turbine-core/gump_mvn_settings.xml
    -INFO- Failed with reason build failed
    -DEBUG- Maven POM in: /srv/gump/public/workspace/turbine-core/pom.xml
    -INFO- Failed to extract fallback artifacts from Gump Repository



    The following work was performed:
    http://vmgump.apache.org/gump/public/turbine-core/turbine-core/gump_work/build_turbine-core_turbine-core.html
    Work Name: build_turbine-core_turbine-core (Type: Build)
    Work ended in a state of : Failed
    Elapsed: 31 secs
    Command Line: /opt/maven2/bin/mvn --batch-mode -DskipTests=true --settings /srv/gump/public/workspace/turbine-core/gump_mvn_settings.xml package
    [Working Directory: /srv/gump/public/workspace/turbine-core]
    M2_HOME: /opt/maven2
    ---------------------------------------------
    urls[19] = file:/srv/gump/public/workspace/mvnlocalrepo/shared/xml-apis/xml-apis/1.0.b2/xml-apis-1.0.b2.jar
    urls[20] = file:/srv/gump/public/workspace/mvnlocalrepo/shared/commons-configuration/commons-configuration/1.4/commons-configuration-1.4.jar
    urls[21] = file:/srv/gump/public/workspace/mvnlocalrepo/shared/commons-logging/commons-logging-api/1.0.4/commons-logging-api-1.0.4.jar
    urls[22] = file:/srv/gump/public/workspace/mvnlocalrepo/shared/commons-digester/commons-digester/1.8/commons-digester-1.8.jar
    urls[23] = file:/srv/gump/public/workspace/mvnlocalrepo/shared/commons-beanutils/commons-beanutils/1.7.0/commons-beanutils-1.7.0.jar
    urls[24] = file:/srv/gump/public/workspace/mvnlocalrepo/shared/commons-beanutils/commons-beanutils-core/1.7.0/commons-beanutils-core-1.7.0.jar
    urls[25] = file:/srv/gump/public/workspace/mvnlocalrepo/shared/commons-codec/commons-codec/1.3/commons-codec-1.3.jar
    urls[26] = file:/srv/gump/public/workspace/mvnlocalrepo/shared/commons-jxpath/commons-jxpath/1.2/commons-jxpath-1.2.jar
    urls[27] = file:/srv/gump/public/workspace/mvnlocalrepo/shared/xerces/xerces/1.2.3/xerces-1.2.3.jar
    urls[28] = file:/srv/gump/public/workspace/mvnlocalrepo/shared/ant/ant-optional/1.5.1/ant-optional-1.5.1.jar
    urls[29] = file:/srv/gump/public/workspace/mvnlocalrepo/shared/jdom/jdom/b9/jdom-b9.jar
    Number of imports: 10
    import: org.codehaus.classworlds.Entry@a6c57a42
    import: org.codehaus.classworlds.Entry@12f43f3b
    import: org.codehaus.classworlds.Entry@20025374
    import: org.codehaus.classworlds.Entry@f8e44ca4
    import: org.codehaus.classworlds.Entry@92758522
    import: org.codehaus.classworlds.Entry@ebf2705b
    import: org.codehaus.classworlds.Entry@bb25e54
    import: org.codehaus.classworlds.Entry@bece5185
    import: org.codehaus.classworlds.Entry@3fee8e37
    import: org.codehaus.classworlds.Entry@3fee19d8


    this realm = plexus.core
    urls[0] = file:/opt/maven2/lib/maven-2.2.1-uber.jar
    Number of imports: 10
    import: org.codehaus.classworlds.Entry@a6c57a42
    import: org.codehaus.classworlds.Entry@12f43f3b
    import: org.codehaus.classworlds.Entry@20025374
    import: org.codehaus.classworlds.Entry@f8e44ca4
    import: org.codehaus.classworlds.Entry@92758522
    import: org.codehaus.classworlds.Entry@ebf2705b
    import: org.codehaus.classworlds.Entry@bb25e54
    import: org.codehaus.classworlds.Entry@bece5185
    import: org.codehaus.classworlds.Entry@3fee8e37
    import: org.codehaus.classworlds.Entry@3fee19d8
    -----------------------------------------------------
    [INFO] ------------------------------------------------------------------------
    [ERROR] BUILD ERROR
    [INFO] ------------------------------------------------------------------------
    [INFO] Internal error in the plugin manager executing goal 'org.apache.torque:torque-maven-plugin:3.3:om': Unable to load the mojo 'org.apache.torque:torque-maven-plugin:3.3:om' in the plugin 'org.apache.torque:torque-maven-plugin'. A required class is missing: org/apache/torque/task/TorqueDataModelTask
    org.apache.torque.task.TorqueDataModelTask
    [INFO] ------------------------------------------------------------------------
    [INFO] For more information, run Maven with the -e switch
    [INFO] ------------------------------------------------------------------------
    [INFO] Total time: 30 seconds
    [INFO] Finished at: Wed May 18 06:01:18 UTC 2011
    [INFO] Final Memory: 30M/72M
    [INFO] ------------------------------------------------------------------------
    ---------------------------------------------

    To subscribe to this information via syndicated feeds:
    - RSS: http://vmgump.apache.org/gump/public/turbine-core/turbine-core/rss.xml
    - Atom: http://vmgump.apache.org/gump/public/turbine-core/turbine-core/atom.xml

    ============================== Gump Tracking Only ===
    Produced by Apache Gump(TM) version 2.3.
    Gump Run 14000018052011, vmgump.apache.org:vmgump:14000018052011
    Gump E-mail Identifier (unique within run) #36.

    --
    Apache Gump
    http://gump.apache.org/ [Instance: vmgump]

    ---------------------------------------------------------------------
    To unsubscribe, e-mail: dev-unsubscribe@turbine.apache.org
    For additional commands, e-mail: dev-help@turbine.apache.org
  • Anonymous at May 19, 2011 at 6:03 am
    To whom it may engage...

    This is an automated request, but not an unsolicited one. For
    more information please visit http://gump.apache.org/nagged.html,
    and/or contact the folk at general@gump.apache.org.

    Project turbine-core has an issue affecting its community integration.
    This issue affects 2 projects,
    and has been outstanding for 157 runs.
    The current state of this project is 'Failed', with reason 'Build Failed'.
    For reference only, the following projects are affected by this:
    - turbine-core : A servlet based framework.
    - turbine-core-test : A servlet based framework.


    Full details are available at:
    http://vmgump.apache.org/gump/public/turbine-core/turbine-core/index.html

    That said, some information snippets are provided here.

    The following annotations (debug/informational/warning/error messages) were provided:
    -INFO- Optional dependency commons-fileupload prerequisite failed with reason build failed
    -INFO- Optional dependency httpunit failed with reason build failed
    -DEBUG- (Apache Gump generated) Apache Maven Settings in: /srv/gump/public/workspace/turbine-core/gump_mvn_settings.xml
    -INFO- Failed with reason build failed
    -DEBUG- Maven POM in: /srv/gump/public/workspace/turbine-core/pom.xml
    -INFO- Failed to extract fallback artifacts from Gump Repository



    The following work was performed:
    http://vmgump.apache.org/gump/public/turbine-core/turbine-core/gump_work/build_turbine-core_turbine-core.html
    Work Name: build_turbine-core_turbine-core (Type: Build)
    Work ended in a state of : Failed
    Elapsed: 27 secs
    Command Line: /opt/maven2/bin/mvn --batch-mode -DskipTests=true --settings /srv/gump/public/workspace/turbine-core/gump_mvn_settings.xml package
    [Working Directory: /srv/gump/public/workspace/turbine-core]
    M2_HOME: /opt/maven2
    ---------------------------------------------
    urls[19] = file:/srv/gump/public/workspace/mvnlocalrepo/shared/xml-apis/xml-apis/1.0.b2/xml-apis-1.0.b2.jar
    urls[20] = file:/srv/gump/public/workspace/mvnlocalrepo/shared/commons-configuration/commons-configuration/1.4/commons-configuration-1.4.jar
    urls[21] = file:/srv/gump/public/workspace/mvnlocalrepo/shared/commons-logging/commons-logging-api/1.0.4/commons-logging-api-1.0.4.jar
    urls[22] = file:/srv/gump/public/workspace/mvnlocalrepo/shared/commons-digester/commons-digester/1.8/commons-digester-1.8.jar
    urls[23] = file:/srv/gump/public/workspace/mvnlocalrepo/shared/commons-beanutils/commons-beanutils/1.7.0/commons-beanutils-1.7.0.jar
    urls[24] = file:/srv/gump/public/workspace/mvnlocalrepo/shared/commons-beanutils/commons-beanutils-core/1.7.0/commons-beanutils-core-1.7.0.jar
    urls[25] = file:/srv/gump/public/workspace/mvnlocalrepo/shared/commons-codec/commons-codec/1.3/commons-codec-1.3.jar
    urls[26] = file:/srv/gump/public/workspace/mvnlocalrepo/shared/commons-jxpath/commons-jxpath/1.2/commons-jxpath-1.2.jar
    urls[27] = file:/srv/gump/public/workspace/mvnlocalrepo/shared/xerces/xerces/1.2.3/xerces-1.2.3.jar
    urls[28] = file:/srv/gump/public/workspace/mvnlocalrepo/shared/ant/ant-optional/1.5.1/ant-optional-1.5.1.jar
    urls[29] = file:/srv/gump/public/workspace/mvnlocalrepo/shared/jdom/jdom/b9/jdom-b9.jar
    Number of imports: 10
    import: org.codehaus.classworlds.Entry@a6c57a42
    import: org.codehaus.classworlds.Entry@12f43f3b
    import: org.codehaus.classworlds.Entry@20025374
    import: org.codehaus.classworlds.Entry@f8e44ca4
    import: org.codehaus.classworlds.Entry@92758522
    import: org.codehaus.classworlds.Entry@ebf2705b
    import: org.codehaus.classworlds.Entry@bb25e54
    import: org.codehaus.classworlds.Entry@bece5185
    import: org.codehaus.classworlds.Entry@3fee8e37
    import: org.codehaus.classworlds.Entry@3fee19d8


    this realm = plexus.core
    urls[0] = file:/opt/maven2/lib/maven-2.2.1-uber.jar
    Number of imports: 10
    import: org.codehaus.classworlds.Entry@a6c57a42
    import: org.codehaus.classworlds.Entry@12f43f3b
    import: org.codehaus.classworlds.Entry@20025374
    import: org.codehaus.classworlds.Entry@f8e44ca4
    import: org.codehaus.classworlds.Entry@92758522
    import: org.codehaus.classworlds.Entry@ebf2705b
    import: org.codehaus.classworlds.Entry@bb25e54
    import: org.codehaus.classworlds.Entry@bece5185
    import: org.codehaus.classworlds.Entry@3fee8e37
    import: org.codehaus.classworlds.Entry@3fee19d8
    -----------------------------------------------------
    [INFO] ------------------------------------------------------------------------
    [ERROR] BUILD ERROR
    [INFO] ------------------------------------------------------------------------
    [INFO] Internal error in the plugin manager executing goal 'org.apache.torque:torque-maven-plugin:3.3:om': Unable to load the mojo 'org.apache.torque:torque-maven-plugin:3.3:om' in the plugin 'org.apache.torque:torque-maven-plugin'. A required class is missing: org/apache/torque/task/TorqueDataModelTask
    org.apache.torque.task.TorqueDataModelTask
    [INFO] ------------------------------------------------------------------------
    [INFO] For more information, run Maven with the -e switch
    [INFO] ------------------------------------------------------------------------
    [INFO] Total time: 26 seconds
    [INFO] Finished at: Thu May 19 06:02:43 UTC 2011
    [INFO] Final Memory: 30M/72M
    [INFO] ------------------------------------------------------------------------
    ---------------------------------------------

    To subscribe to this information via syndicated feeds:
    - RSS: http://vmgump.apache.org/gump/public/turbine-core/turbine-core/rss.xml
    - Atom: http://vmgump.apache.org/gump/public/turbine-core/turbine-core/atom.xml

    ============================== Gump Tracking Only ===
    Produced by Apache Gump(TM) version 2.3.
    Gump Run 11000019052011, vmgump.apache.org:vmgump:11000019052011
    Gump E-mail Identifier (unique within run) #37.

    --
    Apache Gump
    http://gump.apache.org/ [Instance: vmgump]

    ---------------------------------------------------------------------
    To unsubscribe, e-mail: dev-unsubscribe@turbine.apache.org
    For additional commands, e-mail: dev-help@turbine.apache.org
  • Anonymous at May 20, 2011 at 5:46 am
    To whom it may engage...

    This is an automated request, but not an unsolicited one. For
    more information please visit http://gump.apache.org/nagged.html,
    and/or contact the folk at general@gump.apache.org.

    Project turbine-core has an issue affecting its community integration.
    This issue affects 2 projects,
    and has been outstanding for 159 runs.
    The current state of this project is 'Failed', with reason 'Build Failed'.
    For reference only, the following projects are affected by this:
    - turbine-core : A servlet based framework.
    - turbine-core-test : A servlet based framework.


    Full details are available at:
    http://vmgump.apache.org/gump/public/turbine-core/turbine-core/index.html

    That said, some information snippets are provided here.

    The following annotations (debug/informational/warning/error messages) were provided:
    -INFO- Optional dependency commons-fileupload prerequisite failed with reason build failed
    -INFO- Optional dependency httpunit failed with reason build failed
    -DEBUG- (Apache Gump generated) Apache Maven Settings in: /srv/gump/public/workspace/turbine-core/gump_mvn_settings.xml
    -INFO- Failed with reason build failed
    -DEBUG- Maven POM in: /srv/gump/public/workspace/turbine-core/pom.xml
    -INFO- Failed to extract fallback artifacts from Gump Repository



    The following work was performed:
    http://vmgump.apache.org/gump/public/turbine-core/turbine-core/gump_work/build_turbine-core_turbine-core.html
    Work Name: build_turbine-core_turbine-core (Type: Build)
    Work ended in a state of : Failed
    Elapsed: 26 secs
    Command Line: /opt/maven2/bin/mvn --batch-mode -DskipTests=true --settings /srv/gump/public/workspace/turbine-core/gump_mvn_settings.xml package
    [Working Directory: /srv/gump/public/workspace/turbine-core]
    M2_HOME: /opt/maven2
    ---------------------------------------------
    urls[19] = file:/srv/gump/public/workspace/mvnlocalrepo/shared/xml-apis/xml-apis/1.0.b2/xml-apis-1.0.b2.jar
    urls[20] = file:/srv/gump/public/workspace/mvnlocalrepo/shared/commons-configuration/commons-configuration/1.4/commons-configuration-1.4.jar
    urls[21] = file:/srv/gump/public/workspace/mvnlocalrepo/shared/commons-logging/commons-logging-api/1.0.4/commons-logging-api-1.0.4.jar
    urls[22] = file:/srv/gump/public/workspace/mvnlocalrepo/shared/commons-digester/commons-digester/1.8/commons-digester-1.8.jar
    urls[23] = file:/srv/gump/public/workspace/mvnlocalrepo/shared/commons-beanutils/commons-beanutils/1.7.0/commons-beanutils-1.7.0.jar
    urls[24] = file:/srv/gump/public/workspace/mvnlocalrepo/shared/commons-beanutils/commons-beanutils-core/1.7.0/commons-beanutils-core-1.7.0.jar
    urls[25] = file:/srv/gump/public/workspace/mvnlocalrepo/shared/commons-codec/commons-codec/1.3/commons-codec-1.3.jar
    urls[26] = file:/srv/gump/public/workspace/mvnlocalrepo/shared/commons-jxpath/commons-jxpath/1.2/commons-jxpath-1.2.jar
    urls[27] = file:/srv/gump/public/workspace/mvnlocalrepo/shared/xerces/xerces/1.2.3/xerces-1.2.3.jar
    urls[28] = file:/srv/gump/public/workspace/mvnlocalrepo/shared/ant/ant-optional/1.5.1/ant-optional-1.5.1.jar
    urls[29] = file:/srv/gump/public/workspace/mvnlocalrepo/shared/jdom/jdom/b9/jdom-b9.jar
    Number of imports: 10
    import: org.codehaus.classworlds.Entry@a6c57a42
    import: org.codehaus.classworlds.Entry@12f43f3b
    import: org.codehaus.classworlds.Entry@20025374
    import: org.codehaus.classworlds.Entry@f8e44ca4
    import: org.codehaus.classworlds.Entry@92758522
    import: org.codehaus.classworlds.Entry@ebf2705b
    import: org.codehaus.classworlds.Entry@bb25e54
    import: org.codehaus.classworlds.Entry@bece5185
    import: org.codehaus.classworlds.Entry@3fee8e37
    import: org.codehaus.classworlds.Entry@3fee19d8


    this realm = plexus.core
    urls[0] = file:/opt/maven2/lib/maven-2.2.1-uber.jar
    Number of imports: 10
    import: org.codehaus.classworlds.Entry@a6c57a42
    import: org.codehaus.classworlds.Entry@12f43f3b
    import: org.codehaus.classworlds.Entry@20025374
    import: org.codehaus.classworlds.Entry@f8e44ca4
    import: org.codehaus.classworlds.Entry@92758522
    import: org.codehaus.classworlds.Entry@ebf2705b
    import: org.codehaus.classworlds.Entry@bb25e54
    import: org.codehaus.classworlds.Entry@bece5185
    import: org.codehaus.classworlds.Entry@3fee8e37
    import: org.codehaus.classworlds.Entry@3fee19d8
    -----------------------------------------------------
    [INFO] ------------------------------------------------------------------------
    [ERROR] BUILD ERROR
    [INFO] ------------------------------------------------------------------------
    [INFO] Internal error in the plugin manager executing goal 'org.apache.torque:torque-maven-plugin:3.3:om': Unable to load the mojo 'org.apache.torque:torque-maven-plugin:3.3:om' in the plugin 'org.apache.torque:torque-maven-plugin'. A required class is missing: org/apache/torque/task/TorqueDataModelTask
    org.apache.torque.task.TorqueDataModelTask
    [INFO] ------------------------------------------------------------------------
    [INFO] For more information, run Maven with the -e switch
    [INFO] ------------------------------------------------------------------------
    [INFO] Total time: 25 seconds
    [INFO] Finished at: Fri May 20 05:46:09 UTC 2011
    [INFO] Final Memory: 30M/72M
    [INFO] ------------------------------------------------------------------------
    ---------------------------------------------

    To subscribe to this information via syndicated feeds:
    - RSS: http://vmgump.apache.org/gump/public/turbine-core/turbine-core/rss.xml
    - Atom: http://vmgump.apache.org/gump/public/turbine-core/turbine-core/atom.xml

    ============================== Gump Tracking Only ===
    Produced by Apache Gump(TM) version 2.3.
    Gump Run 10000020052011, vmgump.apache.org:vmgump:10000020052011
    Gump E-mail Identifier (unique within run) #39.

    --
    Apache Gump
    http://gump.apache.org/ [Instance: vmgump]

    ---------------------------------------------------------------------
    To unsubscribe, e-mail: dev-unsubscribe@turbine.apache.org
    For additional commands, e-mail: dev-help@turbine.apache.org
  • Anonymous at May 21, 2011 at 6:03 am
    To whom it may engage...

    This is an automated request, but not an unsolicited one. For
    more information please visit http://gump.apache.org/nagged.html,
    and/or contact the folk at general@gump.apache.org.

    Project turbine-core has an issue affecting its community integration.
    This issue affects 2 projects,
    and has been outstanding for 161 runs.
    The current state of this project is 'Failed', with reason 'Build Failed'.
    For reference only, the following projects are affected by this:
    - turbine-core : A servlet based framework.
    - turbine-core-test : A servlet based framework.


    Full details are available at:
    http://vmgump.apache.org/gump/public/turbine-core/turbine-core/index.html

    That said, some information snippets are provided here.

    The following annotations (debug/informational/warning/error messages) were provided:
    -INFO- Optional dependency commons-fileupload prerequisite failed with reason build failed
    -INFO- Optional dependency httpunit failed with reason build failed
    -DEBUG- (Apache Gump generated) Apache Maven Settings in: /srv/gump/public/workspace/turbine-core/gump_mvn_settings.xml
    -INFO- Failed with reason build failed
    -DEBUG- Maven POM in: /srv/gump/public/workspace/turbine-core/pom.xml
    -INFO- Failed to extract fallback artifacts from Gump Repository



    The following work was performed:
    http://vmgump.apache.org/gump/public/turbine-core/turbine-core/gump_work/build_turbine-core_turbine-core.html
    Work Name: build_turbine-core_turbine-core (Type: Build)
    Work ended in a state of : Failed
    Elapsed: 28 secs
    Command Line: /opt/maven2/bin/mvn --batch-mode -DskipTests=true --settings /srv/gump/public/workspace/turbine-core/gump_mvn_settings.xml package
    [Working Directory: /srv/gump/public/workspace/turbine-core]
    M2_HOME: /opt/maven2
    ---------------------------------------------
    urls[19] = file:/srv/gump/public/workspace/mvnlocalrepo/shared/xml-apis/xml-apis/1.0.b2/xml-apis-1.0.b2.jar
    urls[20] = file:/srv/gump/public/workspace/mvnlocalrepo/shared/commons-configuration/commons-configuration/1.4/commons-configuration-1.4.jar
    urls[21] = file:/srv/gump/public/workspace/mvnlocalrepo/shared/commons-logging/commons-logging-api/1.0.4/commons-logging-api-1.0.4.jar
    urls[22] = file:/srv/gump/public/workspace/mvnlocalrepo/shared/commons-digester/commons-digester/1.8/commons-digester-1.8.jar
    urls[23] = file:/srv/gump/public/workspace/mvnlocalrepo/shared/commons-beanutils/commons-beanutils/1.7.0/commons-beanutils-1.7.0.jar
    urls[24] = file:/srv/gump/public/workspace/mvnlocalrepo/shared/commons-beanutils/commons-beanutils-core/1.7.0/commons-beanutils-core-1.7.0.jar
    urls[25] = file:/srv/gump/public/workspace/mvnlocalrepo/shared/commons-codec/commons-codec/1.3/commons-codec-1.3.jar
    urls[26] = file:/srv/gump/public/workspace/mvnlocalrepo/shared/commons-jxpath/commons-jxpath/1.2/commons-jxpath-1.2.jar
    urls[27] = file:/srv/gump/public/workspace/mvnlocalrepo/shared/xerces/xerces/1.2.3/xerces-1.2.3.jar
    urls[28] = file:/srv/gump/public/workspace/mvnlocalrepo/shared/ant/ant-optional/1.5.1/ant-optional-1.5.1.jar
    urls[29] = file:/srv/gump/public/workspace/mvnlocalrepo/shared/jdom/jdom/b9/jdom-b9.jar
    Number of imports: 10
    import: org.codehaus.classworlds.Entry@a6c57a42
    import: org.codehaus.classworlds.Entry@12f43f3b
    import: org.codehaus.classworlds.Entry@20025374
    import: org.codehaus.classworlds.Entry@f8e44ca4
    import: org.codehaus.classworlds.Entry@92758522
    import: org.codehaus.classworlds.Entry@ebf2705b
    import: org.codehaus.classworlds.Entry@bb25e54
    import: org.codehaus.classworlds.Entry@bece5185
    import: org.codehaus.classworlds.Entry@3fee8e37
    import: org.codehaus.classworlds.Entry@3fee19d8


    this realm = plexus.core
    urls[0] = file:/opt/maven2/lib/maven-2.2.1-uber.jar
    Number of imports: 10
    import: org.codehaus.classworlds.Entry@a6c57a42
    import: org.codehaus.classworlds.Entry@12f43f3b
    import: org.codehaus.classworlds.Entry@20025374
    import: org.codehaus.classworlds.Entry@f8e44ca4
    import: org.codehaus.classworlds.Entry@92758522
    import: org.codehaus.classworlds.Entry@ebf2705b
    import: org.codehaus.classworlds.Entry@bb25e54
    import: org.codehaus.classworlds.Entry@bece5185
    import: org.codehaus.classworlds.Entry@3fee8e37
    import: org.codehaus.classworlds.Entry@3fee19d8
    -----------------------------------------------------
    [INFO] ------------------------------------------------------------------------
    [ERROR] BUILD ERROR
    [INFO] ------------------------------------------------------------------------
    [INFO] Internal error in the plugin manager executing goal 'org.apache.torque:torque-maven-plugin:3.3:om': Unable to load the mojo 'org.apache.torque:torque-maven-plugin:3.3:om' in the plugin 'org.apache.torque:torque-maven-plugin'. A required class is missing: org/apache/torque/task/TorqueDataModelTask
    org.apache.torque.task.TorqueDataModelTask
    [INFO] ------------------------------------------------------------------------
    [INFO] For more information, run Maven with the -e switch
    [INFO] ------------------------------------------------------------------------
    [INFO] Total time: 26 seconds
    [INFO] Finished at: Sat May 21 06:03:03 UTC 2011
    [INFO] Final Memory: 30M/72M
    [INFO] ------------------------------------------------------------------------
    ---------------------------------------------

    To subscribe to this information via syndicated feeds:
    - RSS: http://vmgump.apache.org/gump/public/turbine-core/turbine-core/rss.xml
    - Atom: http://vmgump.apache.org/gump/public/turbine-core/turbine-core/atom.xml

    ============================== Gump Tracking Only ===
    Produced by Apache Gump(TM) version 2.3.
    Gump Run 09000021052011, vmgump.apache.org:vmgump:09000021052011
    Gump E-mail Identifier (unique within run) #39.

    --
    Apache Gump
    http://gump.apache.org/ [Instance: vmgump]

    ---------------------------------------------------------------------
    To unsubscribe, e-mail: dev-unsubscribe@turbine.apache.org
    For additional commands, e-mail: dev-help@turbine.apache.org
  • Anonymous at May 22, 2011 at 5:58 am
    To whom it may engage...

    This is an automated request, but not an unsolicited one. For
    more information please visit http://gump.apache.org/nagged.html,
    and/or contact the folk at general@gump.apache.org.

    Project turbine-core has an issue affecting its community integration.
    This issue affects 2 projects,
    and has been outstanding for 163 runs.
    The current state of this project is 'Failed', with reason 'Build Failed'.
    For reference only, the following projects are affected by this:
    - turbine-core : A servlet based framework.
    - turbine-core-test : A servlet based framework.


    Full details are available at:
    http://vmgump.apache.org/gump/public/turbine-core/turbine-core/index.html

    That said, some information snippets are provided here.

    The following annotations (debug/informational/warning/error messages) were provided:
    -INFO- Optional dependency commons-fileupload prerequisite failed with reason build failed
    -INFO- Optional dependency httpunit failed with reason build failed
    -DEBUG- (Apache Gump generated) Apache Maven Settings in: /srv/gump/public/workspace/turbine-core/gump_mvn_settings.xml
    -INFO- Failed with reason build failed
    -DEBUG- Maven POM in: /srv/gump/public/workspace/turbine-core/pom.xml
    -INFO- Failed to extract fallback artifacts from Gump Repository



    The following work was performed:
    http://vmgump.apache.org/gump/public/turbine-core/turbine-core/gump_work/build_turbine-core_turbine-core.html
    Work Name: build_turbine-core_turbine-core (Type: Build)
    Work ended in a state of : Failed
    Elapsed: 26 secs
    Command Line: /opt/maven2/bin/mvn --batch-mode -DskipTests=true --settings /srv/gump/public/workspace/turbine-core/gump_mvn_settings.xml package
    [Working Directory: /srv/gump/public/workspace/turbine-core]
    M2_HOME: /opt/maven2
    ---------------------------------------------
    urls[19] = file:/srv/gump/public/workspace/mvnlocalrepo/shared/xml-apis/xml-apis/1.0.b2/xml-apis-1.0.b2.jar
    urls[20] = file:/srv/gump/public/workspace/mvnlocalrepo/shared/commons-configuration/commons-configuration/1.4/commons-configuration-1.4.jar
    urls[21] = file:/srv/gump/public/workspace/mvnlocalrepo/shared/commons-logging/commons-logging-api/1.0.4/commons-logging-api-1.0.4.jar
    urls[22] = file:/srv/gump/public/workspace/mvnlocalrepo/shared/commons-digester/commons-digester/1.8/commons-digester-1.8.jar
    urls[23] = file:/srv/gump/public/workspace/mvnlocalrepo/shared/commons-beanutils/commons-beanutils/1.7.0/commons-beanutils-1.7.0.jar
    urls[24] = file:/srv/gump/public/workspace/mvnlocalrepo/shared/commons-beanutils/commons-beanutils-core/1.7.0/commons-beanutils-core-1.7.0.jar
    urls[25] = file:/srv/gump/public/workspace/mvnlocalrepo/shared/commons-codec/commons-codec/1.3/commons-codec-1.3.jar
    urls[26] = file:/srv/gump/public/workspace/mvnlocalrepo/shared/commons-jxpath/commons-jxpath/1.2/commons-jxpath-1.2.jar
    urls[27] = file:/srv/gump/public/workspace/mvnlocalrepo/shared/xerces/xerces/1.2.3/xerces-1.2.3.jar
    urls[28] = file:/srv/gump/public/workspace/mvnlocalrepo/shared/ant/ant-optional/1.5.1/ant-optional-1.5.1.jar
    urls[29] = file:/srv/gump/public/workspace/mvnlocalrepo/shared/jdom/jdom/b9/jdom-b9.jar
    Number of imports: 10
    import: org.codehaus.classworlds.Entry@a6c57a42
    import: org.codehaus.classworlds.Entry@12f43f3b
    import: org.codehaus.classworlds.Entry@20025374
    import: org.codehaus.classworlds.Entry@f8e44ca4
    import: org.codehaus.classworlds.Entry@92758522
    import: org.codehaus.classworlds.Entry@ebf2705b
    import: org.codehaus.classworlds.Entry@bb25e54
    import: org.codehaus.classworlds.Entry@bece5185
    import: org.codehaus.classworlds.Entry@3fee8e37
    import: org.codehaus.classworlds.Entry@3fee19d8


    this realm = plexus.core
    urls[0] = file:/opt/maven2/lib/maven-2.2.1-uber.jar
    Number of imports: 10
    import: org.codehaus.classworlds.Entry@a6c57a42
    import: org.codehaus.classworlds.Entry@12f43f3b
    import: org.codehaus.classworlds.Entry@20025374
    import: org.codehaus.classworlds.Entry@f8e44ca4
    import: org.codehaus.classworlds.Entry@92758522
    import: org.codehaus.classworlds.Entry@ebf2705b
    import: org.codehaus.classworlds.Entry@bb25e54
    import: org.codehaus.classworlds.Entry@bece5185
    import: org.codehaus.classworlds.Entry@3fee8e37
    import: org.codehaus.classworlds.Entry@3fee19d8
    -----------------------------------------------------
    [INFO] ------------------------------------------------------------------------
    [ERROR] BUILD ERROR
    [INFO] ------------------------------------------------------------------------
    [INFO] Internal error in the plugin manager executing goal 'org.apache.torque:torque-maven-plugin:3.3:om': Unable to load the mojo 'org.apache.torque:torque-maven-plugin:3.3:om' in the plugin 'org.apache.torque:torque-maven-plugin'. A required class is missing: org/apache/torque/task/TorqueDataModelTask
    org.apache.torque.task.TorqueDataModelTask
    [INFO] ------------------------------------------------------------------------
    [INFO] For more information, run Maven with the -e switch
    [INFO] ------------------------------------------------------------------------
    [INFO] Total time: 25 seconds
    [INFO] Finished at: Sun May 22 05:58:05 UTC 2011
    [INFO] Final Memory: 30M/72M
    [INFO] ------------------------------------------------------------------------
    ---------------------------------------------

    To subscribe to this information via syndicated feeds:
    - RSS: http://vmgump.apache.org/gump/public/turbine-core/turbine-core/rss.xml
    - Atom: http://vmgump.apache.org/gump/public/turbine-core/turbine-core/atom.xml

    ============================== Gump Tracking Only ===
    Produced by Apache Gump(TM) version 2.3.
    Gump Run 10000022052011, vmgump.apache.org:vmgump:10000022052011
    Gump E-mail Identifier (unique within run) #39.

    --
    Apache Gump
    http://gump.apache.org/ [Instance: vmgump]

    ---------------------------------------------------------------------
    To unsubscribe, e-mail: dev-unsubscribe@turbine.apache.org
    For additional commands, e-mail: dev-help@turbine.apache.org
  • Anonymous at May 23, 2011 at 11:59 am
    To whom it may engage...

    This is an automated request, but not an unsolicited one. For
    more information please visit http://gump.apache.org/nagged.html,
    and/or contact the folk at general@gump.apache.org.

    Project turbine-core has an issue affecting its community integration.
    This issue affects 2 projects,
    and has been outstanding for 166 runs.
    The current state of this project is 'Failed', with reason 'Build Failed'.
    For reference only, the following projects are affected by this:
    - turbine-core : A servlet based framework.
    - turbine-core-test : A servlet based framework.


    Full details are available at:
    http://vmgump.apache.org/gump/public/turbine-core/turbine-core/index.html

    That said, some information snippets are provided here.

    The following annotations (debug/informational/warning/error messages) were provided:
    -INFO- Optional dependency commons-fileupload prerequisite failed with reason build failed
    -INFO- Optional dependency httpunit failed with reason build failed
    -DEBUG- (Apache Gump generated) Apache Maven Settings in: /srv/gump/public/workspace/turbine-core/gump_mvn_settings.xml
    -INFO- Failed with reason build failed
    -DEBUG- Maven POM in: /srv/gump/public/workspace/turbine-core/pom.xml
    -INFO- Failed to extract fallback artifacts from Gump Repository



    The following work was performed:
    http://vmgump.apache.org/gump/public/turbine-core/turbine-core/gump_work/build_turbine-core_turbine-core.html
    Work Name: build_turbine-core_turbine-core (Type: Build)
    Work ended in a state of : Failed
    Elapsed: 28 secs
    Command Line: /opt/maven2/bin/mvn --batch-mode -DskipTests=true --settings /srv/gump/public/workspace/turbine-core/gump_mvn_settings.xml package
    [Working Directory: /srv/gump/public/workspace/turbine-core]
    M2_HOME: /opt/maven2
    ---------------------------------------------
    urls[19] = file:/srv/gump/public/workspace/mvnlocalrepo/shared/xml-apis/xml-apis/1.0.b2/xml-apis-1.0.b2.jar
    urls[20] = file:/srv/gump/public/workspace/mvnlocalrepo/shared/commons-configuration/commons-configuration/1.4/commons-configuration-1.4.jar
    urls[21] = file:/srv/gump/public/workspace/mvnlocalrepo/shared/commons-logging/commons-logging-api/1.0.4/commons-logging-api-1.0.4.jar
    urls[22] = file:/srv/gump/public/workspace/mvnlocalrepo/shared/commons-digester/commons-digester/1.8/commons-digester-1.8.jar
    urls[23] = file:/srv/gump/public/workspace/mvnlocalrepo/shared/commons-beanutils/commons-beanutils/1.7.0/commons-beanutils-1.7.0.jar
    urls[24] = file:/srv/gump/public/workspace/mvnlocalrepo/shared/commons-beanutils/commons-beanutils-core/1.7.0/commons-beanutils-core-1.7.0.jar
    urls[25] = file:/srv/gump/public/workspace/mvnlocalrepo/shared/commons-codec/commons-codec/1.3/commons-codec-1.3.jar
    urls[26] = file:/srv/gump/public/workspace/mvnlocalrepo/shared/commons-jxpath/commons-jxpath/1.2/commons-jxpath-1.2.jar
    urls[27] = file:/srv/gump/public/workspace/mvnlocalrepo/shared/xerces/xerces/1.2.3/xerces-1.2.3.jar
    urls[28] = file:/srv/gump/public/workspace/mvnlocalrepo/shared/ant/ant-optional/1.5.1/ant-optional-1.5.1.jar
    urls[29] = file:/srv/gump/public/workspace/mvnlocalrepo/shared/jdom/jdom/b9/jdom-b9.jar
    Number of imports: 10
    import: org.codehaus.classworlds.Entry@a6c57a42
    import: org.codehaus.classworlds.Entry@12f43f3b
    import: org.codehaus.classworlds.Entry@20025374
    import: org.codehaus.classworlds.Entry@f8e44ca4
    import: org.codehaus.classworlds.Entry@92758522
    import: org.codehaus.classworlds.Entry@ebf2705b
    import: org.codehaus.classworlds.Entry@bb25e54
    import: org.codehaus.classworlds.Entry@bece5185
    import: org.codehaus.classworlds.Entry@3fee8e37
    import: org.codehaus.classworlds.Entry@3fee19d8


    this realm = plexus.core
    urls[0] = file:/opt/maven2/lib/maven-2.2.1-uber.jar
    Number of imports: 10
    import: org.codehaus.classworlds.Entry@a6c57a42
    import: org.codehaus.classworlds.Entry@12f43f3b
    import: org.codehaus.classworlds.Entry@20025374
    import: org.codehaus.classworlds.Entry@f8e44ca4
    import: org.codehaus.classworlds.Entry@92758522
    import: org.codehaus.classworlds.Entry@ebf2705b
    import: org.codehaus.classworlds.Entry@bb25e54
    import: org.codehaus.classworlds.Entry@bece5185
    import: org.codehaus.classworlds.Entry@3fee8e37
    import: org.codehaus.classworlds.Entry@3fee19d8
    -----------------------------------------------------
    [INFO] ------------------------------------------------------------------------
    [ERROR] BUILD ERROR
    [INFO] ------------------------------------------------------------------------
    [INFO] Internal error in the plugin manager executing goal 'org.apache.torque:torque-maven-plugin:3.3:om': Unable to load the mojo 'org.apache.torque:torque-maven-plugin:3.3:om' in the plugin 'org.apache.torque:torque-maven-plugin'. A required class is missing: org/apache/torque/task/TorqueDataModelTask
    org.apache.torque.task.TorqueDataModelTask
    [INFO] ------------------------------------------------------------------------
    [INFO] For more information, run Maven with the -e switch
    [INFO] ------------------------------------------------------------------------
    [INFO] Total time: 27 seconds
    [INFO] Finished at: Mon May 23 11:58:54 UTC 2011
    [INFO] Final Memory: 30M/72M
    [INFO] ------------------------------------------------------------------------
    ---------------------------------------------

    To subscribe to this information via syndicated feeds:
    - RSS: http://vmgump.apache.org/gump/public/turbine-core/turbine-core/rss.xml
    - Atom: http://vmgump.apache.org/gump/public/turbine-core/turbine-core/atom.xml

    ============================== Gump Tracking Only ===
    Produced by Apache Gump(TM) version 2.3.
    Gump Run 06000623052011, vmgump.apache.org:vmgump:06000623052011
    Gump E-mail Identifier (unique within run) #39.

    --
    Apache Gump
    http://gump.apache.org/ [Instance: vmgump]

    ---------------------------------------------------------------------
    To unsubscribe, e-mail: dev-unsubscribe@turbine.apache.org
    For additional commands, e-mail: dev-help@turbine.apache.org
  • Anonymous at May 24, 2011 at 12:08 pm
    To whom it may engage...

    This is an automated request, but not an unsolicited one. For
    more information please visit http://gump.apache.org/nagged.html,
    and/or contact the folk at general@gump.apache.org.

    Project turbine-core has an issue affecting its community integration.
    This issue affects 2 projects,
    and has been outstanding for 168 runs.
    The current state of this project is 'Failed', with reason 'Build Failed'.
    For reference only, the following projects are affected by this:
    - turbine-core : A servlet based framework.
    - turbine-core-test : A servlet based framework.


    Full details are available at:
    http://vmgump.apache.org/gump/public/turbine-core/turbine-core/index.html

    That said, some information snippets are provided here.

    The following annotations (debug/informational/warning/error messages) were provided:
    -INFO- Optional dependency commons-fileupload prerequisite failed with reason build failed
    -INFO- Optional dependency httpunit failed with reason build failed
    -DEBUG- (Apache Gump generated) Apache Maven Settings in: /srv/gump/public/workspace/turbine-core/gump_mvn_settings.xml
    -INFO- Failed with reason build failed
    -DEBUG- Maven POM in: /srv/gump/public/workspace/turbine-core/pom.xml
    -INFO- Failed to extract fallback artifacts from Gump Repository



    The following work was performed:
    http://vmgump.apache.org/gump/public/turbine-core/turbine-core/gump_work/build_turbine-core_turbine-core.html
    Work Name: build_turbine-core_turbine-core (Type: Build)
    Work ended in a state of : Failed
    Elapsed: 26 secs
    Command Line: /opt/maven2/bin/mvn --batch-mode -DskipTests=true --settings /srv/gump/public/workspace/turbine-core/gump_mvn_settings.xml package
    [Working Directory: /srv/gump/public/workspace/turbine-core]
    M2_HOME: /opt/maven2
    ---------------------------------------------
    urls[19] = file:/srv/gump/public/workspace/mvnlocalrepo/shared/xml-apis/xml-apis/1.0.b2/xml-apis-1.0.b2.jar
    urls[20] = file:/srv/gump/public/workspace/mvnlocalrepo/shared/commons-configuration/commons-configuration/1.4/commons-configuration-1.4.jar
    urls[21] = file:/srv/gump/public/workspace/mvnlocalrepo/shared/commons-logging/commons-logging-api/1.0.4/commons-logging-api-1.0.4.jar
    urls[22] = file:/srv/gump/public/workspace/mvnlocalrepo/shared/commons-digester/commons-digester/1.8/commons-digester-1.8.jar
    urls[23] = file:/srv/gump/public/workspace/mvnlocalrepo/shared/commons-beanutils/commons-beanutils/1.7.0/commons-beanutils-1.7.0.jar
    urls[24] = file:/srv/gump/public/workspace/mvnlocalrepo/shared/commons-beanutils/commons-beanutils-core/1.7.0/commons-beanutils-core-1.7.0.jar
    urls[25] = file:/srv/gump/public/workspace/mvnlocalrepo/shared/commons-codec/commons-codec/1.3/commons-codec-1.3.jar
    urls[26] = file:/srv/gump/public/workspace/mvnlocalrepo/shared/commons-jxpath/commons-jxpath/1.2/commons-jxpath-1.2.jar
    urls[27] = file:/srv/gump/public/workspace/mvnlocalrepo/shared/xerces/xerces/1.2.3/xerces-1.2.3.jar
    urls[28] = file:/srv/gump/public/workspace/mvnlocalrepo/shared/ant/ant-optional/1.5.1/ant-optional-1.5.1.jar
    urls[29] = file:/srv/gump/public/workspace/mvnlocalrepo/shared/jdom/jdom/b9/jdom-b9.jar
    Number of imports: 10
    import: org.codehaus.classworlds.Entry@a6c57a42
    import: org.codehaus.classworlds.Entry@12f43f3b
    import: org.codehaus.classworlds.Entry@20025374
    import: org.codehaus.classworlds.Entry@f8e44ca4
    import: org.codehaus.classworlds.Entry@92758522
    import: org.codehaus.classworlds.Entry@ebf2705b
    import: org.codehaus.classworlds.Entry@bb25e54
    import: org.codehaus.classworlds.Entry@bece5185
    import: org.codehaus.classworlds.Entry@3fee8e37
    import: org.codehaus.classworlds.Entry@3fee19d8


    this realm = plexus.core
    urls[0] = file:/opt/maven2/lib/maven-2.2.1-uber.jar
    Number of imports: 10
    import: org.codehaus.classworlds.Entry@a6c57a42
    import: org.codehaus.classworlds.Entry@12f43f3b
    import: org.codehaus.classworlds.Entry@20025374
    import: org.codehaus.classworlds.Entry@f8e44ca4
    import: org.codehaus.classworlds.Entry@92758522
    import: org.codehaus.classworlds.Entry@ebf2705b
    import: org.codehaus.classworlds.Entry@bb25e54
    import: org.codehaus.classworlds.Entry@bece5185
    import: org.codehaus.classworlds.Entry@3fee8e37
    import: org.codehaus.classworlds.Entry@3fee19d8
    -----------------------------------------------------
    [INFO] ------------------------------------------------------------------------
    [ERROR] BUILD ERROR
    [INFO] ------------------------------------------------------------------------
    [INFO] Internal error in the plugin manager executing goal 'org.apache.torque:torque-maven-plugin:3.3:om': Unable to load the mojo 'org.apache.torque:torque-maven-plugin:3.3:om' in the plugin 'org.apache.torque:torque-maven-plugin'. A required class is missing: org/apache/torque/task/TorqueDataModelTask
    org.apache.torque.task.TorqueDataModelTask
    [INFO] ------------------------------------------------------------------------
    [INFO] For more information, run Maven with the -e switch
    [INFO] ------------------------------------------------------------------------
    [INFO] Total time: 24 seconds
    [INFO] Finished at: Tue May 24 12:07:43 UTC 2011
    [INFO] Final Memory: 30M/72M
    [INFO] ------------------------------------------------------------------------
    ---------------------------------------------

    To subscribe to this information via syndicated feeds:
    - RSS: http://vmgump.apache.org/gump/public/turbine-core/turbine-core/rss.xml
    - Atom: http://vmgump.apache.org/gump/public/turbine-core/turbine-core/atom.xml

    ============================== Gump Tracking Only ===
    Produced by Apache Gump(TM) version 2.3.
    Gump Run 04000624052011, vmgump.apache.org:vmgump:04000624052011
    Gump E-mail Identifier (unique within run) #38.

    --
    Apache Gump
    http://gump.apache.org/ [Instance: vmgump]

    ---------------------------------------------------------------------
    To unsubscribe, e-mail: dev-unsubscribe@turbine.apache.org
    For additional commands, e-mail: dev-help@turbine.apache.org
  • Anonymous at May 25, 2011 at 12:02 pm
    To whom it may engage...

    This is an automated request, but not an unsolicited one. For
    more information please visit http://gump.apache.org/nagged.html,
    and/or contact the folk at general@gump.apache.org.

    Project turbine-core has an issue affecting its community integration.
    This issue affects 2 projects,
    and has been outstanding for 170 runs.
    The current state of this project is 'Failed', with reason 'Build Failed'.
    For reference only, the following projects are affected by this:
    - turbine-core : A servlet based framework.
    - turbine-core-test : A servlet based framework.


    Full details are available at:
    http://vmgump.apache.org/gump/public/turbine-core/turbine-core/index.html

    That said, some information snippets are provided here.

    The following annotations (debug/informational/warning/error messages) were provided:
    -INFO- Optional dependency commons-fileupload prerequisite failed with reason build failed
    -INFO- Optional dependency httpunit failed with reason build failed
    -DEBUG- (Apache Gump generated) Apache Maven Settings in: /srv/gump/public/workspace/turbine-core/gump_mvn_settings.xml
    -INFO- Failed with reason build failed
    -DEBUG- Maven POM in: /srv/gump/public/workspace/turbine-core/pom.xml
    -INFO- Failed to extract fallback artifacts from Gump Repository



    The following work was performed:
    http://vmgump.apache.org/gump/public/turbine-core/turbine-core/gump_work/build_turbine-core_turbine-core.html
    Work Name: build_turbine-core_turbine-core (Type: Build)
    Work ended in a state of : Failed
    Elapsed: 28 secs
    Command Line: /opt/maven2/bin/mvn --batch-mode -DskipTests=true --settings /srv/gump/public/workspace/turbine-core/gump_mvn_settings.xml package
    [Working Directory: /srv/gump/public/workspace/turbine-core]
    M2_HOME: /opt/maven2
    ---------------------------------------------
    urls[19] = file:/srv/gump/public/workspace/mvnlocalrepo/shared/xml-apis/xml-apis/1.0.b2/xml-apis-1.0.b2.jar
    urls[20] = file:/srv/gump/public/workspace/mvnlocalrepo/shared/commons-configuration/commons-configuration/1.4/commons-configuration-1.4.jar
    urls[21] = file:/srv/gump/public/workspace/mvnlocalrepo/shared/commons-logging/commons-logging-api/1.0.4/commons-logging-api-1.0.4.jar
    urls[22] = file:/srv/gump/public/workspace/mvnlocalrepo/shared/commons-digester/commons-digester/1.8/commons-digester-1.8.jar
    urls[23] = file:/srv/gump/public/workspace/mvnlocalrepo/shared/commons-beanutils/commons-beanutils/1.7.0/commons-beanutils-1.7.0.jar
    urls[24] = file:/srv/gump/public/workspace/mvnlocalrepo/shared/commons-beanutils/commons-beanutils-core/1.7.0/commons-beanutils-core-1.7.0.jar
    urls[25] = file:/srv/gump/public/workspace/mvnlocalrepo/shared/commons-codec/commons-codec/1.3/commons-codec-1.3.jar
    urls[26] = file:/srv/gump/public/workspace/mvnlocalrepo/shared/commons-jxpath/commons-jxpath/1.2/commons-jxpath-1.2.jar
    urls[27] = file:/srv/gump/public/workspace/mvnlocalrepo/shared/xerces/xerces/1.2.3/xerces-1.2.3.jar
    urls[28] = file:/srv/gump/public/workspace/mvnlocalrepo/shared/ant/ant-optional/1.5.1/ant-optional-1.5.1.jar
    urls[29] = file:/srv/gump/public/workspace/mvnlocalrepo/shared/jdom/jdom/b9/jdom-b9.jar
    Number of imports: 10
    import: org.codehaus.classworlds.Entry@a6c57a42
    import: org.codehaus.classworlds.Entry@12f43f3b
    import: org.codehaus.classworlds.Entry@20025374
    import: org.codehaus.classworlds.Entry@f8e44ca4
    import: org.codehaus.classworlds.Entry@92758522
    import: org.codehaus.classworlds.Entry@ebf2705b
    import: org.codehaus.classworlds.Entry@bb25e54
    import: org.codehaus.classworlds.Entry@bece5185
    import: org.codehaus.classworlds.Entry@3fee8e37
    import: org.codehaus.classworlds.Entry@3fee19d8


    this realm = plexus.core
    urls[0] = file:/opt/maven2/lib/maven-2.2.1-uber.jar
    Number of imports: 10
    import: org.codehaus.classworlds.Entry@a6c57a42
    import: org.codehaus.classworlds.Entry@12f43f3b
    import: org.codehaus.classworlds.Entry@20025374
    import: org.codehaus.classworlds.Entry@f8e44ca4
    import: org.codehaus.classworlds.Entry@92758522
    import: org.codehaus.classworlds.Entry@ebf2705b
    import: org.codehaus.classworlds.Entry@bb25e54
    import: org.codehaus.classworlds.Entry@bece5185
    import: org.codehaus.classworlds.Entry@3fee8e37
    import: org.codehaus.classworlds.Entry@3fee19d8
    -----------------------------------------------------
    [INFO] ------------------------------------------------------------------------
    [ERROR] BUILD ERROR
    [INFO] ------------------------------------------------------------------------
    [INFO] Internal error in the plugin manager executing goal 'org.apache.torque:torque-maven-plugin:3.3:om': Unable to load the mojo 'org.apache.torque:torque-maven-plugin:3.3:om' in the plugin 'org.apache.torque:torque-maven-plugin'. A required class is missing: org/apache/torque/task/TorqueDataModelTask
    org.apache.torque.task.TorqueDataModelTask
    [INFO] ------------------------------------------------------------------------
    [INFO] For more information, run Maven with the -e switch
    [INFO] ------------------------------------------------------------------------
    [INFO] Total time: 27 seconds
    [INFO] Finished at: Wed May 25 12:02:18 UTC 2011
    [INFO] Final Memory: 30M/72M
    [INFO] ------------------------------------------------------------------------
    ---------------------------------------------

    To subscribe to this information via syndicated feeds:
    - RSS: http://vmgump.apache.org/gump/public/turbine-core/turbine-core/rss.xml
    - Atom: http://vmgump.apache.org/gump/public/turbine-core/turbine-core/atom.xml

    ============================== Gump Tracking Only ===
    Produced by Apache Gump(TM) version 2.3.
    Gump Run 05000625052011, vmgump.apache.org:vmgump:05000625052011
    Gump E-mail Identifier (unique within run) #40.

    --
    Apache Gump
    http://gump.apache.org/ [Instance: vmgump]

    ---------------------------------------------------------------------
    To unsubscribe, e-mail: dev-unsubscribe@turbine.apache.org
    For additional commands, e-mail: dev-help@turbine.apache.org
  • Anonymous at May 26, 2011 at 12:03 pm
    To whom it may engage...

    This is an automated request, but not an unsolicited one. For
    more information please visit http://gump.apache.org/nagged.html,
    and/or contact the folk at general@gump.apache.org.

    Project turbine-core has an issue affecting its community integration.
    This issue affects 2 projects,
    and has been outstanding for 172 runs.
    The current state of this project is 'Failed', with reason 'Build Failed'.
    For reference only, the following projects are affected by this:
    - turbine-core : A servlet based framework.
    - turbine-core-test : A servlet based framework.


    Full details are available at:
    http://vmgump.apache.org/gump/public/turbine-core/turbine-core/index.html

    That said, some information snippets are provided here.

    The following annotations (debug/informational/warning/error messages) were provided:
    -INFO- Optional dependency commons-fileupload prerequisite failed with reason build failed
    -INFO- Optional dependency httpunit failed with reason build failed
    -DEBUG- (Apache Gump generated) Apache Maven Settings in: /srv/gump/public/workspace/turbine-core/gump_mvn_settings.xml
    -INFO- Failed with reason build failed
    -DEBUG- Maven POM in: /srv/gump/public/workspace/turbine-core/pom.xml
    -INFO- Failed to extract fallback artifacts from Gump Repository



    The following work was performed:
    http://vmgump.apache.org/gump/public/turbine-core/turbine-core/gump_work/build_turbine-core_turbine-core.html
    Work Name: build_turbine-core_turbine-core (Type: Build)
    Work ended in a state of : Failed
    Elapsed: 36 secs
    Command Line: /opt/maven2/bin/mvn --batch-mode -DskipTests=true --settings /srv/gump/public/workspace/turbine-core/gump_mvn_settings.xml package
    [Working Directory: /srv/gump/public/workspace/turbine-core]
    M2_HOME: /opt/maven2
    ---------------------------------------------
    urls[19] = file:/srv/gump/public/workspace/mvnlocalrepo/shared/xml-apis/xml-apis/1.0.b2/xml-apis-1.0.b2.jar
    urls[20] = file:/srv/gump/public/workspace/mvnlocalrepo/shared/commons-configuration/commons-configuration/1.4/commons-configuration-1.4.jar
    urls[21] = file:/srv/gump/public/workspace/mvnlocalrepo/shared/commons-logging/commons-logging-api/1.0.4/commons-logging-api-1.0.4.jar
    urls[22] = file:/srv/gump/public/workspace/mvnlocalrepo/shared/commons-digester/commons-digester/1.8/commons-digester-1.8.jar
    urls[23] = file:/srv/gump/public/workspace/mvnlocalrepo/shared/commons-beanutils/commons-beanutils/1.7.0/commons-beanutils-1.7.0.jar
    urls[24] = file:/srv/gump/public/workspace/mvnlocalrepo/shared/commons-beanutils/commons-beanutils-core/1.7.0/commons-beanutils-core-1.7.0.jar
    urls[25] = file:/srv/gump/public/workspace/mvnlocalrepo/shared/commons-codec/commons-codec/1.3/commons-codec-1.3.jar
    urls[26] = file:/srv/gump/public/workspace/mvnlocalrepo/shared/commons-jxpath/commons-jxpath/1.2/commons-jxpath-1.2.jar
    urls[27] = file:/srv/gump/public/workspace/mvnlocalrepo/shared/xerces/xerces/1.2.3/xerces-1.2.3.jar
    urls[28] = file:/srv/gump/public/workspace/mvnlocalrepo/shared/ant/ant-optional/1.5.1/ant-optional-1.5.1.jar
    urls[29] = file:/srv/gump/public/workspace/mvnlocalrepo/shared/jdom/jdom/b9/jdom-b9.jar
    Number of imports: 10
    import: org.codehaus.classworlds.Entry@a6c57a42
    import: org.codehaus.classworlds.Entry@12f43f3b
    import: org.codehaus.classworlds.Entry@20025374
    import: org.codehaus.classworlds.Entry@f8e44ca4
    import: org.codehaus.classworlds.Entry@92758522
    import: org.codehaus.classworlds.Entry@ebf2705b
    import: org.codehaus.classworlds.Entry@bb25e54
    import: org.codehaus.classworlds.Entry@bece5185
    import: org.codehaus.classworlds.Entry@3fee8e37
    import: org.codehaus.classworlds.Entry@3fee19d8


    this realm = plexus.core
    urls[0] = file:/opt/maven2/lib/maven-2.2.1-uber.jar
    Number of imports: 10
    import: org.codehaus.classworlds.Entry@a6c57a42
    import: org.codehaus.classworlds.Entry@12f43f3b
    import: org.codehaus.classworlds.Entry@20025374
    import: org.codehaus.classworlds.Entry@f8e44ca4
    import: org.codehaus.classworlds.Entry@92758522
    import: org.codehaus.classworlds.Entry@ebf2705b
    import: org.codehaus.classworlds.Entry@bb25e54
    import: org.codehaus.classworlds.Entry@bece5185
    import: org.codehaus.classworlds.Entry@3fee8e37
    import: org.codehaus.classworlds.Entry@3fee19d8
    -----------------------------------------------------
    [INFO] ------------------------------------------------------------------------
    [ERROR] BUILD ERROR
    [INFO] ------------------------------------------------------------------------
    [INFO] Internal error in the plugin manager executing goal 'org.apache.torque:torque-maven-plugin:3.3:om': Unable to load the mojo 'org.apache.torque:torque-maven-plugin:3.3:om' in the plugin 'org.apache.torque:torque-maven-plugin'. A required class is missing: org/apache/torque/task/TorqueDataModelTask
    org.apache.torque.task.TorqueDataModelTask
    [INFO] ------------------------------------------------------------------------
    [INFO] For more information, run Maven with the -e switch
    [INFO] ------------------------------------------------------------------------
    [INFO] Total time: 35 seconds
    [INFO] Finished at: Thu May 26 12:02:36 UTC 2011
    [INFO] Final Memory: 30M/72M
    [INFO] ------------------------------------------------------------------------
    ---------------------------------------------

    To subscribe to this information via syndicated feeds:
    - RSS: http://vmgump.apache.org/gump/public/turbine-core/turbine-core/rss.xml
    - Atom: http://vmgump.apache.org/gump/public/turbine-core/turbine-core/atom.xml

    ============================== Gump Tracking Only ===
    Produced by Apache Gump(TM) version 2.3.
    Gump Run 05000626052011, vmgump.apache.org:vmgump:05000626052011
    Gump E-mail Identifier (unique within run) #39.

    --
    Apache Gump
    http://gump.apache.org/ [Instance: vmgump]

    ---------------------------------------------------------------------
    To unsubscribe, e-mail: dev-unsubscribe@turbine.apache.org
    For additional commands, e-mail: dev-help@turbine.apache.org
  • Anonymous at May 27, 2011 at 11:32 am
    To whom it may engage...

    This is an automated request, but not an unsolicited one. For
    more information please visit http://gump.apache.org/nagged.html,
    and/or contact the folk at general@gump.apache.org.

    Project turbine-core has an issue affecting its community integration.
    This issue affects 2 projects,
    and has been outstanding for 174 runs.
    The current state of this project is 'Failed', with reason 'Build Failed'.
    For reference only, the following projects are affected by this:
    - turbine-core : A servlet based framework.
    - turbine-core-test : A servlet based framework.


    Full details are available at:
    http://vmgump.apache.org/gump/public/turbine-core/turbine-core/index.html

    That said, some information snippets are provided here.

    The following annotations (debug/informational/warning/error messages) were provided:
    -INFO- Optional dependency commons-fileupload prerequisite failed with reason build failed
    -INFO- Optional dependency httpunit failed with reason build failed
    -DEBUG- (Apache Gump generated) Apache Maven Settings in: /srv/gump/public/workspace/turbine-core/gump_mvn_settings.xml
    -INFO- Failed with reason build failed
    -DEBUG- Maven POM in: /srv/gump/public/workspace/turbine-core/pom.xml
    -INFO- Failed to extract fallback artifacts from Gump Repository



    The following work was performed:
    http://vmgump.apache.org/gump/public/turbine-core/turbine-core/gump_work/build_turbine-core_turbine-core.html
    Work Name: build_turbine-core_turbine-core (Type: Build)
    Work ended in a state of : Failed
    Elapsed: 26 secs
    Command Line: /opt/maven2/bin/mvn --batch-mode -DskipTests=true --settings /srv/gump/public/workspace/turbine-core/gump_mvn_settings.xml package
    [Working Directory: /srv/gump/public/workspace/turbine-core]
    M2_HOME: /opt/maven2
    ---------------------------------------------
    urls[19] = file:/srv/gump/public/workspace/mvnlocalrepo/shared/xml-apis/xml-apis/1.0.b2/xml-apis-1.0.b2.jar
    urls[20] = file:/srv/gump/public/workspace/mvnlocalrepo/shared/commons-configuration/commons-configuration/1.4/commons-configuration-1.4.jar
    urls[21] = file:/srv/gump/public/workspace/mvnlocalrepo/shared/commons-logging/commons-logging-api/1.0.4/commons-logging-api-1.0.4.jar
    urls[22] = file:/srv/gump/public/workspace/mvnlocalrepo/shared/commons-digester/commons-digester/1.8/commons-digester-1.8.jar
    urls[23] = file:/srv/gump/public/workspace/mvnlocalrepo/shared/commons-beanutils/commons-beanutils/1.7.0/commons-beanutils-1.7.0.jar
    urls[24] = file:/srv/gump/public/workspace/mvnlocalrepo/shared/commons-beanutils/commons-beanutils-core/1.7.0/commons-beanutils-core-1.7.0.jar
    urls[25] = file:/srv/gump/public/workspace/mvnlocalrepo/shared/commons-codec/commons-codec/1.3/commons-codec-1.3.jar
    urls[26] = file:/srv/gump/public/workspace/mvnlocalrepo/shared/commons-jxpath/commons-jxpath/1.2/commons-jxpath-1.2.jar
    urls[27] = file:/srv/gump/public/workspace/mvnlocalrepo/shared/xerces/xerces/1.2.3/xerces-1.2.3.jar
    urls[28] = file:/srv/gump/public/workspace/mvnlocalrepo/shared/ant/ant-optional/1.5.1/ant-optional-1.5.1.jar
    urls[29] = file:/srv/gump/public/workspace/mvnlocalrepo/shared/jdom/jdom/b9/jdom-b9.jar
    Number of imports: 10
    import: org.codehaus.classworlds.Entry@a6c57a42
    import: org.codehaus.classworlds.Entry@12f43f3b
    import: org.codehaus.classworlds.Entry@20025374
    import: org.codehaus.classworlds.Entry@f8e44ca4
    import: org.codehaus.classworlds.Entry@92758522
    import: org.codehaus.classworlds.Entry@ebf2705b
    import: org.codehaus.classworlds.Entry@bb25e54
    import: org.codehaus.classworlds.Entry@bece5185
    import: org.codehaus.classworlds.Entry@3fee8e37
    import: org.codehaus.classworlds.Entry@3fee19d8


    this realm = plexus.core
    urls[0] = file:/opt/maven2/lib/maven-2.2.1-uber.jar
    Number of imports: 10
    import: org.codehaus.classworlds.Entry@a6c57a42
    import: org.codehaus.classworlds.Entry@12f43f3b
    import: org.codehaus.classworlds.Entry@20025374
    import: org.codehaus.classworlds.Entry@f8e44ca4
    import: org.codehaus.classworlds.Entry@92758522
    import: org.codehaus.classworlds.Entry@ebf2705b
    import: org.codehaus.classworlds.Entry@bb25e54
    import: org.codehaus.classworlds.Entry@bece5185
    import: org.codehaus.classworlds.Entry@3fee8e37
    import: org.codehaus.classworlds.Entry@3fee19d8
    -----------------------------------------------------
    [INFO] ------------------------------------------------------------------------
    [ERROR] BUILD ERROR
    [INFO] ------------------------------------------------------------------------
    [INFO] Internal error in the plugin manager executing goal 'org.apache.torque:torque-maven-plugin:3.3:om': Unable to load the mojo 'org.apache.torque:torque-maven-plugin:3.3:om' in the plugin 'org.apache.torque:torque-maven-plugin'. A required class is missing: org/apache/torque/task/TorqueDataModelTask
    org.apache.torque.task.TorqueDataModelTask
    [INFO] ------------------------------------------------------------------------
    [INFO] For more information, run Maven with the -e switch
    [INFO] ------------------------------------------------------------------------
    [INFO] Total time: 25 seconds
    [INFO] Finished at: Fri May 27 11:31:34 UTC 2011
    [INFO] Final Memory: 30M/72M
    [INFO] ------------------------------------------------------------------------
    ---------------------------------------------

    To subscribe to this information via syndicated feeds:
    - RSS: http://vmgump.apache.org/gump/public/turbine-core/turbine-core/rss.xml
    - Atom: http://vmgump.apache.org/gump/public/turbine-core/turbine-core/atom.xml

    ============================== Gump Tracking Only ===
    Produced by Apache Gump(TM) version 2.3.
    Gump Run 05000627052011, vmgump.apache.org:vmgump:05000627052011
    Gump E-mail Identifier (unique within run) #41.

    --
    Apache Gump
    http://gump.apache.org/ [Instance: vmgump]

    ---------------------------------------------------------------------
    To unsubscribe, e-mail: dev-unsubscribe@turbine.apache.org
    For additional commands, e-mail: dev-help@turbine.apache.org
  • Anonymous at May 28, 2011 at 11:47 am
    To whom it may engage...

    This is an automated request, but not an unsolicited one. For
    more information please visit http://gump.apache.org/nagged.html,
    and/or contact the folk at general@gump.apache.org.

    Project turbine-core has an issue affecting its community integration.
    This issue affects 2 projects,
    and has been outstanding for 176 runs.
    The current state of this project is 'Failed', with reason 'Build Failed'.
    For reference only, the following projects are affected by this:
    - turbine-core : A servlet based framework.
    - turbine-core-test : A servlet based framework.


    Full details are available at:
    http://vmgump.apache.org/gump/public/turbine-core/turbine-core/index.html

    That said, some information snippets are provided here.

    The following annotations (debug/informational/warning/error messages) were provided:
    -INFO- Optional dependency commons-fileupload prerequisite failed with reason build failed
    -INFO- Optional dependency httpunit failed with reason build failed
    -DEBUG- (Apache Gump generated) Apache Maven Settings in: /srv/gump/public/workspace/turbine-core/gump_mvn_settings.xml
    -INFO- Failed with reason build failed
    -DEBUG- Maven POM in: /srv/gump/public/workspace/turbine-core/pom.xml
    -INFO- Failed to extract fallback artifacts from Gump Repository



    The following work was performed:
    http://vmgump.apache.org/gump/public/turbine-core/turbine-core/gump_work/build_turbine-core_turbine-core.html
    Work Name: build_turbine-core_turbine-core (Type: Build)
    Work ended in a state of : Failed
    Elapsed: 28 secs
    Command Line: /opt/maven2/bin/mvn --batch-mode -DskipTests=true --settings /srv/gump/public/workspace/turbine-core/gump_mvn_settings.xml package
    [Working Directory: /srv/gump/public/workspace/turbine-core]
    M2_HOME: /opt/maven2
    ---------------------------------------------
    urls[19] = file:/srv/gump/public/workspace/mvnlocalrepo/shared/xml-apis/xml-apis/1.0.b2/xml-apis-1.0.b2.jar
    urls[20] = file:/srv/gump/public/workspace/mvnlocalrepo/shared/commons-configuration/commons-configuration/1.4/commons-configuration-1.4.jar
    urls[21] = file:/srv/gump/public/workspace/mvnlocalrepo/shared/commons-logging/commons-logging-api/1.0.4/commons-logging-api-1.0.4.jar
    urls[22] = file:/srv/gump/public/workspace/mvnlocalrepo/shared/commons-digester/commons-digester/1.8/commons-digester-1.8.jar
    urls[23] = file:/srv/gump/public/workspace/mvnlocalrepo/shared/commons-beanutils/commons-beanutils/1.7.0/commons-beanutils-1.7.0.jar
    urls[24] = file:/srv/gump/public/workspace/mvnlocalrepo/shared/commons-beanutils/commons-beanutils-core/1.7.0/commons-beanutils-core-1.7.0.jar
    urls[25] = file:/srv/gump/public/workspace/mvnlocalrepo/shared/commons-codec/commons-codec/1.3/commons-codec-1.3.jar
    urls[26] = file:/srv/gump/public/workspace/mvnlocalrepo/shared/commons-jxpath/commons-jxpath/1.2/commons-jxpath-1.2.jar
    urls[27] = file:/srv/gump/public/workspace/mvnlocalrepo/shared/xerces/xerces/1.2.3/xerces-1.2.3.jar
    urls[28] = file:/srv/gump/public/workspace/mvnlocalrepo/shared/ant/ant-optional/1.5.1/ant-optional-1.5.1.jar
    urls[29] = file:/srv/gump/public/workspace/mvnlocalrepo/shared/jdom/jdom/b9/jdom-b9.jar
    Number of imports: 10
    import: org.codehaus.classworlds.Entry@a6c57a42
    import: org.codehaus.classworlds.Entry@12f43f3b
    import: org.codehaus.classworlds.Entry@20025374
    import: org.codehaus.classworlds.Entry@f8e44ca4
    import: org.codehaus.classworlds.Entry@92758522
    import: org.codehaus.classworlds.Entry@ebf2705b
    import: org.codehaus.classworlds.Entry@bb25e54
    import: org.codehaus.classworlds.Entry@bece5185
    import: org.codehaus.classworlds.Entry@3fee8e37
    import: org.codehaus.classworlds.Entry@3fee19d8


    this realm = plexus.core
    urls[0] = file:/opt/maven2/lib/maven-2.2.1-uber.jar
    Number of imports: 10
    import: org.codehaus.classworlds.Entry@a6c57a42
    import: org.codehaus.classworlds.Entry@12f43f3b
    import: org.codehaus.classworlds.Entry@20025374
    import: org.codehaus.classworlds.Entry@f8e44ca4
    import: org.codehaus.classworlds.Entry@92758522
    import: org.codehaus.classworlds.Entry@ebf2705b
    import: org.codehaus.classworlds.Entry@bb25e54
    import: org.codehaus.classworlds.Entry@bece5185
    import: org.codehaus.classworlds.Entry@3fee8e37
    import: org.codehaus.classworlds.Entry@3fee19d8
    -----------------------------------------------------
    [INFO] ------------------------------------------------------------------------
    [ERROR] BUILD ERROR
    [INFO] ------------------------------------------------------------------------
    [INFO] Internal error in the plugin manager executing goal 'org.apache.torque:torque-maven-plugin:3.3:om': Unable to load the mojo 'org.apache.torque:torque-maven-plugin:3.3:om' in the plugin 'org.apache.torque:torque-maven-plugin'. A required class is missing: org/apache/torque/task/TorqueDataModelTask
    org.apache.torque.task.TorqueDataModelTask
    [INFO] ------------------------------------------------------------------------
    [INFO] For more information, run Maven with the -e switch
    [INFO] ------------------------------------------------------------------------
    [INFO] Total time: 27 seconds
    [INFO] Finished at: Sat May 28 11:47:28 UTC 2011
    [INFO] Final Memory: 30M/72M
    [INFO] ------------------------------------------------------------------------
    ---------------------------------------------

    To subscribe to this information via syndicated feeds:
    - RSS: http://vmgump.apache.org/gump/public/turbine-core/turbine-core/rss.xml
    - Atom: http://vmgump.apache.org/gump/public/turbine-core/turbine-core/atom.xml

    ============================== Gump Tracking Only ===
    Produced by Apache Gump(TM) version 2.3.
    Gump Run 05000628052011, vmgump.apache.org:vmgump:05000628052011
    Gump E-mail Identifier (unique within run) #39.

    --
    Apache Gump
    http://gump.apache.org/ [Instance: vmgump]

    ---------------------------------------------------------------------
    To unsubscribe, e-mail: dev-unsubscribe@turbine.apache.org
    For additional commands, e-mail: dev-help@turbine.apache.org
  • Anonymous at May 29, 2011 at 11:34 am
    To whom it may engage...

    This is an automated request, but not an unsolicited one. For
    more information please visit http://gump.apache.org/nagged.html,
    and/or contact the folk at general@gump.apache.org.

    Project turbine-core has an issue affecting its community integration.
    This issue affects 2 projects,
    and has been outstanding for 178 runs.
    The current state of this project is 'Failed', with reason 'Build Failed'.
    For reference only, the following projects are affected by this:
    - turbine-core : A servlet based framework.
    - turbine-core-test : A servlet based framework.


    Full details are available at:
    http://vmgump.apache.org/gump/public/turbine-core/turbine-core/index.html

    That said, some information snippets are provided here.

    The following annotations (debug/informational/warning/error messages) were provided:
    -INFO- Optional dependency commons-fileupload prerequisite failed with reason build failed
    -INFO- Optional dependency httpunit failed with reason build failed
    -DEBUG- (Apache Gump generated) Apache Maven Settings in: /srv/gump/public/workspace/turbine-core/gump_mvn_settings.xml
    -INFO- Failed with reason build failed
    -DEBUG- Maven POM in: /srv/gump/public/workspace/turbine-core/pom.xml
    -INFO- Failed to extract fallback artifacts from Gump Repository



    The following work was performed:
    http://vmgump.apache.org/gump/public/turbine-core/turbine-core/gump_work/build_turbine-core_turbine-core.html
    Work Name: build_turbine-core_turbine-core (Type: Build)
    Work ended in a state of : Failed
    Elapsed: 26 secs
    Command Line: /opt/maven2/bin/mvn --batch-mode -DskipTests=true --settings /srv/gump/public/workspace/turbine-core/gump_mvn_settings.xml package
    [Working Directory: /srv/gump/public/workspace/turbine-core]
    M2_HOME: /opt/maven2
    ---------------------------------------------
    urls[19] = file:/srv/gump/public/workspace/mvnlocalrepo/shared/xml-apis/xml-apis/1.0.b2/xml-apis-1.0.b2.jar
    urls[20] = file:/srv/gump/public/workspace/mvnlocalrepo/shared/commons-configuration/commons-configuration/1.4/commons-configuration-1.4.jar
    urls[21] = file:/srv/gump/public/workspace/mvnlocalrepo/shared/commons-logging/commons-logging-api/1.0.4/commons-logging-api-1.0.4.jar
    urls[22] = file:/srv/gump/public/workspace/mvnlocalrepo/shared/commons-digester/commons-digester/1.8/commons-digester-1.8.jar
    urls[23] = file:/srv/gump/public/workspace/mvnlocalrepo/shared/commons-beanutils/commons-beanutils/1.7.0/commons-beanutils-1.7.0.jar
    urls[24] = file:/srv/gump/public/workspace/mvnlocalrepo/shared/commons-beanutils/commons-beanutils-core/1.7.0/commons-beanutils-core-1.7.0.jar
    urls[25] = file:/srv/gump/public/workspace/mvnlocalrepo/shared/commons-codec/commons-codec/1.3/commons-codec-1.3.jar
    urls[26] = file:/srv/gump/public/workspace/mvnlocalrepo/shared/commons-jxpath/commons-jxpath/1.2/commons-jxpath-1.2.jar
    urls[27] = file:/srv/gump/public/workspace/mvnlocalrepo/shared/xerces/xerces/1.2.3/xerces-1.2.3.jar
    urls[28] = file:/srv/gump/public/workspace/mvnlocalrepo/shared/ant/ant-optional/1.5.1/ant-optional-1.5.1.jar
    urls[29] = file:/srv/gump/public/workspace/mvnlocalrepo/shared/jdom/jdom/b9/jdom-b9.jar
    Number of imports: 10
    import: org.codehaus.classworlds.Entry@a6c57a42
    import: org.codehaus.classworlds.Entry@12f43f3b
    import: org.codehaus.classworlds.Entry@20025374
    import: org.codehaus.classworlds.Entry@f8e44ca4
    import: org.codehaus.classworlds.Entry@92758522
    import: org.codehaus.classworlds.Entry@ebf2705b
    import: org.codehaus.classworlds.Entry@bb25e54
    import: org.codehaus.classworlds.Entry@bece5185
    import: org.codehaus.classworlds.Entry@3fee8e37
    import: org.codehaus.classworlds.Entry@3fee19d8


    this realm = plexus.core
    urls[0] = file:/opt/maven2/lib/maven-2.2.1-uber.jar
    Number of imports: 10
    import: org.codehaus.classworlds.Entry@a6c57a42
    import: org.codehaus.classworlds.Entry@12f43f3b
    import: org.codehaus.classworlds.Entry@20025374
    import: org.codehaus.classworlds.Entry@f8e44ca4
    import: org.codehaus.classworlds.Entry@92758522
    import: org.codehaus.classworlds.Entry@ebf2705b
    import: org.codehaus.classworlds.Entry@bb25e54
    import: org.codehaus.classworlds.Entry@bece5185
    import: org.codehaus.classworlds.Entry@3fee8e37
    import: org.codehaus.classworlds.Entry@3fee19d8
    -----------------------------------------------------
    [INFO] ------------------------------------------------------------------------
    [ERROR] BUILD ERROR
    [INFO] ------------------------------------------------------------------------
    [INFO] Internal error in the plugin manager executing goal 'org.apache.torque:torque-maven-plugin:3.3:om': Unable to load the mojo 'org.apache.torque:torque-maven-plugin:3.3:om' in the plugin 'org.apache.torque:torque-maven-plugin'. A required class is missing: org/apache/torque/task/TorqueDataModelTask
    org.apache.torque.task.TorqueDataModelTask
    [INFO] ------------------------------------------------------------------------
    [INFO] For more information, run Maven with the -e switch
    [INFO] ------------------------------------------------------------------------
    [INFO] Total time: 25 seconds
    [INFO] Finished at: Sun May 29 11:34:17 UTC 2011
    [INFO] Final Memory: 30M/72M
    [INFO] ------------------------------------------------------------------------
    ---------------------------------------------

    To subscribe to this information via syndicated feeds:
    - RSS: http://vmgump.apache.org/gump/public/turbine-core/turbine-core/rss.xml
    - Atom: http://vmgump.apache.org/gump/public/turbine-core/turbine-core/atom.xml

    ============================== Gump Tracking Only ===
    Produced by Apache Gump(TM) version 2.3.
    Gump Run 05000629052011, vmgump.apache.org:vmgump:05000629052011
    Gump E-mail Identifier (unique within run) #41.

    --
    Apache Gump
    http://gump.apache.org/ [Instance: vmgump]

    ---------------------------------------------------------------------
    To unsubscribe, e-mail: dev-unsubscribe@turbine.apache.org
    For additional commands, e-mail: dev-help@turbine.apache.org
  • Anonymous at May 30, 2011 at 12:06 pm
    To whom it may engage...

    This is an automated request, but not an unsolicited one. For
    more information please visit http://gump.apache.org/nagged.html,
    and/or contact the folk at general@gump.apache.org.

    Project turbine-core has an issue affecting its community integration.
    This issue affects 2 projects,
    and has been outstanding for 180 runs.
    The current state of this project is 'Failed', with reason 'Build Failed'.
    For reference only, the following projects are affected by this:
    - turbine-core : A servlet based framework.
    - turbine-core-test : A servlet based framework.


    Full details are available at:
    http://vmgump.apache.org/gump/public/turbine-core/turbine-core/index.html

    That said, some information snippets are provided here.

    The following annotations (debug/informational/warning/error messages) were provided:
    -INFO- Optional dependency commons-fileupload prerequisite failed with reason build failed
    -INFO- Optional dependency httpunit failed with reason build failed
    -DEBUG- (Apache Gump generated) Apache Maven Settings in: /srv/gump/public/workspace/turbine-core/gump_mvn_settings.xml
    -INFO- Failed with reason build failed
    -DEBUG- Maven POM in: /srv/gump/public/workspace/turbine-core/pom.xml
    -INFO- Failed to extract fallback artifacts from Gump Repository



    The following work was performed:
    http://vmgump.apache.org/gump/public/turbine-core/turbine-core/gump_work/build_turbine-core_turbine-core.html
    Work Name: build_turbine-core_turbine-core (Type: Build)
    Work ended in a state of : Failed
    Elapsed: 3 mins 36 secs
    Command Line: /opt/maven2/bin/mvn --batch-mode -DskipTests=true --settings /srv/gump/public/workspace/turbine-core/gump_mvn_settings.xml package
    [Working Directory: /srv/gump/public/workspace/turbine-core]
    M2_HOME: /opt/maven2
    ---------------------------------------------
    urls[19] = file:/srv/gump/public/workspace/mvnlocalrepo/shared/xml-apis/xml-apis/1.0.b2/xml-apis-1.0.b2.jar
    urls[20] = file:/srv/gump/public/workspace/mvnlocalrepo/shared/commons-configuration/commons-configuration/1.4/commons-configuration-1.4.jar
    urls[21] = file:/srv/gump/public/workspace/mvnlocalrepo/shared/commons-logging/commons-logging-api/1.0.4/commons-logging-api-1.0.4.jar
    urls[22] = file:/srv/gump/public/workspace/mvnlocalrepo/shared/commons-digester/commons-digester/1.8/commons-digester-1.8.jar
    urls[23] = file:/srv/gump/public/workspace/mvnlocalrepo/shared/commons-beanutils/commons-beanutils/1.7.0/commons-beanutils-1.7.0.jar
    urls[24] = file:/srv/gump/public/workspace/mvnlocalrepo/shared/commons-beanutils/commons-beanutils-core/1.7.0/commons-beanutils-core-1.7.0.jar
    urls[25] = file:/srv/gump/public/workspace/mvnlocalrepo/shared/commons-codec/commons-codec/1.3/commons-codec-1.3.jar
    urls[26] = file:/srv/gump/public/workspace/mvnlocalrepo/shared/commons-jxpath/commons-jxpath/1.2/commons-jxpath-1.2.jar
    urls[27] = file:/srv/gump/public/workspace/mvnlocalrepo/shared/xerces/xerces/1.2.3/xerces-1.2.3.jar
    urls[28] = file:/srv/gump/public/workspace/mvnlocalrepo/shared/ant/ant-optional/1.5.1/ant-optional-1.5.1.jar
    urls[29] = file:/srv/gump/public/workspace/mvnlocalrepo/shared/jdom/jdom/b9/jdom-b9.jar
    Number of imports: 10
    import: org.codehaus.classworlds.Entry@a6c57a42
    import: org.codehaus.classworlds.Entry@12f43f3b
    import: org.codehaus.classworlds.Entry@20025374
    import: org.codehaus.classworlds.Entry@f8e44ca4
    import: org.codehaus.classworlds.Entry@92758522
    import: org.codehaus.classworlds.Entry@ebf2705b
    import: org.codehaus.classworlds.Entry@bb25e54
    import: org.codehaus.classworlds.Entry@bece5185
    import: org.codehaus.classworlds.Entry@3fee8e37
    import: org.codehaus.classworlds.Entry@3fee19d8


    this realm = plexus.core
    urls[0] = file:/opt/maven2/lib/maven-2.2.1-uber.jar
    Number of imports: 10
    import: org.codehaus.classworlds.Entry@a6c57a42
    import: org.codehaus.classworlds.Entry@12f43f3b
    import: org.codehaus.classworlds.Entry@20025374
    import: org.codehaus.classworlds.Entry@f8e44ca4
    import: org.codehaus.classworlds.Entry@92758522
    import: org.codehaus.classworlds.Entry@ebf2705b
    import: org.codehaus.classworlds.Entry@bb25e54
    import: org.codehaus.classworlds.Entry@bece5185
    import: org.codehaus.classworlds.Entry@3fee8e37
    import: org.codehaus.classworlds.Entry@3fee19d8
    -----------------------------------------------------
    [INFO] ------------------------------------------------------------------------
    [ERROR] BUILD ERROR
    [INFO] ------------------------------------------------------------------------
    [INFO] Internal error in the plugin manager executing goal 'org.apache.torque:torque-maven-plugin:3.3:om': Unable to load the mojo 'org.apache.torque:torque-maven-plugin:3.3:om' in the plugin 'org.apache.torque:torque-maven-plugin'. A required class is missing: org/apache/torque/task/TorqueDataModelTask
    org.apache.torque.task.TorqueDataModelTask
    [INFO] ------------------------------------------------------------------------
    [INFO] For more information, run Maven with the -e switch
    [INFO] ------------------------------------------------------------------------
    [INFO] Total time: 3 minutes 35 seconds
    [INFO] Finished at: Mon May 30 12:06:23 UTC 2011
    [INFO] Final Memory: 30M/71M
    [INFO] ------------------------------------------------------------------------
    ---------------------------------------------

    To subscribe to this information via syndicated feeds:
    - RSS: http://vmgump.apache.org/gump/public/turbine-core/turbine-core/rss.xml
    - Atom: http://vmgump.apache.org/gump/public/turbine-core/turbine-core/atom.xml

    ============================== Gump Tracking Only ===
    Produced by Apache Gump(TM) version 2.3.
    Gump Run 05000630052011, vmgump.apache.org:vmgump:05000630052011
    Gump E-mail Identifier (unique within run) #40.

    --
    Apache Gump
    http://gump.apache.org/ [Instance: vmgump]

    ---------------------------------------------------------------------
    To unsubscribe, e-mail: dev-unsubscribe@turbine.apache.org
    For additional commands, e-mail: dev-help@turbine.apache.org
  • Anonymous at May 31, 2011 at 11:37 am
    To whom it may engage...

    This is an automated request, but not an unsolicited one. For
    more information please visit http://gump.apache.org/nagged.html,
    and/or contact the folk at general@gump.apache.org.

    Project turbine-core has an issue affecting its community integration.
    This issue affects 2 projects,
    and has been outstanding for 182 runs.
    The current state of this project is 'Failed', with reason 'Build Failed'.
    For reference only, the following projects are affected by this:
    - turbine-core : A servlet based framework.
    - turbine-core-test : A servlet based framework.


    Full details are available at:
    http://vmgump.apache.org/gump/public/turbine-core/turbine-core/index.html

    That said, some information snippets are provided here.

    The following annotations (debug/informational/warning/error messages) were provided:
    -INFO- Optional dependency commons-fileupload prerequisite failed with reason build failed
    -INFO- Optional dependency httpunit failed with reason build failed
    -DEBUG- (Apache Gump generated) Apache Maven Settings in: /srv/gump/public/workspace/turbine-core/gump_mvn_settings.xml
    -INFO- Failed with reason build failed
    -DEBUG- Maven POM in: /srv/gump/public/workspace/turbine-core/pom.xml
    -INFO- Failed to extract fallback artifacts from Gump Repository



    The following work was performed:
    http://vmgump.apache.org/gump/public/turbine-core/turbine-core/gump_work/build_turbine-core_turbine-core.html
    Work Name: build_turbine-core_turbine-core (Type: Build)
    Work ended in a state of : Failed
    Elapsed: 25 secs
    Command Line: /opt/maven2/bin/mvn --batch-mode -DskipTests=true --settings /srv/gump/public/workspace/turbine-core/gump_mvn_settings.xml package
    [Working Directory: /srv/gump/public/workspace/turbine-core]
    M2_HOME: /opt/maven2
    ---------------------------------------------
    urls[19] = file:/srv/gump/public/workspace/mvnlocalrepo/shared/xml-apis/xml-apis/1.0.b2/xml-apis-1.0.b2.jar
    urls[20] = file:/srv/gump/public/workspace/mvnlocalrepo/shared/commons-configuration/commons-configuration/1.4/commons-configuration-1.4.jar
    urls[21] = file:/srv/gump/public/workspace/mvnlocalrepo/shared/commons-logging/commons-logging-api/1.0.4/commons-logging-api-1.0.4.jar
    urls[22] = file:/srv/gump/public/workspace/mvnlocalrepo/shared/commons-digester/commons-digester/1.8/commons-digester-1.8.jar
    urls[23] = file:/srv/gump/public/workspace/mvnlocalrepo/shared/commons-beanutils/commons-beanutils/1.7.0/commons-beanutils-1.7.0.jar
    urls[24] = file:/srv/gump/public/workspace/mvnlocalrepo/shared/commons-beanutils/commons-beanutils-core/1.7.0/commons-beanutils-core-1.7.0.jar
    urls[25] = file:/srv/gump/public/workspace/mvnlocalrepo/shared/commons-codec/commons-codec/1.3/commons-codec-1.3.jar
    urls[26] = file:/srv/gump/public/workspace/mvnlocalrepo/shared/commons-jxpath/commons-jxpath/1.2/commons-jxpath-1.2.jar
    urls[27] = file:/srv/gump/public/workspace/mvnlocalrepo/shared/xerces/xerces/1.2.3/xerces-1.2.3.jar
    urls[28] = file:/srv/gump/public/workspace/mvnlocalrepo/shared/ant/ant-optional/1.5.1/ant-optional-1.5.1.jar
    urls[29] = file:/srv/gump/public/workspace/mvnlocalrepo/shared/jdom/jdom/b9/jdom-b9.jar
    Number of imports: 10
    import: org.codehaus.classworlds.Entry@a6c57a42
    import: org.codehaus.classworlds.Entry@12f43f3b
    import: org.codehaus.classworlds.Entry@20025374
    import: org.codehaus.classworlds.Entry@f8e44ca4
    import: org.codehaus.classworlds.Entry@92758522
    import: org.codehaus.classworlds.Entry@ebf2705b
    import: org.codehaus.classworlds.Entry@bb25e54
    import: org.codehaus.classworlds.Entry@bece5185
    import: org.codehaus.classworlds.Entry@3fee8e37
    import: org.codehaus.classworlds.Entry@3fee19d8


    this realm = plexus.core
    urls[0] = file:/opt/maven2/lib/maven-2.2.1-uber.jar
    Number of imports: 10
    import: org.codehaus.classworlds.Entry@a6c57a42
    import: org.codehaus.classworlds.Entry@12f43f3b
    import: org.codehaus.classworlds.Entry@20025374
    import: org.codehaus.classworlds.Entry@f8e44ca4
    import: org.codehaus.classworlds.Entry@92758522
    import: org.codehaus.classworlds.Entry@ebf2705b
    import: org.codehaus.classworlds.Entry@bb25e54
    import: org.codehaus.classworlds.Entry@bece5185
    import: org.codehaus.classworlds.Entry@3fee8e37
    import: org.codehaus.classworlds.Entry@3fee19d8
    -----------------------------------------------------
    [INFO] ------------------------------------------------------------------------
    [ERROR] BUILD ERROR
    [INFO] ------------------------------------------------------------------------
    [INFO] Internal error in the plugin manager executing goal 'org.apache.torque:torque-maven-plugin:3.3:om': Unable to load the mojo 'org.apache.torque:torque-maven-plugin:3.3:om' in the plugin 'org.apache.torque:torque-maven-plugin'. A required class is missing: org/apache/torque/task/TorqueDataModelTask
    org.apache.torque.task.TorqueDataModelTask
    [INFO] ------------------------------------------------------------------------
    [INFO] For more information, run Maven with the -e switch
    [INFO] ------------------------------------------------------------------------
    [INFO] Total time: 24 seconds
    [INFO] Finished at: Tue May 31 11:36:43 UTC 2011
    [INFO] Final Memory: 30M/72M
    [INFO] ------------------------------------------------------------------------
    ---------------------------------------------

    To subscribe to this information via syndicated feeds:
    - RSS: http://vmgump.apache.org/gump/public/turbine-core/turbine-core/rss.xml
    - Atom: http://vmgump.apache.org/gump/public/turbine-core/turbine-core/atom.xml

    ============================== Gump Tracking Only ===
    Produced by Apache Gump(TM) version 2.3.
    Gump Run 05000631052011, vmgump.apache.org:vmgump:05000631052011
    Gump E-mail Identifier (unique within run) #39.

    --
    Apache Gump
    http://gump.apache.org/ [Instance: vmgump]

    ---------------------------------------------------------------------
    To unsubscribe, e-mail: dev-unsubscribe@turbine.apache.org
    For additional commands, e-mail: dev-help@turbine.apache.org

Related Discussions

Discussion Navigation
viewthread | post
Discussion Overview
groupdev @
categoriesturbine
postedMay 1, '11 at 7:31a
activeMay 31, '11 at 11:37a
posts31
users1
websiteturbine.apache.org

1 user in discussion

Anonymous: 31 posts

People

Translate

site design / logo © 2018 Grokbase