FAQ
See <http://perl5.git.perl.org:8080/job/perl5-win32/2445/changes>

Changes:

[jkeenan] Modify hints for Hurd per Debian ticket 825020.

[khw] Add an example of the '0x' string format.

------------------------------------------
[...truncated 6701 lines...]
../ext/PerlIO-encoding/t/threads.t ................................. ok
../ext/PerlIO-scalar/t/scalar.t .................................... ok
../ext/PerlIO-scalar/t/scalar_ungetc.t ............................. ok
../ext/PerlIO-via/t/via.t .......................................... ok
../ext/Pod-Functions/t/Functions.t ................................. ok
../ext/Pod-Html/t/anchorify.t ...................................... ok
../ext/Pod-Html/t/cache.t .......................................... ok
../ext/Pod-Html/t/crossref.t ....................................... ok
../ext/Pod-Html/t/crossref2.t ...................................... ok
../ext/Pod-Html/t/crossref3.t ...................................... ok
../ext/Pod-Html/t/eol.t ............................................ ok
../ext/Pod-Html/t/feature.t ........................................ ok
../ext/Pod-Html/t/feature2.t ....................................... ok
../ext/Pod-Html/t/htmldir1.t ....................................... ok
../ext/Pod-Html/t/htmldir2.t ....................................... ok
../ext/Pod-Html/t/htmldir3.t ....................................... ok
../ext/Pod-Html/t/htmldir4.t ....................................... ok
../ext/Pod-Html/t/htmldir5.t ....................................... ok
../ext/Pod-Html/t/htmlescp.t ....................................... ok
../ext/Pod-Html/t/htmllink.t ....................................... ok
../ext/Pod-Html/t/htmlview.t ....................................... ok
../ext/Pod-Html/t/poderr.t ......................................... ok
../ext/Pod-Html/t/podnoerr.t ....................................... ok
../ext/SDBM_File/t/constants.t ..................................... ok
../ext/SDBM_File/t/prep.t .......................................... ok
../ext/SDBM_File/t/sdbm.t .......................................... ok
../ext/Sys-Hostname/t/Hostname.t ................................... ok
../ext/Tie-Hash-NamedCapture/t/tiehash.t ........................... ok
../ext/Tie-Memoize/t/Tie-Memoize.t ................................. ok
../ext/Win32CORE/t/win32core.t ..................................... ok
../ext/XS-APItest/t/addissub.t ..................................... ok
../ext/XS-APItest/t/arrayexpr.t .................................... ok
../ext/XS-APItest/t/autoload.t ..................................... ok
../ext/XS-APItest/t/blockasexpr.t .................................. ok
../ext/XS-APItest/t/blockhooks-csc.t ............................... ok
../ext/XS-APItest/t/blockhooks.t ................................... ok
../ext/XS-APItest/t/call.t ......................................... ok
../ext/XS-APItest/t/call_checker.t ................................. ok
../ext/XS-APItest/t/caller.t ....................................... ok
../ext/XS-APItest/t/callregexec.t .................................. ok
../ext/XS-APItest/t/check_warnings.t ............................... ok
../ext/XS-APItest/t/cleanup.t ...................................... ok
../ext/XS-APItest/t/clone-with-stack.t ............................. ok
../ext/XS-APItest/t/cophh.t ........................................ ok
../ext/XS-APItest/t/coplabel.t ..................................... ok
../ext/XS-APItest/t/copstash.t ..................................... ok
../ext/XS-APItest/t/copyhints.t .................................... ok
../ext/XS-APItest/t/customop.t ..................................... ok
../ext/XS-APItest/t/cv_name.t ...................................... ok
../ext/XS-APItest/t/eval-filter.t .................................. ok
../ext/XS-APItest/t/exception.t .................................... ok
../ext/XS-APItest/t/extend.t ....................................... ok
../ext/XS-APItest/t/fetch_pad_names.t .............................. ok
../ext/XS-APItest/t/gotosub.t ...................................... ok
../ext/XS-APItest/t/grok.t ......................................... ok
../ext/XS-APItest/t/gv_autoload4.t ................................. ok
../ext/XS-APItest/t/gv_const_sv.t .................................. ok
../ext/XS-APItest/t/gv_fetchmeth.t ................................. ok
../ext/XS-APItest/t/gv_fetchmeth_autoload.t ........................ ok
../ext/XS-APItest/t/gv_fetchmethod_flags.t ......................... ok
../ext/XS-APItest/t/gv_init.t ...................................... ok
../ext/XS-APItest/t/handy.t ........................................ ok
../ext/XS-APItest/t/hash.t ......................................... ok
../ext/XS-APItest/t/join_with_space.t .............................. ok
../ext/XS-APItest/t/keyword_multiline.t ............................ ok
../ext/XS-APItest/t/keyword_plugin.t ............................... ok
../ext/XS-APItest/t/labelconst.t ................................... ok
../ext/XS-APItest/t/lexsub.t ....................................... ok
../ext/XS-APItest/t/load-module.t .................................. ok
../ext/XS-APItest/t/locale.t ....................................... ok
../ext/XS-APItest/t/loopblock.t .................................... ok
../ext/XS-APItest/t/looprest.t ..................................... ok
../ext/XS-APItest/t/lvalue.t ....................................... ok
../ext/XS-APItest/t/magic.t ........................................ ok
../ext/XS-APItest/t/magic_chain.t .................................. ok
../ext/XS-APItest/t/mro.t .......................................... ok
../ext/XS-APItest/t/multicall.t .................................... ok
../ext/XS-APItest/t/my_cxt.t ....................................... ok
../ext/XS-APItest/t/my_exit.t ...................................... ok
../ext/XS-APItest/t/newCONSTSUB.t .................................. ok
../ext/XS-APItest/t/newDEFSVOP.t ................................... ok
../ext/XS-APItest/t/op.t ........................................... ok
../ext/XS-APItest/t/op_contextualize.t ............................. ok
../ext/XS-APItest/t/op_list.t ...................................... ok
../ext/XS-APItest/t/overload.t ..................................... ok
../ext/XS-APItest/t/pad_scalar.t ................................... ok
../ext/XS-APItest/t/peep.t ......................................... ok
../ext/XS-APItest/t/pmflag.t ....................................... ok
../ext/XS-APItest/t/postinc.t ...................................... ok
../ext/XS-APItest/t/printf.t ....................................... ok
../ext/XS-APItest/t/ptr_table.t .................................... ok
../ext/XS-APItest/t/push.t ......................................... ok
../ext/XS-APItest/t/refs.t ......................................... ok
../ext/XS-APItest/t/rmagical.t ..................................... ok
../ext/XS-APItest/t/rv2cv_op_cv.t .................................. ok
../ext/XS-APItest/t/savehints.t .................................... ok
../ext/XS-APItest/t/scopelessblock.t ............................... ok
../ext/XS-APItest/t/sort.t ......................................... ok
../ext/XS-APItest/t/stmtasexpr.t ................................... ok
../ext/XS-APItest/t/stmtsasexpr.t .................................. ok
../ext/XS-APItest/t/stuff_modify_bug.t ............................. ok
../ext/XS-APItest/t/stuff_svcur_bug.t .............................. ok
../ext/XS-APItest/t/subcall.t ...................................... ok
../ext/XS-APItest/t/svcat.t ........................................ ok
../ext/XS-APItest/t/svcatpvf.t ..................................... ok
../ext/XS-APItest/t/sviscow.t ...................................... ok
../ext/XS-APItest/t/svpeek.t ....................................... ok
../ext/XS-APItest/t/svpv.t ......................................... ok
../ext/XS-APItest/t/svpv_magic.t ................................... ok
../ext/XS-APItest/t/svsetsv.t ...................................... ok
../ext/XS-APItest/t/swaplabel.t .................................... ok
../ext/XS-APItest/t/swaptwostmts.t ................................. ok
../ext/XS-APItest/t/sym-hook.t ..................................... ok
../ext/XS-APItest/t/synthetic_scope.t .............................. ok
../ext/XS-APItest/t/temp_lv_sub.t .................................. ok
../ext/XS-APItest/t/underscore_length.t ............................ ok
../ext/XS-APItest/t/utf16_to_utf8.t ................................ ok
../ext/XS-APItest/t/utf8.t ......................................... ok
../ext/XS-APItest/t/weaken.t ....................................... ok
../ext/XS-APItest/t/whichsig.t ..................................... ok
../ext/XS-APItest/t/win32.t ........................................ ok
../ext/XS-APItest/t/xs_special_subs.t .............................. ok
../ext/XS-APItest/t/xs_special_subs_require.t ...................... ok
../ext/XS-APItest/t/xsub_h.t ....................................... ok
../ext/XS-Typemap/t/Typemap.t ...................................... ok
../ext/arybase/t/aeach.t ........................................... ok
../ext/arybase/t/aelem.t ........................................... ok
../ext/arybase/t/akeys.t ........................................... ok
../ext/arybase/t/arybase.t ......................................... ok
../ext/arybase/t/aslice.t .......................................... ok
../ext/arybase/t/av2arylen.t ....................................... ok
../ext/arybase/t/index.t ........................................... ok
../ext/arybase/t/lslice.t .......................................... ok
../ext/arybase/t/pos.t ............................................. ok
../ext/arybase/t/scope.t ........................................... ok
../ext/arybase/t/splice.t .......................................... ok
../ext/arybase/t/substr.t .......................................... ok
../ext/re/t/lexical_debug.t ........................................ ok
../ext/re/t/qr.t ................................................... ok
../ext/re/t/re.t ................................................... ok
../ext/re/t/re_funcs.t ............................................. ok
../ext/re/t/re_funcs_u.t ........................................... ok
../ext/re/t/reflags.t .............................................. ok
../ext/re/t/regop.t ................................................ ok
../ext/re/t/strict.t ............................................... ok
../lib/AnyDBM_File.t ............................................... ok
../lib/B/Deparse-core.t ............................................ ok
../lib/B/Deparse-subclass.t ........................................ ok
../lib/B/Deparse.t ................................................. ok
../lib/Benchmark.t ................................................. ok
../lib/Class/Struct.t .............................................. ok
../lib/Config.t .................................................... ok
../lib/Config/Extensions.t ......................................... ok
../lib/DB.t ........................................................ ok
../lib/DBM_Filter/t/01error.t ...................................... ok
../lib/DBM_Filter/t/02core.t ....................................... ok
../lib/DBM_Filter/t/compress.t ..................................... ok
../lib/DBM_Filter/t/encode.t ....................................... ok
../lib/DBM_Filter/t/int32.t ........................................ ok
../lib/DBM_Filter/t/null.t ......................................... ok
../lib/DBM_Filter/t/utf8.t ......................................... ok
../lib/DirHandle.t ................................................. ok
../lib/English.t ................................................... ok
../lib/ExtUtils/t/Embed.t .......................................... ok
../lib/File/Basename.t ............................................. ok
../lib/File/Compare.t .............................................. ok
../lib/File/Copy.t ................................................. ok
../lib/File/stat-7896.t ............................................ ok
../lib/File/stat.t ................................................. ok
../lib/FileHandle.t ................................................ ok
../lib/FindBin.t ................................................... ok
../lib/Getopt/Std.t ................................................ ok
../lib/Internals.t ................................................. ok
../lib/Net/hostent.t ............................................... ok
../lib/Net/netent.t ................................................ skipped: no getnetbyname
../lib/Net/protoent.t .............................................. skipped: no netdb.h
../lib/Net/servent.t ............................................... skipped: no netdb.h
../lib/Pod/t/InputObjects.t ........................................ ok
../lib/Pod/t/Select.t .............................................. ok
../lib/Pod/t/Usage.t ............................................... ok
../lib/Pod/t/utils.t ............................................... ok
../lib/SelectSaver.t ............................................... ok
../lib/Symbol.t .................................................... ok
../lib/Thread.t .................................................... ok
../lib/Tie/ExtraHash.t ............................................. ok
../lib/Tie/Hash.t .................................................. ok
../lib/Tie/Scalar.t ................................................ ok
../lib/Tie/SubstrHash.t ............................................ ok
../lib/Tie/Array/push.t ............................................ ok
../lib/Tie/Array/splice.t .......................................... ok
../lib/Tie/Array/std.t ............................................. ok
../lib/Tie/Array/stdpush.t ......................................... ok
../lib/Tie/Handle/stdhandle.t ...................................... ok
../lib/Tie/Handle/stdhandle_from_handle.t .......................... ok
../lib/Time/gmtime.t ............................................... ok
../lib/Time/localtime.t ............................................ ok
../lib/Unicode/UCD.t ............................................... ok
../lib/User/grent.t ................................................ skipped: no getgrgid
../lib/User/pwent.t ................................................ skipped: no getpwuid
../lib/blib.t ...................................................... ok
../lib/bytes.t ..................................................... ok
../lib/charnames.t ................................................. ok
../lib/diagnostics.t ............................................... ok
../lib/dumpvar.t ................................................... ok
../lib/feature.t ................................................... ok
../lib/feature/unicode_strings.t ................................... ok
../lib/filetest.t .................................................. ok
../lib/h2ph.t ...................................................... ok
../lib/h2xs.t ...................................................... ok
../lib/integer.t ................................................... ok
../lib/less.t ...................................................... ok
../lib/locale.t .................................................... ok
../lib/meta_notation.t ............................................. ok
../lib/open.t ...................................................... ok
../lib/overload.t .................................................. ok
../lib/overload64.t ................................................ skipped: -- Perl configured with 32-bit ints
../lib/overloading.t ............................................... ok
../lib/perl5db.t ................................................... skipped: no /dev/null
../lib/perlbug.t ................................................... ok
../lib/sigtrap.t ................................................... ok
../lib/sort.t ...................................................... ok
../lib/strict.t .................................................... ok
../lib/subs.t ...................................................... ok
../lib/utf8.t ...................................................... ok
../lib/vars.t ...................................................... ok
../lib/vars_carp.t ................................................. ok
../lib/vmsish.t .................................................... ok
../lib/warnings.t .................................................. ok

Test Summary Report
-------------------
../cpan/Archive-Tar/t/09_roundtrip.t (Wstat: 0 Tests: 7 Failed: 0)
   TODO passed: 1, 4, 6
../cpan/ExtUtils-MakeMaker/t/basic.t (Wstat: 3840 Tests: 186 Failed: 15)
   Failed tests: 22-23, 34-36, 69, 178-186
   Non-zero exit status: 15
../cpan/IO-Socket-IP/t/13addrinfo.t (Wstat: 2304 Tests: 1 Failed: 1)
   Failed test: 1
   Non-zero exit status: 9
   Parse errors: No plan found in TAP output
../ext/IPC-Open3/t/IPC-Open3.t (Wstat: 0 Tests: 45 Failed: 0)
   TODO passed: 25
Files=2469, Tests=826603, 1865 wallclock secs (96.30 usr + 7.78 sys = 104.08 CPU)
Result: FAIL
NMAKE : fatal error U1077: '.\perl.exe' : return code '0x10'
Stop.

<http://perl5.git.perl.org:8080/job/perl5-win32/ws/win32>exit> 2
Build step 'Execute Windows batch command' marked build as failure

Search Discussions

  • Dennis+p5p-jenkins at May 30, 2016 at 5:12 pm
    See <http://perl5.git.perl.org:8080/job/perl5-win32/2446/>

    ------------------------------------------
    [...truncated 6735 lines...]
    ../ext/PerlIO-encoding/t/nolooping.t ............................... ok
    ../ext/PerlIO-encoding/t/threads.t ................................. ok
    ../ext/PerlIO-scalar/t/scalar.t .................................... ok
    ../ext/PerlIO-scalar/t/scalar_ungetc.t ............................. ok
    ../ext/PerlIO-via/t/via.t .......................................... ok
    ../ext/Pod-Functions/t/Functions.t ................................. ok
    ../ext/Pod-Html/t/anchorify.t ...................................... ok
    ../ext/Pod-Html/t/cache.t .......................................... ok
    ../ext/Pod-Html/t/crossref.t ....................................... ok
    ../ext/Pod-Html/t/crossref2.t ...................................... ok
    ../ext/Pod-Html/t/crossref3.t ...................................... ok
    ../ext/Pod-Html/t/eol.t ............................................ ok
    ../ext/Pod-Html/t/feature.t ........................................ ok
    ../ext/Pod-Html/t/feature2.t ....................................... ok
    ../ext/Pod-Html/t/htmldir1.t ....................................... ok
    ../ext/Pod-Html/t/htmldir2.t ....................................... ok
    ../ext/Pod-Html/t/htmldir3.t ....................................... ok
    ../ext/Pod-Html/t/htmldir4.t ....................................... ok
    ../ext/Pod-Html/t/htmldir5.t ....................................... ok
    ../ext/Pod-Html/t/htmlescp.t ....................................... ok
    ../ext/Pod-Html/t/htmllink.t ....................................... ok
    ../ext/Pod-Html/t/htmlview.t ....................................... ok
    ../ext/Pod-Html/t/poderr.t ......................................... ok
    ../ext/Pod-Html/t/podnoerr.t ....................................... ok
    ../ext/SDBM_File/t/constants.t ..................................... ok
    ../ext/SDBM_File/t/prep.t .......................................... ok
    ../ext/SDBM_File/t/sdbm.t .......................................... ok
    ../ext/Sys-Hostname/t/Hostname.t ................................... ok
    ../ext/Tie-Hash-NamedCapture/t/tiehash.t ........................... ok
    ../ext/Tie-Memoize/t/Tie-Memoize.t ................................. ok
    ../ext/Win32CORE/t/win32core.t ..................................... ok
    ../ext/XS-APItest/t/addissub.t ..................................... ok
    ../ext/XS-APItest/t/arrayexpr.t .................................... ok
    ../ext/XS-APItest/t/autoload.t ..................................... ok
    ../ext/XS-APItest/t/blockasexpr.t .................................. ok
    ../ext/XS-APItest/t/blockhooks-csc.t ............................... ok
    ../ext/XS-APItest/t/blockhooks.t ................................... ok
    ../ext/XS-APItest/t/call.t ......................................... ok
    ../ext/XS-APItest/t/call_checker.t ................................. ok
    ../ext/XS-APItest/t/caller.t ....................................... ok
    ../ext/XS-APItest/t/callregexec.t .................................. ok
    ../ext/XS-APItest/t/check_warnings.t ............................... ok
    ../ext/XS-APItest/t/cleanup.t ...................................... ok
    ../ext/XS-APItest/t/clone-with-stack.t ............................. ok
    ../ext/XS-APItest/t/cophh.t ........................................ ok
    ../ext/XS-APItest/t/coplabel.t ..................................... ok
    ../ext/XS-APItest/t/copstash.t ..................................... ok
    ../ext/XS-APItest/t/copyhints.t .................................... ok
    ../ext/XS-APItest/t/customop.t ..................................... ok
    ../ext/XS-APItest/t/cv_name.t ...................................... ok
    ../ext/XS-APItest/t/eval-filter.t .................................. ok
    ../ext/XS-APItest/t/exception.t .................................... ok
    ../ext/XS-APItest/t/extend.t ....................................... ok
    ../ext/XS-APItest/t/fetch_pad_names.t .............................. ok
    ../ext/XS-APItest/t/gotosub.t ...................................... ok
    ../ext/XS-APItest/t/grok.t ......................................... ok
    ../ext/XS-APItest/t/gv_autoload4.t ................................. ok
    ../ext/XS-APItest/t/gv_const_sv.t .................................. ok
    ../ext/XS-APItest/t/gv_fetchmeth.t ................................. ok
    ../ext/XS-APItest/t/gv_fetchmeth_autoload.t ........................ ok
    ../ext/XS-APItest/t/gv_fetchmethod_flags.t ......................... ok
    ../ext/XS-APItest/t/gv_init.t ...................................... ok
    ../ext/XS-APItest/t/handy.t ........................................ ok
    ../ext/XS-APItest/t/hash.t ......................................... ok
    ../ext/XS-APItest/t/join_with_space.t .............................. ok
    ../ext/XS-APItest/t/keyword_multiline.t ............................ ok
    ../ext/XS-APItest/t/keyword_plugin.t ............................... ok
    ../ext/XS-APItest/t/labelconst.t ................................... ok
    ../ext/XS-APItest/t/lexsub.t ....................................... ok
    ../ext/XS-APItest/t/load-module.t .................................. ok
    ../ext/XS-APItest/t/locale.t ....................................... ok
    ../ext/XS-APItest/t/loopblock.t .................................... ok
    ../ext/XS-APItest/t/looprest.t ..................................... ok
    ../ext/XS-APItest/t/lvalue.t ....................................... ok
    ../ext/XS-APItest/t/magic.t ........................................ ok
    ../ext/XS-APItest/t/magic_chain.t .................................. ok
    ../ext/XS-APItest/t/mro.t .......................................... ok
    ../ext/XS-APItest/t/multicall.t .................................... ok
    ../ext/XS-APItest/t/my_cxt.t ....................................... ok
    ../ext/XS-APItest/t/my_exit.t ...................................... ok
    ../ext/XS-APItest/t/newCONSTSUB.t .................................. ok
    ../ext/XS-APItest/t/newDEFSVOP.t ................................... ok
    ../ext/XS-APItest/t/op.t ........................................... ok
    ../ext/XS-APItest/t/op_contextualize.t ............................. ok
    ../ext/XS-APItest/t/op_list.t ...................................... ok
    ../ext/XS-APItest/t/overload.t ..................................... ok
    ../ext/XS-APItest/t/pad_scalar.t ................................... ok
    ../ext/XS-APItest/t/peep.t ......................................... ok
    ../ext/XS-APItest/t/pmflag.t ....................................... ok
    ../ext/XS-APItest/t/postinc.t ...................................... ok
    ../ext/XS-APItest/t/printf.t ....................................... ok
    ../ext/XS-APItest/t/ptr_table.t .................................... ok
    ../ext/XS-APItest/t/push.t ......................................... ok
    ../ext/XS-APItest/t/refs.t ......................................... ok
    ../ext/XS-APItest/t/rmagical.t ..................................... ok
    ../ext/XS-APItest/t/rv2cv_op_cv.t .................................. ok
    ../ext/XS-APItest/t/savehints.t .................................... ok
    ../ext/XS-APItest/t/scopelessblock.t ............................... ok
    ../ext/XS-APItest/t/sort.t ......................................... ok
    ../ext/XS-APItest/t/stmtasexpr.t ................................... ok
    ../ext/XS-APItest/t/stmtsasexpr.t .................................. ok
    ../ext/XS-APItest/t/stuff_modify_bug.t ............................. ok
    ../ext/XS-APItest/t/stuff_svcur_bug.t .............................. ok
    ../ext/XS-APItest/t/subcall.t ...................................... ok
    ../ext/XS-APItest/t/svcat.t ........................................ ok
    ../ext/XS-APItest/t/svcatpvf.t ..................................... ok
    ../ext/XS-APItest/t/sviscow.t ...................................... ok
    ../ext/XS-APItest/t/svpeek.t ....................................... ok
    ../ext/XS-APItest/t/svpv.t ......................................... ok
    ../ext/XS-APItest/t/svpv_magic.t ................................... ok
    ../ext/XS-APItest/t/svsetsv.t ...................................... ok
    ../ext/XS-APItest/t/swaplabel.t .................................... ok
    ../ext/XS-APItest/t/swaptwostmts.t ................................. ok
    ../ext/XS-APItest/t/sym-hook.t ..................................... ok
    ../ext/XS-APItest/t/synthetic_scope.t .............................. ok
    ../ext/XS-APItest/t/temp_lv_sub.t .................................. ok
    ../ext/XS-APItest/t/underscore_length.t ............................ ok
    ../ext/XS-APItest/t/utf16_to_utf8.t ................................ ok
    ../ext/XS-APItest/t/utf8.t ......................................... ok
    ../ext/XS-APItest/t/weaken.t ....................................... ok
    ../ext/XS-APItest/t/whichsig.t ..................................... ok
    ../ext/XS-APItest/t/win32.t ........................................ ok
    ../ext/XS-APItest/t/xs_special_subs.t .............................. ok
    ../ext/XS-APItest/t/xs_special_subs_require.t ...................... ok
    ../ext/XS-APItest/t/xsub_h.t ....................................... ok
    ../ext/XS-Typemap/t/Typemap.t ...................................... ok
    ../ext/arybase/t/aeach.t ........................................... ok
    ../ext/arybase/t/aelem.t ........................................... ok
    ../ext/arybase/t/akeys.t ........................................... ok
    ../ext/arybase/t/arybase.t ......................................... ok
    ../ext/arybase/t/aslice.t .......................................... ok
    ../ext/arybase/t/av2arylen.t ....................................... ok
    ../ext/arybase/t/index.t ........................................... ok
    ../ext/arybase/t/lslice.t .......................................... ok
    ../ext/arybase/t/pos.t ............................................. ok
    ../ext/arybase/t/scope.t ........................................... ok
    ../ext/arybase/t/splice.t .......................................... ok
    ../ext/arybase/t/substr.t .......................................... ok
    ../ext/re/t/lexical_debug.t ........................................ ok
    ../ext/re/t/qr.t ................................................... ok
    ../ext/re/t/re.t ................................................... ok
    ../ext/re/t/re_funcs.t ............................................. ok
    ../ext/re/t/re_funcs_u.t ........................................... ok
    ../ext/re/t/reflags.t .............................................. ok
    ../ext/re/t/regop.t ................................................ ok
    ../ext/re/t/strict.t ............................................... ok
    ../lib/AnyDBM_File.t ............................................... ok
    ../lib/B/Deparse-core.t ............................................ ok
    ../lib/B/Deparse-subclass.t ........................................ ok
    ../lib/B/Deparse.t ................................................. ok
    ../lib/Benchmark.t ................................................. ok
    ../lib/Class/Struct.t .............................................. ok
    ../lib/Config.t .................................................... ok
    ../lib/Config/Extensions.t ......................................... ok
    ../lib/DB.t ........................................................ ok
    ../lib/DBM_Filter/t/01error.t ...................................... ok
    ../lib/DBM_Filter/t/02core.t ....................................... ok
    ../lib/DBM_Filter/t/compress.t ..................................... ok
    ../lib/DBM_Filter/t/encode.t ....................................... ok
    ../lib/DBM_Filter/t/int32.t ........................................ ok
    ../lib/DBM_Filter/t/null.t ......................................... ok
    ../lib/DBM_Filter/t/utf8.t ......................................... ok
    ../lib/DirHandle.t ................................................. ok
    ../lib/English.t ................................................... ok
    ../lib/ExtUtils/t/Embed.t .......................................... ok
    ../lib/File/Basename.t ............................................. ok
    ../lib/File/Compare.t .............................................. ok
    ../lib/File/Copy.t ................................................. ok
    ../lib/File/stat-7896.t ............................................ ok
    ../lib/File/stat.t ................................................. ok
    ../lib/FileHandle.t ................................................ ok
    ../lib/FindBin.t ................................................... ok
    ../lib/Getopt/Std.t ................................................ ok
    ../lib/Internals.t ................................................. ok
    ../lib/Net/hostent.t ............................................... ok
    ../lib/Net/netent.t ................................................ skipped: no getnetbyname
    ../lib/Net/protoent.t .............................................. skipped: no netdb.h
    ../lib/Net/servent.t ............................................... skipped: no netdb.h
    ../lib/Pod/t/InputObjects.t ........................................ ok
    ../lib/Pod/t/Select.t .............................................. ok
    ../lib/Pod/t/Usage.t ............................................... ok
    ../lib/Pod/t/utils.t ............................................... ok
    ../lib/SelectSaver.t ............................................... ok
    ../lib/Symbol.t .................................................... ok
    ../lib/Thread.t .................................................... ok
    ../lib/Tie/ExtraHash.t ............................................. ok
    ../lib/Tie/Hash.t .................................................. ok
    ../lib/Tie/Scalar.t ................................................ ok
    ../lib/Tie/SubstrHash.t ............................................ ok
    ../lib/Tie/Array/push.t ............................................ ok
    ../lib/Tie/Array/splice.t .......................................... ok
    ../lib/Tie/Array/std.t ............................................. ok
    ../lib/Tie/Array/stdpush.t ......................................... ok
    ../lib/Tie/Handle/stdhandle.t ...................................... ok
    ../lib/Tie/Handle/stdhandle_from_handle.t .......................... ok
    ../lib/Time/gmtime.t ............................................... ok
    ../lib/Time/localtime.t ............................................ ok
    ../lib/Unicode/UCD.t ............................................... ok
    ../lib/User/grent.t ................................................ skipped: no getgrgid
    ../lib/User/pwent.t ................................................ skipped: no getpwuid
    ../lib/blib.t ...................................................... ok
    ../lib/bytes.t ..................................................... ok
    ../lib/charnames.t ................................................. ok
    ../lib/diagnostics.t ............................................... ok
    ../lib/dumpvar.t ................................................... ok
    ../lib/feature.t ................................................... ok
    ../lib/feature/unicode_strings.t ................................... ok
    ../lib/filetest.t .................................................. ok
    ../lib/h2ph.t ...................................................... ok
    ../lib/h2xs.t ...................................................... ok
    ../lib/integer.t ................................................... ok
    ../lib/less.t ...................................................... ok
    ../lib/locale.t .................................................... ok
    ../lib/meta_notation.t ............................................. ok
    ../lib/open.t ...................................................... ok
    ../lib/overload.t .................................................. ok
    ../lib/overload64.t ................................................ skipped: -- Perl configured with 32-bit ints
    ../lib/overloading.t ............................................... ok
    ../lib/perl5db.t ................................................... skipped: no /dev/null
    ../lib/perlbug.t ................................................... ok
    ../lib/sigtrap.t ................................................... ok
    ../lib/sort.t ...................................................... ok
    ../lib/strict.t .................................................... ok
    ../lib/subs.t ...................................................... ok
    ../lib/utf8.t ...................................................... ok
    ../lib/vars.t ...................................................... ok
    ../lib/vars_carp.t ................................................. ok
    ../lib/vmsish.t .................................................... ok
    ../lib/warnings.t .................................................. ok

    Test Summary Report
    -------------------
    ../cpan/Archive-Tar/t/09_roundtrip.t (Wstat: 0 Tests: 7 Failed: 0)
       TODO passed: 1, 4, 6
    ../cpan/ExtUtils-MakeMaker/t/basic.t (Wstat: 3840 Tests: 186 Failed: 15)
       Failed tests: 22-23, 34-36, 69, 178-186
       Non-zero exit status: 15
    ../cpan/IPC-Cmd/t/01_IPC-Cmd.t (Wstat: 2560 Tests: 459 Failed: 10)
       Failed tests: 65, 71-72, 76, 82-83, 85-86, 96-97
       Non-zero exit status: 10
    ../ext/IPC-Open3/t/IPC-Open3.t (Wstat: 0 Tests: 45 Failed: 0)
       TODO passed: 25
    Files=2469, Tests=826675, 1956 wallclock secs (97.75 usr + 7.80 sys = 105.55 CPU)
    Result: FAIL
    NMAKE : fatal error U1077: '.\perl.exe' : return code '0x19'
    Stop.

    <http://perl5.git.perl.org:8080/job/perl5-win32/ws/win32>exit> 2
    Build step 'Execute Windows batch command' marked build as failure
  • Dennis+p5p-jenkins at May 30, 2016 at 5:53 pm
    See <http://perl5.git.perl.org:8080/job/perl5-win32/2447/changes>

    Changes:

    [khw] Unicode/UCD.t: better handling of errors

    ------------------------------------------
    [...truncated 6788 lines...]
    ../ext/PerlIO-encoding/t/nolooping.t ............................... ok
    ../ext/PerlIO-encoding/t/threads.t ................................. ok
    ../ext/PerlIO-scalar/t/scalar.t .................................... ok
    ../ext/PerlIO-scalar/t/scalar_ungetc.t ............................. ok
    ../ext/PerlIO-via/t/via.t .......................................... ok
    ../ext/Pod-Functions/t/Functions.t ................................. ok
    ../ext/Pod-Html/t/anchorify.t ...................................... ok
    ../ext/Pod-Html/t/cache.t .......................................... ok
    ../ext/Pod-Html/t/crossref.t ....................................... ok
    ../ext/Pod-Html/t/crossref2.t ...................................... ok
    ../ext/Pod-Html/t/crossref3.t ...................................... ok
    ../ext/Pod-Html/t/eol.t ............................................ ok
    ../ext/Pod-Html/t/feature.t ........................................ ok
    ../ext/Pod-Html/t/feature2.t ....................................... ok
    ../ext/Pod-Html/t/htmldir1.t ....................................... ok
    ../ext/Pod-Html/t/htmldir2.t ....................................... ok
    ../ext/Pod-Html/t/htmldir3.t ....................................... ok
    ../ext/Pod-Html/t/htmldir4.t ....................................... ok
    ../ext/Pod-Html/t/htmldir5.t ....................................... ok
    ../ext/Pod-Html/t/htmlescp.t ....................................... ok
    ../ext/Pod-Html/t/htmllink.t ....................................... ok
    ../ext/Pod-Html/t/htmlview.t ....................................... ok
    ../ext/Pod-Html/t/poderr.t ......................................... ok
    ../ext/Pod-Html/t/podnoerr.t ....................................... ok
    ../ext/SDBM_File/t/constants.t ..................................... ok
    ../ext/SDBM_File/t/prep.t .......................................... ok
    ../ext/SDBM_File/t/sdbm.t .......................................... ok
    ../ext/Sys-Hostname/t/Hostname.t ................................... ok
    ../ext/Tie-Hash-NamedCapture/t/tiehash.t ........................... ok
    ../ext/Tie-Memoize/t/Tie-Memoize.t ................................. ok
    ../ext/Win32CORE/t/win32core.t ..................................... ok
    ../ext/XS-APItest/t/addissub.t ..................................... ok
    ../ext/XS-APItest/t/arrayexpr.t .................................... ok
    ../ext/XS-APItest/t/autoload.t ..................................... ok
    ../ext/XS-APItest/t/blockasexpr.t .................................. ok
    ../ext/XS-APItest/t/blockhooks-csc.t ............................... ok
    ../ext/XS-APItest/t/blockhooks.t ................................... ok
    ../ext/XS-APItest/t/call.t ......................................... ok
    ../ext/XS-APItest/t/call_checker.t ................................. ok
    ../ext/XS-APItest/t/caller.t ....................................... ok
    ../ext/XS-APItest/t/callregexec.t .................................. ok
    ../ext/XS-APItest/t/check_warnings.t ............................... ok
    ../ext/XS-APItest/t/cleanup.t ...................................... ok
    ../ext/XS-APItest/t/clone-with-stack.t ............................. ok
    ../ext/XS-APItest/t/cophh.t ........................................ ok
    ../ext/XS-APItest/t/coplabel.t ..................................... ok
    ../ext/XS-APItest/t/copstash.t ..................................... ok
    ../ext/XS-APItest/t/copyhints.t .................................... ok
    ../ext/XS-APItest/t/customop.t ..................................... ok
    ../ext/XS-APItest/t/cv_name.t ...................................... ok
    ../ext/XS-APItest/t/eval-filter.t .................................. ok
    ../ext/XS-APItest/t/exception.t .................................... ok
    ../ext/XS-APItest/t/extend.t ....................................... ok
    ../ext/XS-APItest/t/fetch_pad_names.t .............................. ok
    ../ext/XS-APItest/t/gotosub.t ...................................... ok
    ../ext/XS-APItest/t/grok.t ......................................... ok
    ../ext/XS-APItest/t/gv_autoload4.t ................................. ok
    ../ext/XS-APItest/t/gv_const_sv.t .................................. ok
    ../ext/XS-APItest/t/gv_fetchmeth.t ................................. ok
    ../ext/XS-APItest/t/gv_fetchmeth_autoload.t ........................ ok
    ../ext/XS-APItest/t/gv_fetchmethod_flags.t ......................... ok
    ../ext/XS-APItest/t/gv_init.t ...................................... ok
    ../ext/XS-APItest/t/handy.t ........................................ ok
    ../ext/XS-APItest/t/hash.t ......................................... ok
    ../ext/XS-APItest/t/join_with_space.t .............................. ok
    ../ext/XS-APItest/t/keyword_multiline.t ............................ ok
    ../ext/XS-APItest/t/keyword_plugin.t ............................... ok
    ../ext/XS-APItest/t/labelconst.t ................................... ok
    ../ext/XS-APItest/t/lexsub.t ....................................... ok
    ../ext/XS-APItest/t/load-module.t .................................. ok
    ../ext/XS-APItest/t/locale.t ....................................... ok
    ../ext/XS-APItest/t/loopblock.t .................................... ok
    ../ext/XS-APItest/t/looprest.t ..................................... ok
    ../ext/XS-APItest/t/lvalue.t ....................................... ok
    ../ext/XS-APItest/t/magic.t ........................................ ok
    ../ext/XS-APItest/t/magic_chain.t .................................. ok
    ../ext/XS-APItest/t/mro.t .......................................... ok
    ../ext/XS-APItest/t/multicall.t .................................... ok
    ../ext/XS-APItest/t/my_cxt.t ....................................... ok
    ../ext/XS-APItest/t/my_exit.t ...................................... ok
    ../ext/XS-APItest/t/newCONSTSUB.t .................................. ok
    ../ext/XS-APItest/t/newDEFSVOP.t ................................... ok
    ../ext/XS-APItest/t/op.t ........................................... ok
    ../ext/XS-APItest/t/op_contextualize.t ............................. ok
    ../ext/XS-APItest/t/op_list.t ...................................... ok
    ../ext/XS-APItest/t/overload.t ..................................... ok
    ../ext/XS-APItest/t/pad_scalar.t ................................... ok
    ../ext/XS-APItest/t/peep.t ......................................... ok
    ../ext/XS-APItest/t/pmflag.t ....................................... ok
    ../ext/XS-APItest/t/postinc.t ...................................... ok
    ../ext/XS-APItest/t/printf.t ....................................... ok
    ../ext/XS-APItest/t/ptr_table.t .................................... ok
    ../ext/XS-APItest/t/push.t ......................................... ok
    ../ext/XS-APItest/t/refs.t ......................................... ok
    ../ext/XS-APItest/t/rmagical.t ..................................... ok
    ../ext/XS-APItest/t/rv2cv_op_cv.t .................................. ok
    ../ext/XS-APItest/t/savehints.t .................................... ok
    ../ext/XS-APItest/t/scopelessblock.t ............................... ok
    ../ext/XS-APItest/t/sort.t ......................................... ok
    ../ext/XS-APItest/t/stmtasexpr.t ................................... ok
    ../ext/XS-APItest/t/stmtsasexpr.t .................................. ok
    ../ext/XS-APItest/t/stuff_modify_bug.t ............................. ok
    ../ext/XS-APItest/t/stuff_svcur_bug.t .............................. ok
    ../ext/XS-APItest/t/subcall.t ...................................... ok
    ../ext/XS-APItest/t/svcat.t ........................................ ok
    ../ext/XS-APItest/t/svcatpvf.t ..................................... ok
    ../ext/XS-APItest/t/sviscow.t ...................................... ok
    ../ext/XS-APItest/t/svpeek.t ....................................... ok
    ../ext/XS-APItest/t/svpv.t ......................................... ok
    ../ext/XS-APItest/t/svpv_magic.t ................................... ok
    ../ext/XS-APItest/t/svsetsv.t ...................................... ok
    ../ext/XS-APItest/t/swaplabel.t .................................... ok
    ../ext/XS-APItest/t/swaptwostmts.t ................................. ok
    ../ext/XS-APItest/t/sym-hook.t ..................................... ok
    ../ext/XS-APItest/t/synthetic_scope.t .............................. ok
    ../ext/XS-APItest/t/temp_lv_sub.t .................................. ok
    ../ext/XS-APItest/t/underscore_length.t ............................ ok
    ../ext/XS-APItest/t/utf16_to_utf8.t ................................ ok
    ../ext/XS-APItest/t/utf8.t ......................................... ok
    ../ext/XS-APItest/t/weaken.t ....................................... ok
    ../ext/XS-APItest/t/whichsig.t ..................................... ok
    ../ext/XS-APItest/t/win32.t ........................................ ok
    ../ext/XS-APItest/t/xs_special_subs.t .............................. ok
    ../ext/XS-APItest/t/xs_special_subs_require.t ...................... ok
    ../ext/XS-APItest/t/xsub_h.t ....................................... ok
    ../ext/XS-Typemap/t/Typemap.t ...................................... ok
    ../ext/arybase/t/aeach.t ........................................... ok
    ../ext/arybase/t/aelem.t ........................................... ok
    ../ext/arybase/t/akeys.t ........................................... ok
    ../ext/arybase/t/arybase.t ......................................... ok
    ../ext/arybase/t/aslice.t .......................................... ok
    ../ext/arybase/t/av2arylen.t ....................................... ok
    ../ext/arybase/t/index.t ........................................... ok
    ../ext/arybase/t/lslice.t .......................................... ok
    ../ext/arybase/t/pos.t ............................................. ok
    ../ext/arybase/t/scope.t ........................................... ok
    ../ext/arybase/t/splice.t .......................................... ok
    ../ext/arybase/t/substr.t .......................................... ok
    ../ext/re/t/lexical_debug.t ........................................ ok
    ../ext/re/t/qr.t ................................................... ok
    ../ext/re/t/re.t ................................................... ok
    ../ext/re/t/re_funcs.t ............................................. ok
    ../ext/re/t/re_funcs_u.t ........................................... ok
    ../ext/re/t/reflags.t .............................................. ok
    ../ext/re/t/regop.t ................................................ ok
    ../ext/re/t/strict.t ............................................... ok
    ../lib/AnyDBM_File.t ............................................... ok
    ../lib/B/Deparse-core.t ............................................ ok
    ../lib/B/Deparse-subclass.t ........................................ ok
    ../lib/B/Deparse.t ................................................. ok
    ../lib/Benchmark.t ................................................. ok
    ../lib/Class/Struct.t .............................................. ok
    ../lib/Config.t .................................................... ok
    ../lib/Config/Extensions.t ......................................... ok
    ../lib/DB.t ........................................................ ok
    ../lib/DBM_Filter/t/01error.t ...................................... ok
    ../lib/DBM_Filter/t/02core.t ....................................... ok
    ../lib/DBM_Filter/t/compress.t ..................................... ok
    ../lib/DBM_Filter/t/encode.t ....................................... ok
    ../lib/DBM_Filter/t/int32.t ........................................ ok
    ../lib/DBM_Filter/t/null.t ......................................... ok
    ../lib/DBM_Filter/t/utf8.t ......................................... ok
    ../lib/DirHandle.t ................................................. ok
    ../lib/English.t ................................................... ok
    ../lib/ExtUtils/t/Embed.t .......................................... ok
    ../lib/File/Basename.t ............................................. ok
    ../lib/File/Compare.t .............................................. ok
    ../lib/File/Copy.t ................................................. ok
    ../lib/File/stat-7896.t ............................................ ok
    ../lib/File/stat.t ................................................. ok
    ../lib/FileHandle.t ................................................ ok
    ../lib/FindBin.t ................................................... ok
    ../lib/Getopt/Std.t ................................................ ok
    ../lib/Internals.t ................................................. ok
    ../lib/Net/hostent.t ............................................... ok
    ../lib/Net/netent.t ................................................ skipped: no getnetbyname
    ../lib/Net/protoent.t .............................................. skipped: no netdb.h
    ../lib/Net/servent.t ............................................... skipped: no netdb.h
    ../lib/Pod/t/InputObjects.t ........................................ ok
    ../lib/Pod/t/Select.t .............................................. ok
    ../lib/Pod/t/Usage.t ............................................... ok
    ../lib/Pod/t/utils.t ............................................... ok
    ../lib/SelectSaver.t ............................................... ok
    ../lib/Symbol.t .................................................... ok
    ../lib/Thread.t .................................................... ok
    ../lib/Tie/ExtraHash.t ............................................. ok
    ../lib/Tie/Hash.t .................................................. ok
    ../lib/Tie/Scalar.t ................................................ ok
    ../lib/Tie/SubstrHash.t ............................................ ok
    ../lib/Tie/Array/push.t ............................................ ok
    ../lib/Tie/Array/splice.t .......................................... ok
    ../lib/Tie/Array/std.t ............................................. ok
    ../lib/Tie/Array/stdpush.t ......................................... ok
    ../lib/Tie/Handle/stdhandle.t ...................................... ok
    ../lib/Tie/Handle/stdhandle_from_handle.t .......................... ok
    ../lib/Time/gmtime.t ............................................... ok
    ../lib/Time/localtime.t ............................................ ok
    ../lib/Unicode/UCD.t ............................................... ok
    ../lib/User/grent.t ................................................ skipped: no getgrgid
    ../lib/User/pwent.t ................................................ skipped: no getpwuid
    ../lib/blib.t ...................................................... ok
    ../lib/bytes.t ..................................................... ok
    ../lib/charnames.t ................................................. ok
    ../lib/diagnostics.t ............................................... ok
    ../lib/dumpvar.t ................................................... ok
    ../lib/feature.t ................................................... ok
    ../lib/feature/unicode_strings.t ................................... ok
    ../lib/filetest.t .................................................. ok
    ../lib/h2ph.t ...................................................... ok
    ../lib/h2xs.t ...................................................... ok
    ../lib/integer.t ................................................... ok
    ../lib/less.t ...................................................... ok
    ../lib/locale.t .................................................... ok
    ../lib/meta_notation.t ............................................. ok
    ../lib/open.t ...................................................... ok
    ../lib/overload.t .................................................. ok
    ../lib/overload64.t ................................................ skipped: -- Perl configured with 32-bit ints
    ../lib/overloading.t ............................................... ok
    ../lib/perl5db.t ................................................... skipped: no /dev/null
    ../lib/perlbug.t ................................................... ok
    ../lib/sigtrap.t ................................................... ok
    ../lib/sort.t ...................................................... ok
    ../lib/strict.t .................................................... ok
    ../lib/subs.t ...................................................... ok
    ../lib/utf8.t ...................................................... ok
    ../lib/vars.t ...................................................... ok
    ../lib/vars_carp.t ................................................. ok
    ../lib/vmsish.t .................................................... ok
    ../lib/warnings.t .................................................. ok

    Test Summary Report
    -------------------
    ../cpan/Archive-Tar/t/09_roundtrip.t (Wstat: 0 Tests: 7 Failed: 0)
       TODO passed: 1, 4, 6
    ../cpan/ExtUtils-MakeMaker/t/basic.t (Wstat: 5888 Tests: 186 Failed: 23)
       Failed tests: 22-23, 34-36, 42-49, 69, 178-186
       Non-zero exit status: 23
    ../cpan/IPC-Cmd/t/01_IPC-Cmd.t (Wstat: 2560 Tests: 459 Failed: 10)
       Failed tests: 74-75, 85-87, 93-94, 98, 104-105
       Non-zero exit status: 10
    ../ext/IPC-Open3/t/IPC-Open3.t (Wstat: 0 Tests: 45 Failed: 0)
       TODO passed: 25
    Files=2469, Tests=826587, 1934 wallclock secs (99.73 usr + 8.06 sys = 107.80 CPU)
    Result: FAIL
    NMAKE : fatal error U1077: '.\perl.exe' : return code '0x21'
    Stop.

    <http://perl5.git.perl.org:8080/job/perl5-win32/ws/win32>exit> 2
    Build step 'Execute Windows batch command' marked build as failure
  • Dennis+p5p-jenkins at May 31, 2016 at 2:34 pm
    See <http://perl5.git.perl.org:8080/job/perl5-win32/2448/changes>

    Changes:

    [sprout] [perl #128294] bisect-runner.pl: --no-module-tests

    ------------------------------------------
    [...truncated 6732 lines...]
    ../ext/PerlIO-encoding/t/nolooping.t ............................... ok
    ../ext/PerlIO-encoding/t/threads.t ................................. ok
    ../ext/PerlIO-scalar/t/scalar.t .................................... ok
    ../ext/PerlIO-scalar/t/scalar_ungetc.t ............................. ok
    ../ext/PerlIO-via/t/via.t .......................................... ok
    ../ext/Pod-Functions/t/Functions.t ................................. ok
    ../ext/Pod-Html/t/anchorify.t ...................................... ok
    ../ext/Pod-Html/t/cache.t .......................................... ok
    ../ext/Pod-Html/t/crossref.t ....................................... ok
    ../ext/Pod-Html/t/crossref2.t ...................................... ok
    ../ext/Pod-Html/t/crossref3.t ...................................... ok
    ../ext/Pod-Html/t/eol.t ............................................ ok
    ../ext/Pod-Html/t/feature.t ........................................ ok
    ../ext/Pod-Html/t/feature2.t ....................................... ok
    ../ext/Pod-Html/t/htmldir1.t ....................................... ok
    ../ext/Pod-Html/t/htmldir2.t ....................................... ok
    ../ext/Pod-Html/t/htmldir3.t ....................................... ok
    ../ext/Pod-Html/t/htmldir4.t ....................................... ok
    ../ext/Pod-Html/t/htmldir5.t ....................................... ok
    ../ext/Pod-Html/t/htmlescp.t ....................................... ok
    ../ext/Pod-Html/t/htmllink.t ....................................... ok
    ../ext/Pod-Html/t/htmlview.t ....................................... ok
    ../ext/Pod-Html/t/poderr.t ......................................... ok
    ../ext/Pod-Html/t/podnoerr.t ....................................... ok
    ../ext/SDBM_File/t/constants.t ..................................... ok
    ../ext/SDBM_File/t/prep.t .......................................... ok
    ../ext/SDBM_File/t/sdbm.t .......................................... ok
    ../ext/Sys-Hostname/t/Hostname.t ................................... ok
    ../ext/Tie-Hash-NamedCapture/t/tiehash.t ........................... ok
    ../ext/Tie-Memoize/t/Tie-Memoize.t ................................. ok
    ../ext/Win32CORE/t/win32core.t ..................................... ok
    ../ext/XS-APItest/t/addissub.t ..................................... ok
    ../ext/XS-APItest/t/arrayexpr.t .................................... ok
    ../ext/XS-APItest/t/autoload.t ..................................... ok
    ../ext/XS-APItest/t/blockasexpr.t .................................. ok
    ../ext/XS-APItest/t/blockhooks-csc.t ............................... ok
    ../ext/XS-APItest/t/blockhooks.t ................................... ok
    ../ext/XS-APItest/t/call.t ......................................... ok
    ../ext/XS-APItest/t/call_checker.t ................................. ok
    ../ext/XS-APItest/t/caller.t ....................................... ok
    ../ext/XS-APItest/t/callregexec.t .................................. ok
    ../ext/XS-APItest/t/check_warnings.t ............................... ok
    ../ext/XS-APItest/t/cleanup.t ...................................... ok
    ../ext/XS-APItest/t/clone-with-stack.t ............................. ok
    ../ext/XS-APItest/t/cophh.t ........................................ ok
    ../ext/XS-APItest/t/coplabel.t ..................................... ok
    ../ext/XS-APItest/t/copstash.t ..................................... ok
    ../ext/XS-APItest/t/copyhints.t .................................... ok
    ../ext/XS-APItest/t/customop.t ..................................... ok
    ../ext/XS-APItest/t/cv_name.t ...................................... ok
    ../ext/XS-APItest/t/eval-filter.t .................................. ok
    ../ext/XS-APItest/t/exception.t .................................... ok
    ../ext/XS-APItest/t/extend.t ....................................... ok
    ../ext/XS-APItest/t/fetch_pad_names.t .............................. ok
    ../ext/XS-APItest/t/gotosub.t ...................................... ok
    ../ext/XS-APItest/t/grok.t ......................................... ok
    ../ext/XS-APItest/t/gv_autoload4.t ................................. ok
    ../ext/XS-APItest/t/gv_const_sv.t .................................. ok
    ../ext/XS-APItest/t/gv_fetchmeth.t ................................. ok
    ../ext/XS-APItest/t/gv_fetchmeth_autoload.t ........................ ok
    ../ext/XS-APItest/t/gv_fetchmethod_flags.t ......................... ok
    ../ext/XS-APItest/t/gv_init.t ...................................... ok
    ../ext/XS-APItest/t/handy.t ........................................ ok
    ../ext/XS-APItest/t/hash.t ......................................... ok
    ../ext/XS-APItest/t/join_with_space.t .............................. ok
    ../ext/XS-APItest/t/keyword_multiline.t ............................ ok
    ../ext/XS-APItest/t/keyword_plugin.t ............................... ok
    ../ext/XS-APItest/t/labelconst.t ................................... ok
    ../ext/XS-APItest/t/lexsub.t ....................................... ok
    ../ext/XS-APItest/t/load-module.t .................................. ok
    ../ext/XS-APItest/t/locale.t ....................................... ok
    ../ext/XS-APItest/t/loopblock.t .................................... ok
    ../ext/XS-APItest/t/looprest.t ..................................... ok
    ../ext/XS-APItest/t/lvalue.t ....................................... ok
    ../ext/XS-APItest/t/magic.t ........................................ ok
    ../ext/XS-APItest/t/magic_chain.t .................................. ok
    ../ext/XS-APItest/t/mro.t .......................................... ok
    ../ext/XS-APItest/t/multicall.t .................................... ok
    ../ext/XS-APItest/t/my_cxt.t ....................................... ok
    ../ext/XS-APItest/t/my_exit.t ...................................... ok
    ../ext/XS-APItest/t/newCONSTSUB.t .................................. ok
    ../ext/XS-APItest/t/newDEFSVOP.t ................................... ok
    ../ext/XS-APItest/t/op.t ........................................... ok
    ../ext/XS-APItest/t/op_contextualize.t ............................. ok
    ../ext/XS-APItest/t/op_list.t ...................................... ok
    ../ext/XS-APItest/t/overload.t ..................................... ok
    ../ext/XS-APItest/t/pad_scalar.t ................................... ok
    ../ext/XS-APItest/t/peep.t ......................................... ok
    ../ext/XS-APItest/t/pmflag.t ....................................... ok
    ../ext/XS-APItest/t/postinc.t ...................................... ok
    ../ext/XS-APItest/t/printf.t ....................................... ok
    ../ext/XS-APItest/t/ptr_table.t .................................... ok
    ../ext/XS-APItest/t/push.t ......................................... ok
    ../ext/XS-APItest/t/refs.t ......................................... ok
    ../ext/XS-APItest/t/rmagical.t ..................................... ok
    ../ext/XS-APItest/t/rv2cv_op_cv.t .................................. ok
    ../ext/XS-APItest/t/savehints.t .................................... ok
    ../ext/XS-APItest/t/scopelessblock.t ............................... ok
    ../ext/XS-APItest/t/sort.t ......................................... ok
    ../ext/XS-APItest/t/stmtasexpr.t ................................... ok
    ../ext/XS-APItest/t/stmtsasexpr.t .................................. ok
    ../ext/XS-APItest/t/stuff_modify_bug.t ............................. ok
    ../ext/XS-APItest/t/stuff_svcur_bug.t .............................. ok
    ../ext/XS-APItest/t/subcall.t ...................................... ok
    ../ext/XS-APItest/t/svcat.t ........................................ ok
    ../ext/XS-APItest/t/svcatpvf.t ..................................... ok
    ../ext/XS-APItest/t/sviscow.t ...................................... ok
    ../ext/XS-APItest/t/svpeek.t ....................................... ok
    ../ext/XS-APItest/t/svpv.t ......................................... ok
    ../ext/XS-APItest/t/svpv_magic.t ................................... ok
    ../ext/XS-APItest/t/svsetsv.t ...................................... ok
    ../ext/XS-APItest/t/swaplabel.t .................................... ok
    ../ext/XS-APItest/t/swaptwostmts.t ................................. ok
    ../ext/XS-APItest/t/sym-hook.t ..................................... ok
    ../ext/XS-APItest/t/synthetic_scope.t .............................. ok
    ../ext/XS-APItest/t/temp_lv_sub.t .................................. ok
    ../ext/XS-APItest/t/underscore_length.t ............................ ok
    ../ext/XS-APItest/t/utf16_to_utf8.t ................................ ok
    ../ext/XS-APItest/t/utf8.t ......................................... ok
    ../ext/XS-APItest/t/weaken.t ....................................... ok
    ../ext/XS-APItest/t/whichsig.t ..................................... ok
    ../ext/XS-APItest/t/win32.t ........................................ ok
    ../ext/XS-APItest/t/xs_special_subs.t .............................. ok
    ../ext/XS-APItest/t/xs_special_subs_require.t ...................... ok
    ../ext/XS-APItest/t/xsub_h.t ....................................... ok
    ../ext/XS-Typemap/t/Typemap.t ...................................... ok
    ../ext/arybase/t/aeach.t ........................................... ok
    ../ext/arybase/t/aelem.t ........................................... ok
    ../ext/arybase/t/akeys.t ........................................... ok
    ../ext/arybase/t/arybase.t ......................................... ok
    ../ext/arybase/t/aslice.t .......................................... ok
    ../ext/arybase/t/av2arylen.t ....................................... ok
    ../ext/arybase/t/index.t ........................................... ok
    ../ext/arybase/t/lslice.t .......................................... ok
    ../ext/arybase/t/pos.t ............................................. ok
    ../ext/arybase/t/scope.t ........................................... ok
    ../ext/arybase/t/splice.t .......................................... ok
    ../ext/arybase/t/substr.t .......................................... ok
    ../ext/re/t/lexical_debug.t ........................................ ok
    ../ext/re/t/qr.t ................................................... ok
    ../ext/re/t/re.t ................................................... ok
    ../ext/re/t/re_funcs.t ............................................. ok
    ../ext/re/t/re_funcs_u.t ........................................... ok
    ../ext/re/t/reflags.t .............................................. ok
    ../ext/re/t/regop.t ................................................ ok
    ../ext/re/t/strict.t ............................................... ok
    ../lib/AnyDBM_File.t ............................................... ok
    ../lib/B/Deparse-core.t ............................................ ok
    ../lib/B/Deparse-subclass.t ........................................ ok
    ../lib/B/Deparse.t ................................................. ok
    ../lib/Benchmark.t ................................................. ok
    ../lib/Class/Struct.t .............................................. ok
    ../lib/Config.t .................................................... ok
    ../lib/Config/Extensions.t ......................................... ok
    ../lib/DB.t ........................................................ ok
    ../lib/DBM_Filter/t/01error.t ...................................... ok
    ../lib/DBM_Filter/t/02core.t ....................................... ok
    ../lib/DBM_Filter/t/compress.t ..................................... ok
    ../lib/DBM_Filter/t/encode.t ....................................... ok
    ../lib/DBM_Filter/t/int32.t ........................................ ok
    ../lib/DBM_Filter/t/null.t ......................................... ok
    ../lib/DBM_Filter/t/utf8.t ......................................... ok
    ../lib/DirHandle.t ................................................. ok
    ../lib/English.t ................................................... ok
    ../lib/ExtUtils/t/Embed.t .......................................... ok
    ../lib/File/Basename.t ............................................. ok
    ../lib/File/Compare.t .............................................. ok
    ../lib/File/Copy.t ................................................. ok
    ../lib/File/stat-7896.t ............................................ ok
    ../lib/File/stat.t ................................................. ok
    ../lib/FileHandle.t ................................................ ok
    ../lib/FindBin.t ................................................... ok
    ../lib/Getopt/Std.t ................................................ ok
    ../lib/Internals.t ................................................. ok
    ../lib/Net/hostent.t ............................................... ok
    ../lib/Net/netent.t ................................................ skipped: no getnetbyname
    ../lib/Net/protoent.t .............................................. skipped: no netdb.h
    ../lib/Net/servent.t ............................................... skipped: no netdb.h
    ../lib/Pod/t/InputObjects.t ........................................ ok
    ../lib/Pod/t/Select.t .............................................. ok
    ../lib/Pod/t/Usage.t ............................................... ok
    ../lib/Pod/t/utils.t ............................................... ok
    ../lib/SelectSaver.t ............................................... ok
    ../lib/Symbol.t .................................................... ok
    ../lib/Thread.t .................................................... ok
    ../lib/Tie/ExtraHash.t ............................................. ok
    ../lib/Tie/Hash.t .................................................. ok
    ../lib/Tie/Scalar.t ................................................ ok
    ../lib/Tie/SubstrHash.t ............................................ ok
    ../lib/Tie/Array/push.t ............................................ ok
    ../lib/Tie/Array/splice.t .......................................... ok
    ../lib/Tie/Array/std.t ............................................. ok
    ../lib/Tie/Array/stdpush.t ......................................... ok
    ../lib/Tie/Handle/stdhandle.t ...................................... ok
    ../lib/Tie/Handle/stdhandle_from_handle.t .......................... ok
    ../lib/Time/gmtime.t ............................................... ok
    ../lib/Time/localtime.t ............................................ ok
    ../lib/Unicode/UCD.t ............................................... ok
    ../lib/User/grent.t ................................................ skipped: no getgrgid
    ../lib/User/pwent.t ................................................ skipped: no getpwuid
    ../lib/blib.t ...................................................... ok
    ../lib/bytes.t ..................................................... ok
    ../lib/charnames.t ................................................. ok
    ../lib/diagnostics.t ............................................... ok
    ../lib/dumpvar.t ................................................... ok
    ../lib/feature.t ................................................... ok
    ../lib/feature/unicode_strings.t ................................... ok
    ../lib/filetest.t .................................................. ok
    ../lib/h2ph.t ...................................................... ok
    ../lib/h2xs.t ...................................................... ok
    ../lib/integer.t ................................................... ok
    ../lib/less.t ...................................................... ok
    ../lib/locale.t .................................................... ok
    ../lib/meta_notation.t ............................................. ok
    ../lib/open.t ...................................................... ok
    ../lib/overload.t .................................................. ok
    ../lib/overload64.t ................................................ skipped: -- Perl configured with 32-bit ints
    ../lib/overloading.t ............................................... ok
    ../lib/perl5db.t ................................................... skipped: no /dev/null
    ../lib/perlbug.t ................................................... ok
    ../lib/sigtrap.t ................................................... ok
    ../lib/sort.t ...................................................... ok
    ../lib/strict.t .................................................... ok
    ../lib/subs.t ...................................................... ok
    ../lib/utf8.t ...................................................... ok
    ../lib/vars.t ...................................................... ok
    ../lib/vars_carp.t ................................................. ok
    ../lib/vmsish.t .................................................... ok
    ../lib/warnings.t .................................................. ok

    Test Summary Report
    -------------------
    ../cpan/Archive-Tar/t/09_roundtrip.t (Wstat: 0 Tests: 7 Failed: 0)
       TODO passed: 1, 4, 6
    ../cpan/ExtUtils-MakeMaker/t/basic.t (Wstat: 3840 Tests: 186 Failed: 15)
       Failed tests: 22-23, 34-36, 69, 178-186
       Non-zero exit status: 15
    ../cpan/IPC-Cmd/t/01_IPC-Cmd.t (Wstat: 2304 Tests: 459 Failed: 9)
       Failed tests: 162-163, 217-218, 228-230, 236-237
       Non-zero exit status: 9
    ../ext/IPC-Open3/t/IPC-Open3.t (Wstat: 0 Tests: 45 Failed: 0)
       TODO passed: 25
    Files=2469, Tests=826621, 1924 wallclock secs (100.39 usr + 6.44 sys = 106.83 CPU)
    Result: FAIL
    NMAKE : fatal error U1077: '.\perl.exe' : return code '0x18'
    Stop.

    <http://perl5.git.perl.org:8080/job/perl5-win32/ws/win32>exit> 2
    Build step 'Execute Windows batch command' marked build as failure

Related Discussions

Discussion Navigation
viewthread | post
Discussion Overview
groupperl5-porters @
categoriesperl
postedMay 30, '16 at 4:31p
activeMay 31, '16 at 2:34p
posts4
users1
websiteperl.org

1 user in discussion

Dennis+p5p-jenkins: 4 posts

People

Translate

site design / logo © 2018 Grokbase