FAQ
See <http://perl5.git.perl.org:8080/job/perl5-win32/2440/>

------------------------------------------
[...truncated 6753 lines...]
../ext/PerlIO-encoding/t/threads.t ................................. ok
../ext/PerlIO-scalar/t/scalar.t .................................... ok
../ext/PerlIO-scalar/t/scalar_ungetc.t ............................. ok
../ext/PerlIO-via/t/via.t .......................................... ok
../ext/Pod-Functions/t/Functions.t ................................. ok
../ext/Pod-Html/t/anchorify.t ...................................... ok
../ext/Pod-Html/t/cache.t .......................................... ok
../ext/Pod-Html/t/crossref.t ....................................... ok
../ext/Pod-Html/t/crossref2.t ...................................... ok
../ext/Pod-Html/t/crossref3.t ...................................... ok
../ext/Pod-Html/t/eol.t ............................................ ok
../ext/Pod-Html/t/feature.t ........................................ ok
../ext/Pod-Html/t/feature2.t ....................................... ok
../ext/Pod-Html/t/htmldir1.t ....................................... ok
../ext/Pod-Html/t/htmldir2.t ....................................... ok
../ext/Pod-Html/t/htmldir3.t ....................................... ok
../ext/Pod-Html/t/htmldir4.t ....................................... ok
../ext/Pod-Html/t/htmldir5.t ....................................... ok
../ext/Pod-Html/t/htmlescp.t ....................................... ok
../ext/Pod-Html/t/htmllink.t ....................................... ok
../ext/Pod-Html/t/htmlview.t ....................................... ok
../ext/Pod-Html/t/poderr.t ......................................... ok
../ext/Pod-Html/t/podnoerr.t ....................................... ok
../ext/SDBM_File/t/constants.t ..................................... ok
../ext/SDBM_File/t/prep.t .......................................... ok
../ext/SDBM_File/t/sdbm.t .......................................... ok
../ext/Sys-Hostname/t/Hostname.t ................................... ok
../ext/Tie-Hash-NamedCapture/t/tiehash.t ........................... ok
../ext/Tie-Memoize/t/Tie-Memoize.t ................................. ok
../ext/Win32CORE/t/win32core.t ..................................... ok
../ext/XS-APItest/t/addissub.t ..................................... ok
../ext/XS-APItest/t/arrayexpr.t .................................... ok
../ext/XS-APItest/t/autoload.t ..................................... ok
../ext/XS-APItest/t/blockasexpr.t .................................. ok
../ext/XS-APItest/t/blockhooks-csc.t ............................... ok
../ext/XS-APItest/t/blockhooks.t ................................... ok
../ext/XS-APItest/t/call.t ......................................... ok
../ext/XS-APItest/t/call_checker.t ................................. ok
../ext/XS-APItest/t/caller.t ....................................... ok
../ext/XS-APItest/t/callregexec.t .................................. ok
../ext/XS-APItest/t/check_warnings.t ............................... ok
../ext/XS-APItest/t/cleanup.t ...................................... ok
../ext/XS-APItest/t/clone-with-stack.t ............................. ok
../ext/XS-APItest/t/cophh.t ........................................ ok
../ext/XS-APItest/t/coplabel.t ..................................... ok
../ext/XS-APItest/t/copstash.t ..................................... ok
../ext/XS-APItest/t/copyhints.t .................................... ok
../ext/XS-APItest/t/customop.t ..................................... ok
../ext/XS-APItest/t/cv_name.t ...................................... ok
../ext/XS-APItest/t/eval-filter.t .................................. ok
../ext/XS-APItest/t/exception.t .................................... ok
../ext/XS-APItest/t/extend.t ....................................... ok
../ext/XS-APItest/t/fetch_pad_names.t .............................. ok
../ext/XS-APItest/t/gotosub.t ...................................... ok
../ext/XS-APItest/t/grok.t ......................................... ok
../ext/XS-APItest/t/gv_autoload4.t ................................. ok
../ext/XS-APItest/t/gv_const_sv.t .................................. ok
../ext/XS-APItest/t/gv_fetchmeth.t ................................. ok
../ext/XS-APItest/t/gv_fetchmeth_autoload.t ........................ ok
../ext/XS-APItest/t/gv_fetchmethod_flags.t ......................... ok
../ext/XS-APItest/t/gv_init.t ...................................... ok
../ext/XS-APItest/t/handy.t ........................................ ok
../ext/XS-APItest/t/hash.t ......................................... ok
../ext/XS-APItest/t/join_with_space.t .............................. ok
../ext/XS-APItest/t/keyword_multiline.t ............................ ok
../ext/XS-APItest/t/keyword_plugin.t ............................... ok
../ext/XS-APItest/t/labelconst.t ................................... ok
../ext/XS-APItest/t/lexsub.t ....................................... ok
../ext/XS-APItest/t/load-module.t .................................. ok
../ext/XS-APItest/t/locale.t ....................................... ok
../ext/XS-APItest/t/loopblock.t .................................... ok
../ext/XS-APItest/t/looprest.t ..................................... ok
../ext/XS-APItest/t/lvalue.t ....................................... ok
../ext/XS-APItest/t/magic.t ........................................ ok
../ext/XS-APItest/t/magic_chain.t .................................. ok
../ext/XS-APItest/t/mro.t .......................................... ok
../ext/XS-APItest/t/multicall.t .................................... ok
../ext/XS-APItest/t/my_cxt.t ....................................... ok
../ext/XS-APItest/t/my_exit.t ...................................... ok
../ext/XS-APItest/t/newCONSTSUB.t .................................. ok
../ext/XS-APItest/t/newDEFSVOP.t ................................... ok
../ext/XS-APItest/t/op.t ........................................... ok
../ext/XS-APItest/t/op_contextualize.t ............................. ok
../ext/XS-APItest/t/op_list.t ...................................... ok
../ext/XS-APItest/t/overload.t ..................................... ok
../ext/XS-APItest/t/pad_scalar.t ................................... ok
../ext/XS-APItest/t/peep.t ......................................... ok
../ext/XS-APItest/t/pmflag.t ....................................... ok
../ext/XS-APItest/t/postinc.t ...................................... ok
../ext/XS-APItest/t/printf.t ....................................... ok
../ext/XS-APItest/t/ptr_table.t .................................... ok
../ext/XS-APItest/t/push.t ......................................... ok
../ext/XS-APItest/t/refs.t ......................................... ok
../ext/XS-APItest/t/rmagical.t ..................................... ok
../ext/XS-APItest/t/rv2cv_op_cv.t .................................. ok
../ext/XS-APItest/t/savehints.t .................................... ok
../ext/XS-APItest/t/scopelessblock.t ............................... ok
../ext/XS-APItest/t/sort.t ......................................... ok
../ext/XS-APItest/t/stmtasexpr.t ................................... ok
../ext/XS-APItest/t/stmtsasexpr.t .................................. ok
../ext/XS-APItest/t/stuff_modify_bug.t ............................. ok
../ext/XS-APItest/t/stuff_svcur_bug.t .............................. ok
../ext/XS-APItest/t/subcall.t ...................................... ok
../ext/XS-APItest/t/svcat.t ........................................ ok
../ext/XS-APItest/t/svcatpvf.t ..................................... ok
../ext/XS-APItest/t/sviscow.t ...................................... ok
../ext/XS-APItest/t/svpeek.t ....................................... ok
../ext/XS-APItest/t/svpv.t ......................................... ok
../ext/XS-APItest/t/svpv_magic.t ................................... ok
../ext/XS-APItest/t/svsetsv.t ...................................... ok
../ext/XS-APItest/t/swaplabel.t .................................... ok
../ext/XS-APItest/t/swaptwostmts.t ................................. ok
../ext/XS-APItest/t/sym-hook.t ..................................... ok
../ext/XS-APItest/t/synthetic_scope.t .............................. ok
../ext/XS-APItest/t/temp_lv_sub.t .................................. ok
../ext/XS-APItest/t/underscore_length.t ............................ ok
../ext/XS-APItest/t/utf16_to_utf8.t ................................ ok
../ext/XS-APItest/t/utf8.t ......................................... ok
../ext/XS-APItest/t/weaken.t ....................................... ok
../ext/XS-APItest/t/whichsig.t ..................................... ok
../ext/XS-APItest/t/win32.t ........................................ ok
../ext/XS-APItest/t/xs_special_subs.t .............................. ok
../ext/XS-APItest/t/xs_special_subs_require.t ...................... ok
../ext/XS-APItest/t/xsub_h.t ....................................... ok
../ext/XS-Typemap/t/Typemap.t ...................................... ok
../ext/arybase/t/aeach.t ........................................... ok
../ext/arybase/t/aelem.t ........................................... ok
../ext/arybase/t/akeys.t ........................................... ok
../ext/arybase/t/arybase.t ......................................... ok
../ext/arybase/t/aslice.t .......................................... ok
../ext/arybase/t/av2arylen.t ....................................... ok
../ext/arybase/t/index.t ........................................... ok
../ext/arybase/t/lslice.t .......................................... ok
../ext/arybase/t/pos.t ............................................. ok
../ext/arybase/t/scope.t ........................................... ok
../ext/arybase/t/splice.t .......................................... ok
../ext/arybase/t/substr.t .......................................... ok
../ext/re/t/lexical_debug.t ........................................ ok
../ext/re/t/qr.t ................................................... ok
../ext/re/t/re.t ................................................... ok
../ext/re/t/re_funcs.t ............................................. ok
../ext/re/t/re_funcs_u.t ........................................... ok
../ext/re/t/reflags.t .............................................. ok
../ext/re/t/regop.t ................................................ ok
../ext/re/t/strict.t ............................................... ok
../lib/AnyDBM_File.t ............................................... ok
../lib/B/Deparse-core.t ............................................ ok
../lib/B/Deparse-subclass.t ........................................ ok
../lib/B/Deparse.t ................................................. ok
../lib/Benchmark.t ................................................. ok
../lib/Class/Struct.t .............................................. ok
../lib/Config.t .................................................... ok
../lib/Config/Extensions.t ......................................... ok
../lib/DB.t ........................................................ ok
../lib/DBM_Filter/t/01error.t ...................................... ok
../lib/DBM_Filter/t/02core.t ....................................... ok
../lib/DBM_Filter/t/compress.t ..................................... ok
../lib/DBM_Filter/t/encode.t ....................................... ok
../lib/DBM_Filter/t/int32.t ........................................ ok
../lib/DBM_Filter/t/null.t ......................................... ok
../lib/DBM_Filter/t/utf8.t ......................................... ok
../lib/DirHandle.t ................................................. ok
../lib/English.t ................................................... ok
../lib/ExtUtils/t/Embed.t .......................................... ok
../lib/File/Basename.t ............................................. ok
../lib/File/Compare.t .............................................. ok
../lib/File/Copy.t ................................................. ok
../lib/File/stat-7896.t ............................................ ok
../lib/File/stat.t ................................................. ok
../lib/FileHandle.t ................................................ ok
../lib/FindBin.t ................................................... ok
../lib/Getopt/Std.t ................................................ ok
../lib/Internals.t ................................................. ok
../lib/Net/hostent.t ............................................... ok
../lib/Net/netent.t ................................................ skipped: no getnetbyname
../lib/Net/protoent.t .............................................. skipped: no netdb.h
../lib/Net/servent.t ............................................... skipped: no netdb.h
../lib/Pod/t/InputObjects.t ........................................ ok
../lib/Pod/t/Select.t .............................................. ok
../lib/Pod/t/Usage.t ............................................... ok
../lib/Pod/t/utils.t ............................................... ok
../lib/SelectSaver.t ............................................... ok
../lib/Symbol.t .................................................... ok
../lib/Thread.t .................................................... ok
../lib/Tie/ExtraHash.t ............................................. ok
../lib/Tie/Hash.t .................................................. ok
../lib/Tie/Scalar.t ................................................ ok
../lib/Tie/SubstrHash.t ............................................ ok
../lib/Tie/Array/push.t ............................................ ok
../lib/Tie/Array/splice.t .......................................... ok
../lib/Tie/Array/std.t ............................................. ok
../lib/Tie/Array/stdpush.t ......................................... ok
../lib/Tie/Handle/stdhandle.t ...................................... ok
../lib/Tie/Handle/stdhandle_from_handle.t .......................... ok
../lib/Time/gmtime.t ............................................... ok
../lib/Time/localtime.t ............................................ ok
../lib/Unicode/UCD.t ............................................... ok
../lib/User/grent.t ................................................ skipped: no getgrgid
../lib/User/pwent.t ................................................ skipped: no getpwuid
../lib/blib.t ...................................................... ok
../lib/bytes.t ..................................................... ok
../lib/charnames.t ................................................. ok
../lib/diagnostics.t ............................................... ok
../lib/dumpvar.t ................................................... ok
../lib/feature.t ................................................... ok
../lib/feature/unicode_strings.t ................................... ok
../lib/filetest.t .................................................. ok
../lib/h2ph.t ...................................................... ok
../lib/h2xs.t ...................................................... ok
../lib/integer.t ................................................... ok
../lib/less.t ...................................................... ok
../lib/locale.t .................................................... ok
../lib/meta_notation.t ............................................. ok
../lib/open.t ...................................................... ok
../lib/overload.t .................................................. ok
../lib/overload64.t ................................................ skipped: -- Perl configured with 32-bit ints
../lib/overloading.t ............................................... ok
../lib/perl5db.t ................................................... skipped: no /dev/null
../lib/perlbug.t ................................................... ok
../lib/sigtrap.t ................................................... ok
../lib/sort.t ...................................................... ok
../lib/strict.t .................................................... ok
../lib/subs.t ...................................................... ok
../lib/utf8.t ...................................................... ok
../lib/vars.t ...................................................... ok
../lib/vars_carp.t ................................................. ok
../lib/vmsish.t .................................................... ok
../lib/warnings.t .................................................. ok

Test Summary Report
-------------------
../cpan/Archive-Tar/t/09_roundtrip.t (Wstat: 0 Tests: 7 Failed: 0)
   TODO passed: 1, 4, 6
../cpan/ExtUtils-MakeMaker/t/basic.t (Wstat: 3840 Tests: 186 Failed: 15)
   Failed tests: 22-23, 34-36, 69, 178-186
   Non-zero exit status: 15
../cpan/IPC-Cmd/t/01_IPC-Cmd.t (Wstat: 3328 Tests: 459 Failed: 13)
   Failed tests: 54, 60-61, 142, 148-149, 153, 159-160, 162-163
                 173-174
   Non-zero exit status: 13
../ext/IPC-Open3/t/IPC-Open3.t (Wstat: 0 Tests: 45 Failed: 0)
   TODO passed: 25
Files=2468, Tests=826523, 1951 wallclock secs (101.74 usr + 8.23 sys = 109.97 CPU)
Result: FAIL
NMAKE : fatal error U1077: '.\perl.exe' : return code '0x1c'
Stop.

<http://perl5.git.perl.org:8080/job/perl5-win32/ws/win32>exit> 2
Build step 'Execute Windows batch command' marked build as failure

Search Discussions

  • Dennis+p5p-jenkins at May 28, 2016 at 4:17 pm
    See <http://perl5.git.perl.org:8080/job/perl5-win32/2441/changes>

    Changes:

    [dom] ext/POSIX/t/sigaction.t: Skip uid and pid tests on GNU/Hurd

    ------------------------------------------
    [...truncated 6782 lines...]
    ../ext/PerlIO-encoding/t/threads.t ................................. ok
    ../ext/PerlIO-scalar/t/scalar.t .................................... ok
    ../ext/PerlIO-scalar/t/scalar_ungetc.t ............................. ok
    ../ext/PerlIO-via/t/via.t .......................................... ok
    ../ext/Pod-Functions/t/Functions.t ................................. ok
    ../ext/Pod-Html/t/anchorify.t ...................................... ok
    ../ext/Pod-Html/t/cache.t .......................................... ok
    ../ext/Pod-Html/t/crossref.t ....................................... ok
    ../ext/Pod-Html/t/crossref2.t ...................................... ok
    ../ext/Pod-Html/t/crossref3.t ...................................... ok
    ../ext/Pod-Html/t/eol.t ............................................ ok
    ../ext/Pod-Html/t/feature.t ........................................ ok
    ../ext/Pod-Html/t/feature2.t ....................................... ok
    ../ext/Pod-Html/t/htmldir1.t ....................................... ok
    ../ext/Pod-Html/t/htmldir2.t ....................................... ok
    ../ext/Pod-Html/t/htmldir3.t ....................................... ok
    ../ext/Pod-Html/t/htmldir4.t ....................................... ok
    ../ext/Pod-Html/t/htmldir5.t ....................................... ok
    ../ext/Pod-Html/t/htmlescp.t ....................................... ok
    ../ext/Pod-Html/t/htmllink.t ....................................... ok
    ../ext/Pod-Html/t/htmlview.t ....................................... ok
    ../ext/Pod-Html/t/poderr.t ......................................... ok
    ../ext/Pod-Html/t/podnoerr.t ....................................... ok
    ../ext/SDBM_File/t/constants.t ..................................... ok
    ../ext/SDBM_File/t/prep.t .......................................... ok
    ../ext/SDBM_File/t/sdbm.t .......................................... ok
    ../ext/Sys-Hostname/t/Hostname.t ................................... ok
    ../ext/Tie-Hash-NamedCapture/t/tiehash.t ........................... ok
    ../ext/Tie-Memoize/t/Tie-Memoize.t ................................. ok
    ../ext/Win32CORE/t/win32core.t ..................................... ok
    ../ext/XS-APItest/t/addissub.t ..................................... ok
    ../ext/XS-APItest/t/arrayexpr.t .................................... ok
    ../ext/XS-APItest/t/autoload.t ..................................... ok
    ../ext/XS-APItest/t/blockasexpr.t .................................. ok
    ../ext/XS-APItest/t/blockhooks-csc.t ............................... ok
    ../ext/XS-APItest/t/blockhooks.t ................................... ok
    ../ext/XS-APItest/t/call.t ......................................... ok
    ../ext/XS-APItest/t/call_checker.t ................................. ok
    ../ext/XS-APItest/t/caller.t ....................................... ok
    ../ext/XS-APItest/t/callregexec.t .................................. ok
    ../ext/XS-APItest/t/check_warnings.t ............................... ok
    ../ext/XS-APItest/t/cleanup.t ...................................... ok
    ../ext/XS-APItest/t/clone-with-stack.t ............................. ok
    ../ext/XS-APItest/t/cophh.t ........................................ ok
    ../ext/XS-APItest/t/coplabel.t ..................................... ok
    ../ext/XS-APItest/t/copstash.t ..................................... ok
    ../ext/XS-APItest/t/copyhints.t .................................... ok
    ../ext/XS-APItest/t/customop.t ..................................... ok
    ../ext/XS-APItest/t/cv_name.t ...................................... ok
    ../ext/XS-APItest/t/eval-filter.t .................................. ok
    ../ext/XS-APItest/t/exception.t .................................... ok
    ../ext/XS-APItest/t/extend.t ....................................... ok
    ../ext/XS-APItest/t/fetch_pad_names.t .............................. ok
    ../ext/XS-APItest/t/gotosub.t ...................................... ok
    ../ext/XS-APItest/t/grok.t ......................................... ok
    ../ext/XS-APItest/t/gv_autoload4.t ................................. ok
    ../ext/XS-APItest/t/gv_const_sv.t .................................. ok
    ../ext/XS-APItest/t/gv_fetchmeth.t ................................. ok
    ../ext/XS-APItest/t/gv_fetchmeth_autoload.t ........................ ok
    ../ext/XS-APItest/t/gv_fetchmethod_flags.t ......................... ok
    ../ext/XS-APItest/t/gv_init.t ...................................... ok
    ../ext/XS-APItest/t/handy.t ........................................ ok
    ../ext/XS-APItest/t/hash.t ......................................... ok
    ../ext/XS-APItest/t/join_with_space.t .............................. ok
    ../ext/XS-APItest/t/keyword_multiline.t ............................ ok
    ../ext/XS-APItest/t/keyword_plugin.t ............................... ok
    ../ext/XS-APItest/t/labelconst.t ................................... ok
    ../ext/XS-APItest/t/lexsub.t ....................................... ok
    ../ext/XS-APItest/t/load-module.t .................................. ok
    ../ext/XS-APItest/t/locale.t ....................................... ok
    ../ext/XS-APItest/t/loopblock.t .................................... ok
    ../ext/XS-APItest/t/looprest.t ..................................... ok
    ../ext/XS-APItest/t/lvalue.t ....................................... ok
    ../ext/XS-APItest/t/magic.t ........................................ ok
    ../ext/XS-APItest/t/magic_chain.t .................................. ok
    ../ext/XS-APItest/t/mro.t .......................................... ok
    ../ext/XS-APItest/t/multicall.t .................................... ok
    ../ext/XS-APItest/t/my_cxt.t ....................................... ok
    ../ext/XS-APItest/t/my_exit.t ...................................... ok
    ../ext/XS-APItest/t/newCONSTSUB.t .................................. ok
    ../ext/XS-APItest/t/newDEFSVOP.t ................................... ok
    ../ext/XS-APItest/t/op.t ........................................... ok
    ../ext/XS-APItest/t/op_contextualize.t ............................. ok
    ../ext/XS-APItest/t/op_list.t ...................................... ok
    ../ext/XS-APItest/t/overload.t ..................................... ok
    ../ext/XS-APItest/t/pad_scalar.t ................................... ok
    ../ext/XS-APItest/t/peep.t ......................................... ok
    ../ext/XS-APItest/t/pmflag.t ....................................... ok
    ../ext/XS-APItest/t/postinc.t ...................................... ok
    ../ext/XS-APItest/t/printf.t ....................................... ok
    ../ext/XS-APItest/t/ptr_table.t .................................... ok
    ../ext/XS-APItest/t/push.t ......................................... ok
    ../ext/XS-APItest/t/refs.t ......................................... ok
    ../ext/XS-APItest/t/rmagical.t ..................................... ok
    ../ext/XS-APItest/t/rv2cv_op_cv.t .................................. ok
    ../ext/XS-APItest/t/savehints.t .................................... ok
    ../ext/XS-APItest/t/scopelessblock.t ............................... ok
    ../ext/XS-APItest/t/sort.t ......................................... ok
    ../ext/XS-APItest/t/stmtasexpr.t ................................... ok
    ../ext/XS-APItest/t/stmtsasexpr.t .................................. ok
    ../ext/XS-APItest/t/stuff_modify_bug.t ............................. ok
    ../ext/XS-APItest/t/stuff_svcur_bug.t .............................. ok
    ../ext/XS-APItest/t/subcall.t ...................................... ok
    ../ext/XS-APItest/t/svcat.t ........................................ ok
    ../ext/XS-APItest/t/svcatpvf.t ..................................... ok
    ../ext/XS-APItest/t/sviscow.t ...................................... ok
    ../ext/XS-APItest/t/svpeek.t ....................................... ok
    ../ext/XS-APItest/t/svpv.t ......................................... ok
    ../ext/XS-APItest/t/svpv_magic.t ................................... ok
    ../ext/XS-APItest/t/svsetsv.t ...................................... ok
    ../ext/XS-APItest/t/swaplabel.t .................................... ok
    ../ext/XS-APItest/t/swaptwostmts.t ................................. ok
    ../ext/XS-APItest/t/sym-hook.t ..................................... ok
    ../ext/XS-APItest/t/synthetic_scope.t .............................. ok
    ../ext/XS-APItest/t/temp_lv_sub.t .................................. ok
    ../ext/XS-APItest/t/underscore_length.t ............................ ok
    ../ext/XS-APItest/t/utf16_to_utf8.t ................................ ok
    ../ext/XS-APItest/t/utf8.t ......................................... ok
    ../ext/XS-APItest/t/weaken.t ....................................... ok
    ../ext/XS-APItest/t/whichsig.t ..................................... ok
    ../ext/XS-APItest/t/win32.t ........................................ ok
    ../ext/XS-APItest/t/xs_special_subs.t .............................. ok
    ../ext/XS-APItest/t/xs_special_subs_require.t ...................... ok
    ../ext/XS-APItest/t/xsub_h.t ....................................... ok
    ../ext/XS-Typemap/t/Typemap.t ...................................... ok
    ../ext/arybase/t/aeach.t ........................................... ok
    ../ext/arybase/t/aelem.t ........................................... ok
    ../ext/arybase/t/akeys.t ........................................... ok
    ../ext/arybase/t/arybase.t ......................................... ok
    ../ext/arybase/t/aslice.t .......................................... ok
    ../ext/arybase/t/av2arylen.t ....................................... ok
    ../ext/arybase/t/index.t ........................................... ok
    ../ext/arybase/t/lslice.t .......................................... ok
    ../ext/arybase/t/pos.t ............................................. ok
    ../ext/arybase/t/scope.t ........................................... ok
    ../ext/arybase/t/splice.t .......................................... ok
    ../ext/arybase/t/substr.t .......................................... ok
    ../ext/re/t/lexical_debug.t ........................................ ok
    ../ext/re/t/qr.t ................................................... ok
    ../ext/re/t/re.t ................................................... ok
    ../ext/re/t/re_funcs.t ............................................. ok
    ../ext/re/t/re_funcs_u.t ........................................... ok
    ../ext/re/t/reflags.t .............................................. ok
    ../ext/re/t/regop.t ................................................ ok
    ../ext/re/t/strict.t ............................................... ok
    ../lib/AnyDBM_File.t ............................................... ok
    ../lib/B/Deparse-core.t ............................................ ok
    ../lib/B/Deparse-subclass.t ........................................ ok
    ../lib/B/Deparse.t ................................................. ok
    ../lib/Benchmark.t ................................................. ok
    ../lib/Class/Struct.t .............................................. ok
    ../lib/Config.t .................................................... ok
    ../lib/Config/Extensions.t ......................................... ok
    ../lib/DB.t ........................................................ ok
    ../lib/DBM_Filter/t/01error.t ...................................... ok
    ../lib/DBM_Filter/t/02core.t ....................................... ok
    ../lib/DBM_Filter/t/compress.t ..................................... ok
    ../lib/DBM_Filter/t/encode.t ....................................... ok
    ../lib/DBM_Filter/t/int32.t ........................................ ok
    ../lib/DBM_Filter/t/null.t ......................................... ok
    ../lib/DBM_Filter/t/utf8.t ......................................... ok
    ../lib/DirHandle.t ................................................. ok
    ../lib/English.t ................................................... ok
    ../lib/ExtUtils/t/Embed.t .......................................... ok
    ../lib/File/Basename.t ............................................. ok
    ../lib/File/Compare.t .............................................. ok
    ../lib/File/Copy.t ................................................. ok
    ../lib/File/stat-7896.t ............................................ ok
    ../lib/File/stat.t ................................................. ok
    ../lib/FileHandle.t ................................................ ok
    ../lib/FindBin.t ................................................... ok
    ../lib/Getopt/Std.t ................................................ ok
    ../lib/Internals.t ................................................. ok
    ../lib/Net/hostent.t ............................................... ok
    ../lib/Net/netent.t ................................................ skipped: no getnetbyname
    ../lib/Net/protoent.t .............................................. skipped: no netdb.h
    ../lib/Net/servent.t ............................................... skipped: no netdb.h
    ../lib/Pod/t/InputObjects.t ........................................ ok
    ../lib/Pod/t/Select.t .............................................. ok
    ../lib/Pod/t/Usage.t ............................................... ok
    ../lib/Pod/t/utils.t ............................................... ok
    ../lib/SelectSaver.t ............................................... ok
    ../lib/Symbol.t .................................................... ok
    ../lib/Thread.t .................................................... ok
    ../lib/Tie/ExtraHash.t ............................................. ok
    ../lib/Tie/Hash.t .................................................. ok
    ../lib/Tie/Scalar.t ................................................ ok
    ../lib/Tie/SubstrHash.t ............................................ ok
    ../lib/Tie/Array/push.t ............................................ ok
    ../lib/Tie/Array/splice.t .......................................... ok
    ../lib/Tie/Array/std.t ............................................. ok
    ../lib/Tie/Array/stdpush.t ......................................... ok
    ../lib/Tie/Handle/stdhandle.t ...................................... ok
    ../lib/Tie/Handle/stdhandle_from_handle.t .......................... ok
    ../lib/Time/gmtime.t ............................................... ok
    ../lib/Time/localtime.t ............................................ ok
    ../lib/Unicode/UCD.t ............................................... ok
    ../lib/User/grent.t ................................................ skipped: no getgrgid
    ../lib/User/pwent.t ................................................ skipped: no getpwuid
    ../lib/blib.t ...................................................... ok
    ../lib/bytes.t ..................................................... ok
    ../lib/charnames.t ................................................. ok
    ../lib/diagnostics.t ............................................... ok
    ../lib/dumpvar.t ................................................... ok
    ../lib/feature.t ................................................... ok
    ../lib/feature/unicode_strings.t ................................... ok
    ../lib/filetest.t .................................................. ok
    ../lib/h2ph.t ...................................................... ok
    ../lib/h2xs.t ...................................................... ok
    ../lib/integer.t ................................................... ok
    ../lib/less.t ...................................................... ok
    ../lib/locale.t .................................................... ok
    ../lib/meta_notation.t ............................................. ok
    ../lib/open.t ...................................................... ok
    ../lib/overload.t .................................................. ok
    ../lib/overload64.t ................................................ skipped: -- Perl configured with 32-bit ints
    ../lib/overloading.t ............................................... ok
    ../lib/perl5db.t ................................................... skipped: no /dev/null
    ../lib/perlbug.t ................................................... ok
    ../lib/sigtrap.t ................................................... ok
    ../lib/sort.t ...................................................... ok
    ../lib/strict.t .................................................... ok
    ../lib/subs.t ...................................................... ok
    ../lib/utf8.t ...................................................... ok
    ../lib/vars.t ...................................................... ok
    ../lib/vars_carp.t ................................................. ok
    ../lib/vmsish.t .................................................... ok
    ../lib/warnings.t .................................................. ok

    Test Summary Report
    -------------------
    ../cpan/Archive-Tar/t/09_roundtrip.t (Wstat: 0 Tests: 7 Failed: 0)
       TODO passed: 1, 4, 6
    ../cpan/ExtUtils-MakeMaker/t/basic.t (Wstat: 3840 Tests: 186 Failed: 15)
       Failed tests: 22-23, 34-36, 69, 178-186
       Non-zero exit status: 15
    ../cpan/IPC-Cmd/t/01_IPC-Cmd.t (Wstat: 4864 Tests: 459 Failed: 19)
       Failed tests: 74-75, 85-87, 93-94, 96-97, 151-152, 162-164
                     170-171, 175, 181-182
       Non-zero exit status: 19
    ../ext/IPC-Open3/t/IPC-Open3.t (Wstat: 0 Tests: 45 Failed: 0)
       TODO passed: 25
    Files=2468, Tests=826549, 1995 wallclock secs (98.33 usr + 7.27 sys = 105.59 CPU)
    Result: FAIL
    NMAKE : fatal error U1077: '.\perl.exe' : return code '0x22'
    Stop.

    <http://perl5.git.perl.org:8080/job/perl5-win32/ws/win32>exit> 2
    Build step 'Execute Windows batch command' marked build as failure
  • Dennis+p5p-jenkins at May 29, 2016 at 10:17 pm
    See <http://perl5.git.perl.org:8080/job/perl5-win32/2442/changes>

    Changes:

    [sprout] [perl #128266] libperl.t: Ignore $UNIX2003 suffix

    ------------------------------------------
    [...truncated 6738 lines...]
    ../ext/PerlIO-encoding/t/nolooping.t ............................... ok
    ../ext/PerlIO-encoding/t/threads.t ................................. ok
    ../ext/PerlIO-scalar/t/scalar.t .................................... ok
    ../ext/PerlIO-scalar/t/scalar_ungetc.t ............................. ok
    ../ext/PerlIO-via/t/via.t .......................................... ok
    ../ext/Pod-Functions/t/Functions.t ................................. ok
    ../ext/Pod-Html/t/anchorify.t ...................................... ok
    ../ext/Pod-Html/t/cache.t .......................................... ok
    ../ext/Pod-Html/t/crossref.t ....................................... ok
    ../ext/Pod-Html/t/crossref2.t ...................................... ok
    ../ext/Pod-Html/t/crossref3.t ...................................... ok
    ../ext/Pod-Html/t/eol.t ............................................ ok
    ../ext/Pod-Html/t/feature.t ........................................ ok
    ../ext/Pod-Html/t/feature2.t ....................................... ok
    ../ext/Pod-Html/t/htmldir1.t ....................................... ok
    ../ext/Pod-Html/t/htmldir2.t ....................................... ok
    ../ext/Pod-Html/t/htmldir3.t ....................................... ok
    ../ext/Pod-Html/t/htmldir4.t ....................................... ok
    ../ext/Pod-Html/t/htmldir5.t ....................................... ok
    ../ext/Pod-Html/t/htmlescp.t ....................................... ok
    ../ext/Pod-Html/t/htmllink.t ....................................... ok
    ../ext/Pod-Html/t/htmlview.t ....................................... ok
    ../ext/Pod-Html/t/poderr.t ......................................... ok
    ../ext/Pod-Html/t/podnoerr.t ....................................... ok
    ../ext/SDBM_File/t/constants.t ..................................... ok
    ../ext/SDBM_File/t/prep.t .......................................... ok
    ../ext/SDBM_File/t/sdbm.t .......................................... ok
    ../ext/Sys-Hostname/t/Hostname.t ................................... ok
    ../ext/Tie-Hash-NamedCapture/t/tiehash.t ........................... ok
    ../ext/Tie-Memoize/t/Tie-Memoize.t ................................. ok
    ../ext/Win32CORE/t/win32core.t ..................................... ok
    ../ext/XS-APItest/t/addissub.t ..................................... ok
    ../ext/XS-APItest/t/arrayexpr.t .................................... ok
    ../ext/XS-APItest/t/autoload.t ..................................... ok
    ../ext/XS-APItest/t/blockasexpr.t .................................. ok
    ../ext/XS-APItest/t/blockhooks-csc.t ............................... ok
    ../ext/XS-APItest/t/blockhooks.t ................................... ok
    ../ext/XS-APItest/t/call.t ......................................... ok
    ../ext/XS-APItest/t/call_checker.t ................................. ok
    ../ext/XS-APItest/t/caller.t ....................................... ok
    ../ext/XS-APItest/t/callregexec.t .................................. ok
    ../ext/XS-APItest/t/check_warnings.t ............................... ok
    ../ext/XS-APItest/t/cleanup.t ...................................... ok
    ../ext/XS-APItest/t/clone-with-stack.t ............................. ok
    ../ext/XS-APItest/t/cophh.t ........................................ ok
    ../ext/XS-APItest/t/coplabel.t ..................................... ok
    ../ext/XS-APItest/t/copstash.t ..................................... ok
    ../ext/XS-APItest/t/copyhints.t .................................... ok
    ../ext/XS-APItest/t/customop.t ..................................... ok
    ../ext/XS-APItest/t/cv_name.t ...................................... ok
    ../ext/XS-APItest/t/eval-filter.t .................................. ok
    ../ext/XS-APItest/t/exception.t .................................... ok
    ../ext/XS-APItest/t/extend.t ....................................... ok
    ../ext/XS-APItest/t/fetch_pad_names.t .............................. ok
    ../ext/XS-APItest/t/gotosub.t ...................................... ok
    ../ext/XS-APItest/t/grok.t ......................................... ok
    ../ext/XS-APItest/t/gv_autoload4.t ................................. ok
    ../ext/XS-APItest/t/gv_const_sv.t .................................. ok
    ../ext/XS-APItest/t/gv_fetchmeth.t ................................. ok
    ../ext/XS-APItest/t/gv_fetchmeth_autoload.t ........................ ok
    ../ext/XS-APItest/t/gv_fetchmethod_flags.t ......................... ok
    ../ext/XS-APItest/t/gv_init.t ...................................... ok
    ../ext/XS-APItest/t/handy.t ........................................ ok
    ../ext/XS-APItest/t/hash.t ......................................... ok
    ../ext/XS-APItest/t/join_with_space.t .............................. ok
    ../ext/XS-APItest/t/keyword_multiline.t ............................ ok
    ../ext/XS-APItest/t/keyword_plugin.t ............................... ok
    ../ext/XS-APItest/t/labelconst.t ................................... ok
    ../ext/XS-APItest/t/lexsub.t ....................................... ok
    ../ext/XS-APItest/t/load-module.t .................................. ok
    ../ext/XS-APItest/t/locale.t ....................................... ok
    ../ext/XS-APItest/t/loopblock.t .................................... ok
    ../ext/XS-APItest/t/looprest.t ..................................... ok
    ../ext/XS-APItest/t/lvalue.t ....................................... ok
    ../ext/XS-APItest/t/magic.t ........................................ ok
    ../ext/XS-APItest/t/magic_chain.t .................................. ok
    ../ext/XS-APItest/t/mro.t .......................................... ok
    ../ext/XS-APItest/t/multicall.t .................................... ok
    ../ext/XS-APItest/t/my_cxt.t ....................................... ok
    ../ext/XS-APItest/t/my_exit.t ...................................... ok
    ../ext/XS-APItest/t/newCONSTSUB.t .................................. ok
    ../ext/XS-APItest/t/newDEFSVOP.t ................................... ok
    ../ext/XS-APItest/t/op.t ........................................... ok
    ../ext/XS-APItest/t/op_contextualize.t ............................. ok
    ../ext/XS-APItest/t/op_list.t ...................................... ok
    ../ext/XS-APItest/t/overload.t ..................................... ok
    ../ext/XS-APItest/t/pad_scalar.t ................................... ok
    ../ext/XS-APItest/t/peep.t ......................................... ok
    ../ext/XS-APItest/t/pmflag.t ....................................... ok
    ../ext/XS-APItest/t/postinc.t ...................................... ok
    ../ext/XS-APItest/t/printf.t ....................................... ok
    ../ext/XS-APItest/t/ptr_table.t .................................... ok
    ../ext/XS-APItest/t/push.t ......................................... ok
    ../ext/XS-APItest/t/refs.t ......................................... ok
    ../ext/XS-APItest/t/rmagical.t ..................................... ok
    ../ext/XS-APItest/t/rv2cv_op_cv.t .................................. ok
    ../ext/XS-APItest/t/savehints.t .................................... ok
    ../ext/XS-APItest/t/scopelessblock.t ............................... ok
    ../ext/XS-APItest/t/sort.t ......................................... ok
    ../ext/XS-APItest/t/stmtasexpr.t ................................... ok
    ../ext/XS-APItest/t/stmtsasexpr.t .................................. ok
    ../ext/XS-APItest/t/stuff_modify_bug.t ............................. ok
    ../ext/XS-APItest/t/stuff_svcur_bug.t .............................. ok
    ../ext/XS-APItest/t/subcall.t ...................................... ok
    ../ext/XS-APItest/t/svcat.t ........................................ ok
    ../ext/XS-APItest/t/svcatpvf.t ..................................... ok
    ../ext/XS-APItest/t/sviscow.t ...................................... ok
    ../ext/XS-APItest/t/svpeek.t ....................................... ok
    ../ext/XS-APItest/t/svpv.t ......................................... ok
    ../ext/XS-APItest/t/svpv_magic.t ................................... ok
    ../ext/XS-APItest/t/svsetsv.t ...................................... ok
    ../ext/XS-APItest/t/swaplabel.t .................................... ok
    ../ext/XS-APItest/t/swaptwostmts.t ................................. ok
    ../ext/XS-APItest/t/sym-hook.t ..................................... ok
    ../ext/XS-APItest/t/synthetic_scope.t .............................. ok
    ../ext/XS-APItest/t/temp_lv_sub.t .................................. ok
    ../ext/XS-APItest/t/underscore_length.t ............................ ok
    ../ext/XS-APItest/t/utf16_to_utf8.t ................................ ok
    ../ext/XS-APItest/t/utf8.t ......................................... ok
    ../ext/XS-APItest/t/weaken.t ....................................... ok
    ../ext/XS-APItest/t/whichsig.t ..................................... ok
    ../ext/XS-APItest/t/win32.t ........................................ ok
    ../ext/XS-APItest/t/xs_special_subs.t .............................. ok
    ../ext/XS-APItest/t/xs_special_subs_require.t ...................... ok
    ../ext/XS-APItest/t/xsub_h.t ....................................... ok
    ../ext/XS-Typemap/t/Typemap.t ...................................... ok
    ../ext/arybase/t/aeach.t ........................................... ok
    ../ext/arybase/t/aelem.t ........................................... ok
    ../ext/arybase/t/akeys.t ........................................... ok
    ../ext/arybase/t/arybase.t ......................................... ok
    ../ext/arybase/t/aslice.t .......................................... ok
    ../ext/arybase/t/av2arylen.t ....................................... ok
    ../ext/arybase/t/index.t ........................................... ok
    ../ext/arybase/t/lslice.t .......................................... ok
    ../ext/arybase/t/pos.t ............................................. ok
    ../ext/arybase/t/scope.t ........................................... ok
    ../ext/arybase/t/splice.t .......................................... ok
    ../ext/arybase/t/substr.t .......................................... ok
    ../ext/re/t/lexical_debug.t ........................................ ok
    ../ext/re/t/qr.t ................................................... ok
    ../ext/re/t/re.t ................................................... ok
    ../ext/re/t/re_funcs.t ............................................. ok
    ../ext/re/t/re_funcs_u.t ........................................... ok
    ../ext/re/t/reflags.t .............................................. ok
    ../ext/re/t/regop.t ................................................ ok
    ../ext/re/t/strict.t ............................................... ok
    ../lib/AnyDBM_File.t ............................................... ok
    ../lib/B/Deparse-core.t ............................................ ok
    ../lib/B/Deparse-subclass.t ........................................ ok
    ../lib/B/Deparse.t ................................................. ok
    ../lib/Benchmark.t ................................................. ok
    ../lib/Class/Struct.t .............................................. ok
    ../lib/Config.t .................................................... ok
    ../lib/Config/Extensions.t ......................................... ok
    ../lib/DB.t ........................................................ ok
    ../lib/DBM_Filter/t/01error.t ...................................... ok
    ../lib/DBM_Filter/t/02core.t ....................................... ok
    ../lib/DBM_Filter/t/compress.t ..................................... ok
    ../lib/DBM_Filter/t/encode.t ....................................... ok
    ../lib/DBM_Filter/t/int32.t ........................................ ok
    ../lib/DBM_Filter/t/null.t ......................................... ok
    ../lib/DBM_Filter/t/utf8.t ......................................... ok
    ../lib/DirHandle.t ................................................. ok
    ../lib/English.t ................................................... ok
    ../lib/ExtUtils/t/Embed.t .......................................... ok
    ../lib/File/Basename.t ............................................. ok
    ../lib/File/Compare.t .............................................. ok
    ../lib/File/Copy.t ................................................. ok
    ../lib/File/stat-7896.t ............................................ ok
    ../lib/File/stat.t ................................................. ok
    ../lib/FileHandle.t ................................................ ok
    ../lib/FindBin.t ................................................... ok
    ../lib/Getopt/Std.t ................................................ ok
    ../lib/Internals.t ................................................. ok
    ../lib/Net/hostent.t ............................................... ok
    ../lib/Net/netent.t ................................................ skipped: no getnetbyname
    ../lib/Net/protoent.t .............................................. skipped: no netdb.h
    ../lib/Net/servent.t ............................................... skipped: no netdb.h
    ../lib/Pod/t/InputObjects.t ........................................ ok
    ../lib/Pod/t/Select.t .............................................. ok
    ../lib/Pod/t/Usage.t ............................................... ok
    ../lib/Pod/t/utils.t ............................................... ok
    ../lib/SelectSaver.t ............................................... ok
    ../lib/Symbol.t .................................................... ok
    ../lib/Thread.t .................................................... ok
    ../lib/Tie/ExtraHash.t ............................................. ok
    ../lib/Tie/Hash.t .................................................. ok
    ../lib/Tie/Scalar.t ................................................ ok
    ../lib/Tie/SubstrHash.t ............................................ ok
    ../lib/Tie/Array/push.t ............................................ ok
    ../lib/Tie/Array/splice.t .......................................... ok
    ../lib/Tie/Array/std.t ............................................. ok
    ../lib/Tie/Array/stdpush.t ......................................... ok
    ../lib/Tie/Handle/stdhandle.t ...................................... ok
    ../lib/Tie/Handle/stdhandle_from_handle.t .......................... ok
    ../lib/Time/gmtime.t ............................................... ok
    ../lib/Time/localtime.t ............................................ ok
    ../lib/Unicode/UCD.t ............................................... ok
    ../lib/User/grent.t ................................................ skipped: no getgrgid
    ../lib/User/pwent.t ................................................ skipped: no getpwuid
    ../lib/blib.t ...................................................... ok
    ../lib/bytes.t ..................................................... ok
    ../lib/charnames.t ................................................. ok
    ../lib/diagnostics.t ............................................... ok
    ../lib/dumpvar.t ................................................... ok
    ../lib/feature.t ................................................... ok
    ../lib/feature/unicode_strings.t ................................... ok
    ../lib/filetest.t .................................................. ok
    ../lib/h2ph.t ...................................................... ok
    ../lib/h2xs.t ...................................................... ok
    ../lib/integer.t ................................................... ok
    ../lib/less.t ...................................................... ok
    ../lib/locale.t .................................................... ok
    ../lib/meta_notation.t ............................................. ok
    ../lib/open.t ...................................................... ok
    ../lib/overload.t .................................................. ok
    ../lib/overload64.t ................................................ skipped: -- Perl configured with 32-bit ints
    ../lib/overloading.t ............................................... ok
    ../lib/perl5db.t ................................................... skipped: no /dev/null
    ../lib/perlbug.t ................................................... ok
    ../lib/sigtrap.t ................................................... ok
    ../lib/sort.t ...................................................... ok
    ../lib/strict.t .................................................... ok
    ../lib/subs.t ...................................................... ok
    ../lib/utf8.t ...................................................... ok
    ../lib/vars.t ...................................................... ok
    ../lib/vars_carp.t ................................................. ok
    ../lib/vmsish.t .................................................... ok
    ../lib/warnings.t .................................................. ok

    Test Summary Report
    -------------------
    ../cpan/Archive-Tar/t/09_roundtrip.t (Wstat: 0 Tests: 7 Failed: 0)
       TODO passed: 1, 4, 6
    ../cpan/ExtUtils-MakeMaker/t/basic.t (Wstat: 3840 Tests: 186 Failed: 15)
       Failed tests: 22-23, 34-36, 69, 178-186
       Non-zero exit status: 15
    ../cpan/IPC-Cmd/t/01_IPC-Cmd.t (Wstat: 2560 Tests: 459 Failed: 10)
       Failed tests: 186, 192-193, 197, 203-204, 206-207, 217-218
       Non-zero exit status: 10
    ../ext/IPC-Open3/t/IPC-Open3.t (Wstat: 0 Tests: 45 Failed: 0)
       TODO passed: 25
    Files=2468, Tests=826668, 1955 wallclock secs (99.69 usr + 7.56 sys = 107.25 CPU)
    Result: FAIL
    NMAKE : fatal error U1077: '.\perl.exe' : return code '0x19'
    Stop.

    <http://perl5.git.perl.org:8080/job/perl5-win32/ws/win32>exit> 2
    Build step 'Execute Windows batch command' marked build as failure
  • Dennis+p5p-jenkins at May 30, 2016 at 4:13 am
    See <http://perl5.git.perl.org:8080/job/perl5-win32/2443/changes>

    Changes:

    [sprout] op.c:S_my_kid: Remove obsolete comment

    ------------------------------------------
    [...truncated 6781 lines...]
    ../ext/PerlIO-encoding/t/threads.t ................................. ok
    ../ext/PerlIO-scalar/t/scalar.t .................................... ok
    ../ext/PerlIO-scalar/t/scalar_ungetc.t ............................. ok
    ../ext/PerlIO-via/t/via.t .......................................... ok
    ../ext/Pod-Functions/t/Functions.t ................................. ok
    ../ext/Pod-Html/t/anchorify.t ...................................... ok
    ../ext/Pod-Html/t/cache.t .......................................... ok
    ../ext/Pod-Html/t/crossref.t ....................................... ok
    ../ext/Pod-Html/t/crossref2.t ...................................... ok
    ../ext/Pod-Html/t/crossref3.t ...................................... ok
    ../ext/Pod-Html/t/eol.t ............................................ ok
    ../ext/Pod-Html/t/feature.t ........................................ ok
    ../ext/Pod-Html/t/feature2.t ....................................... ok
    ../ext/Pod-Html/t/htmldir1.t ....................................... ok
    ../ext/Pod-Html/t/htmldir2.t ....................................... ok
    ../ext/Pod-Html/t/htmldir3.t ....................................... ok
    ../ext/Pod-Html/t/htmldir4.t ....................................... ok
    ../ext/Pod-Html/t/htmldir5.t ....................................... ok
    ../ext/Pod-Html/t/htmlescp.t ....................................... ok
    ../ext/Pod-Html/t/htmllink.t ....................................... ok
    ../ext/Pod-Html/t/htmlview.t ....................................... ok
    ../ext/Pod-Html/t/poderr.t ......................................... ok
    ../ext/Pod-Html/t/podnoerr.t ....................................... ok
    ../ext/SDBM_File/t/constants.t ..................................... ok
    ../ext/SDBM_File/t/prep.t .......................................... ok
    ../ext/SDBM_File/t/sdbm.t .......................................... ok
    ../ext/Sys-Hostname/t/Hostname.t ................................... ok
    ../ext/Tie-Hash-NamedCapture/t/tiehash.t ........................... ok
    ../ext/Tie-Memoize/t/Tie-Memoize.t ................................. ok
    ../ext/Win32CORE/t/win32core.t ..................................... ok
    ../ext/XS-APItest/t/addissub.t ..................................... ok
    ../ext/XS-APItest/t/arrayexpr.t .................................... ok
    ../ext/XS-APItest/t/autoload.t ..................................... ok
    ../ext/XS-APItest/t/blockasexpr.t .................................. ok
    ../ext/XS-APItest/t/blockhooks-csc.t ............................... ok
    ../ext/XS-APItest/t/blockhooks.t ................................... ok
    ../ext/XS-APItest/t/call.t ......................................... ok
    ../ext/XS-APItest/t/call_checker.t ................................. ok
    ../ext/XS-APItest/t/caller.t ....................................... ok
    ../ext/XS-APItest/t/callregexec.t .................................. ok
    ../ext/XS-APItest/t/check_warnings.t ............................... ok
    ../ext/XS-APItest/t/cleanup.t ...................................... ok
    ../ext/XS-APItest/t/clone-with-stack.t ............................. ok
    ../ext/XS-APItest/t/cophh.t ........................................ ok
    ../ext/XS-APItest/t/coplabel.t ..................................... ok
    ../ext/XS-APItest/t/copstash.t ..................................... ok
    ../ext/XS-APItest/t/copyhints.t .................................... ok
    ../ext/XS-APItest/t/customop.t ..................................... ok
    ../ext/XS-APItest/t/cv_name.t ...................................... ok
    ../ext/XS-APItest/t/eval-filter.t .................................. ok
    ../ext/XS-APItest/t/exception.t .................................... ok
    ../ext/XS-APItest/t/extend.t ....................................... ok
    ../ext/XS-APItest/t/fetch_pad_names.t .............................. ok
    ../ext/XS-APItest/t/gotosub.t ...................................... ok
    ../ext/XS-APItest/t/grok.t ......................................... ok
    ../ext/XS-APItest/t/gv_autoload4.t ................................. ok
    ../ext/XS-APItest/t/gv_const_sv.t .................................. ok
    ../ext/XS-APItest/t/gv_fetchmeth.t ................................. ok
    ../ext/XS-APItest/t/gv_fetchmeth_autoload.t ........................ ok
    ../ext/XS-APItest/t/gv_fetchmethod_flags.t ......................... ok
    ../ext/XS-APItest/t/gv_init.t ...................................... ok
    ../ext/XS-APItest/t/handy.t ........................................ ok
    ../ext/XS-APItest/t/hash.t ......................................... ok
    ../ext/XS-APItest/t/join_with_space.t .............................. ok
    ../ext/XS-APItest/t/keyword_multiline.t ............................ ok
    ../ext/XS-APItest/t/keyword_plugin.t ............................... ok
    ../ext/XS-APItest/t/labelconst.t ................................... ok
    ../ext/XS-APItest/t/lexsub.t ....................................... ok
    ../ext/XS-APItest/t/load-module.t .................................. ok
    ../ext/XS-APItest/t/locale.t ....................................... ok
    ../ext/XS-APItest/t/loopblock.t .................................... ok
    ../ext/XS-APItest/t/looprest.t ..................................... ok
    ../ext/XS-APItest/t/lvalue.t ....................................... ok
    ../ext/XS-APItest/t/magic.t ........................................ ok
    ../ext/XS-APItest/t/magic_chain.t .................................. ok
    ../ext/XS-APItest/t/mro.t .......................................... ok
    ../ext/XS-APItest/t/multicall.t .................................... ok
    ../ext/XS-APItest/t/my_cxt.t ....................................... ok
    ../ext/XS-APItest/t/my_exit.t ...................................... ok
    ../ext/XS-APItest/t/newCONSTSUB.t .................................. ok
    ../ext/XS-APItest/t/newDEFSVOP.t ................................... ok
    ../ext/XS-APItest/t/op.t ........................................... ok
    ../ext/XS-APItest/t/op_contextualize.t ............................. ok
    ../ext/XS-APItest/t/op_list.t ...................................... ok
    ../ext/XS-APItest/t/overload.t ..................................... ok
    ../ext/XS-APItest/t/pad_scalar.t ................................... ok
    ../ext/XS-APItest/t/peep.t ......................................... ok
    ../ext/XS-APItest/t/pmflag.t ....................................... ok
    ../ext/XS-APItest/t/postinc.t ...................................... ok
    ../ext/XS-APItest/t/printf.t ....................................... ok
    ../ext/XS-APItest/t/ptr_table.t .................................... ok
    ../ext/XS-APItest/t/push.t ......................................... ok
    ../ext/XS-APItest/t/refs.t ......................................... ok
    ../ext/XS-APItest/t/rmagical.t ..................................... ok
    ../ext/XS-APItest/t/rv2cv_op_cv.t .................................. ok
    ../ext/XS-APItest/t/savehints.t .................................... ok
    ../ext/XS-APItest/t/scopelessblock.t ............................... ok
    ../ext/XS-APItest/t/sort.t ......................................... ok
    ../ext/XS-APItest/t/stmtasexpr.t ................................... ok
    ../ext/XS-APItest/t/stmtsasexpr.t .................................. ok
    ../ext/XS-APItest/t/stuff_modify_bug.t ............................. ok
    ../ext/XS-APItest/t/stuff_svcur_bug.t .............................. ok
    ../ext/XS-APItest/t/subcall.t ...................................... ok
    ../ext/XS-APItest/t/svcat.t ........................................ ok
    ../ext/XS-APItest/t/svcatpvf.t ..................................... ok
    ../ext/XS-APItest/t/sviscow.t ...................................... ok
    ../ext/XS-APItest/t/svpeek.t ....................................... ok
    ../ext/XS-APItest/t/svpv.t ......................................... ok
    ../ext/XS-APItest/t/svpv_magic.t ................................... ok
    ../ext/XS-APItest/t/svsetsv.t ...................................... ok
    ../ext/XS-APItest/t/swaplabel.t .................................... ok
    ../ext/XS-APItest/t/swaptwostmts.t ................................. ok
    ../ext/XS-APItest/t/sym-hook.t ..................................... ok
    ../ext/XS-APItest/t/synthetic_scope.t .............................. ok
    ../ext/XS-APItest/t/temp_lv_sub.t .................................. ok
    ../ext/XS-APItest/t/underscore_length.t ............................ ok
    ../ext/XS-APItest/t/utf16_to_utf8.t ................................ ok
    ../ext/XS-APItest/t/utf8.t ......................................... ok
    ../ext/XS-APItest/t/weaken.t ....................................... ok
    ../ext/XS-APItest/t/whichsig.t ..................................... ok
    ../ext/XS-APItest/t/win32.t ........................................ ok
    ../ext/XS-APItest/t/xs_special_subs.t .............................. ok
    ../ext/XS-APItest/t/xs_special_subs_require.t ...................... ok
    ../ext/XS-APItest/t/xsub_h.t ....................................... ok
    ../ext/XS-Typemap/t/Typemap.t ...................................... ok
    ../ext/arybase/t/aeach.t ........................................... ok
    ../ext/arybase/t/aelem.t ........................................... ok
    ../ext/arybase/t/akeys.t ........................................... ok
    ../ext/arybase/t/arybase.t ......................................... ok
    ../ext/arybase/t/aslice.t .......................................... ok
    ../ext/arybase/t/av2arylen.t ....................................... ok
    ../ext/arybase/t/index.t ........................................... ok
    ../ext/arybase/t/lslice.t .......................................... ok
    ../ext/arybase/t/pos.t ............................................. ok
    ../ext/arybase/t/scope.t ........................................... ok
    ../ext/arybase/t/splice.t .......................................... ok
    ../ext/arybase/t/substr.t .......................................... ok
    ../ext/re/t/lexical_debug.t ........................................ ok
    ../ext/re/t/qr.t ................................................... ok
    ../ext/re/t/re.t ................................................... ok
    ../ext/re/t/re_funcs.t ............................................. ok
    ../ext/re/t/re_funcs_u.t ........................................... ok
    ../ext/re/t/reflags.t .............................................. ok
    ../ext/re/t/regop.t ................................................ ok
    ../ext/re/t/strict.t ............................................... ok
    ../lib/AnyDBM_File.t ............................................... ok
    ../lib/B/Deparse-core.t ............................................ ok
    ../lib/B/Deparse-subclass.t ........................................ ok
    ../lib/B/Deparse.t ................................................. ok
    ../lib/Benchmark.t ................................................. ok
    ../lib/Class/Struct.t .............................................. ok
    ../lib/Config.t .................................................... ok
    ../lib/Config/Extensions.t ......................................... ok
    ../lib/DB.t ........................................................ ok
    ../lib/DBM_Filter/t/01error.t ...................................... ok
    ../lib/DBM_Filter/t/02core.t ....................................... ok
    ../lib/DBM_Filter/t/compress.t ..................................... ok
    ../lib/DBM_Filter/t/encode.t ....................................... ok
    ../lib/DBM_Filter/t/int32.t ........................................ ok
    ../lib/DBM_Filter/t/null.t ......................................... ok
    ../lib/DBM_Filter/t/utf8.t ......................................... ok
    ../lib/DirHandle.t ................................................. ok
    ../lib/English.t ................................................... ok
    ../lib/ExtUtils/t/Embed.t .......................................... ok
    ../lib/File/Basename.t ............................................. ok
    ../lib/File/Compare.t .............................................. ok
    ../lib/File/Copy.t ................................................. ok
    ../lib/File/stat-7896.t ............................................ ok
    ../lib/File/stat.t ................................................. ok
    ../lib/FileHandle.t ................................................ ok
    ../lib/FindBin.t ................................................... ok
    ../lib/Getopt/Std.t ................................................ ok
    ../lib/Internals.t ................................................. ok
    ../lib/Net/hostent.t ............................................... ok
    ../lib/Net/netent.t ................................................ skipped: no getnetbyname
    ../lib/Net/protoent.t .............................................. skipped: no netdb.h
    ../lib/Net/servent.t ............................................... skipped: no netdb.h
    ../lib/Pod/t/InputObjects.t ........................................ ok
    ../lib/Pod/t/Select.t .............................................. ok
    ../lib/Pod/t/Usage.t ............................................... ok
    ../lib/Pod/t/utils.t ............................................... ok
    ../lib/SelectSaver.t ............................................... ok
    ../lib/Symbol.t .................................................... ok
    ../lib/Thread.t .................................................... ok
    ../lib/Tie/ExtraHash.t ............................................. ok
    ../lib/Tie/Hash.t .................................................. ok
    ../lib/Tie/Scalar.t ................................................ ok
    ../lib/Tie/SubstrHash.t ............................................ ok
    ../lib/Tie/Array/push.t ............................................ ok
    ../lib/Tie/Array/splice.t .......................................... ok
    ../lib/Tie/Array/std.t ............................................. ok
    ../lib/Tie/Array/stdpush.t ......................................... ok
    ../lib/Tie/Handle/stdhandle.t ...................................... ok
    ../lib/Tie/Handle/stdhandle_from_handle.t .......................... ok
    ../lib/Time/gmtime.t ............................................... ok
    ../lib/Time/localtime.t ............................................ ok
    ../lib/Unicode/UCD.t ............................................... ok
    ../lib/User/grent.t ................................................ skipped: no getgrgid
    ../lib/User/pwent.t ................................................ skipped: no getpwuid
    ../lib/blib.t ...................................................... ok
    ../lib/bytes.t ..................................................... ok
    ../lib/charnames.t ................................................. ok
    ../lib/diagnostics.t ............................................... ok
    ../lib/dumpvar.t ................................................... ok
    ../lib/feature.t ................................................... ok
    ../lib/feature/unicode_strings.t ................................... ok
    ../lib/filetest.t .................................................. ok
    ../lib/h2ph.t ...................................................... ok
    ../lib/h2xs.t ...................................................... ok
    ../lib/integer.t ................................................... ok
    ../lib/less.t ...................................................... ok
    ../lib/locale.t .................................................... ok
    ../lib/meta_notation.t ............................................. ok
    ../lib/open.t ...................................................... ok
    ../lib/overload.t .................................................. ok
    ../lib/overload64.t ................................................ skipped: -- Perl configured with 32-bit ints
    ../lib/overloading.t ............................................... ok
    ../lib/perl5db.t ................................................... skipped: no /dev/null
    ../lib/perlbug.t ................................................... ok
    ../lib/sigtrap.t ................................................... ok
    ../lib/sort.t ...................................................... ok
    ../lib/strict.t .................................................... ok
    ../lib/subs.t ...................................................... ok
    ../lib/utf8.t ...................................................... ok
    ../lib/vars.t ...................................................... ok
    ../lib/vars_carp.t ................................................. ok
    ../lib/vmsish.t .................................................... ok
    ../lib/warnings.t .................................................. ok

    Test Summary Report
    -------------------
    ../cpan/Archive-Tar/t/09_roundtrip.t (Wstat: 0 Tests: 7 Failed: 0)
       TODO passed: 1, 4, 6
    ../cpan/ExtUtils-MakeMaker/t/basic.t (Wstat: 3840 Tests: 186 Failed: 15)
       Failed tests: 22-23, 34-36, 69, 178-186
       Non-zero exit status: 15
    ../cpan/IPC-Cmd/t/01_IPC-Cmd.t (Wstat: 5120 Tests: 459 Failed: 20)
       Failed tests: 30-31, 41-43, 49-50, 54, 60-61, 98, 104-105
                     109, 115-116, 118-119, 129-130
       Non-zero exit status: 20
    ../ext/IPC-Open3/t/IPC-Open3.t (Wstat: 0 Tests: 45 Failed: 0)
       TODO passed: 25
    Files=2468, Tests=826535, 1977 wallclock secs (98.23 usr + 6.45 sys = 104.69 CPU)
    Result: FAIL
    NMAKE : fatal error U1077: '.\perl.exe' : return code '0x23'
    Stop.

    <http://perl5.git.perl.org:8080/job/perl5-win32/ws/win32>exit> 2
    Build step 'Execute Windows batch command' marked build as failure
  • Dennis+p5p-jenkins at May 30, 2016 at 3:51 pm
    See <http://perl5.git.perl.org:8080/job/perl5-win32/2444/changes>

    Changes:

    [jkeenan] Update Test-Simple in blead

    ------------------------------------------
    [...truncated 6792 lines...]
    ../ext/PerlIO-encoding/t/nolooping.t ............................... ok
    ../ext/PerlIO-encoding/t/threads.t ................................. ok
    ../ext/PerlIO-scalar/t/scalar.t .................................... ok
    ../ext/PerlIO-scalar/t/scalar_ungetc.t ............................. ok
    ../ext/PerlIO-via/t/via.t .......................................... ok
    ../ext/Pod-Functions/t/Functions.t ................................. ok
    ../ext/Pod-Html/t/anchorify.t ...................................... ok
    ../ext/Pod-Html/t/cache.t .......................................... ok
    ../ext/Pod-Html/t/crossref.t ....................................... ok
    ../ext/Pod-Html/t/crossref2.t ...................................... ok
    ../ext/Pod-Html/t/crossref3.t ...................................... ok
    ../ext/Pod-Html/t/eol.t ............................................ ok
    ../ext/Pod-Html/t/feature.t ........................................ ok
    ../ext/Pod-Html/t/feature2.t ....................................... ok
    ../ext/Pod-Html/t/htmldir1.t ....................................... ok
    ../ext/Pod-Html/t/htmldir2.t ....................................... ok
    ../ext/Pod-Html/t/htmldir3.t ....................................... ok
    ../ext/Pod-Html/t/htmldir4.t ....................................... ok
    ../ext/Pod-Html/t/htmldir5.t ....................................... ok
    ../ext/Pod-Html/t/htmlescp.t ....................................... ok
    ../ext/Pod-Html/t/htmllink.t ....................................... ok
    ../ext/Pod-Html/t/htmlview.t ....................................... ok
    ../ext/Pod-Html/t/poderr.t ......................................... ok
    ../ext/Pod-Html/t/podnoerr.t ....................................... ok
    ../ext/SDBM_File/t/constants.t ..................................... ok
    ../ext/SDBM_File/t/prep.t .......................................... ok
    ../ext/SDBM_File/t/sdbm.t .......................................... ok
    ../ext/Sys-Hostname/t/Hostname.t ................................... ok
    ../ext/Tie-Hash-NamedCapture/t/tiehash.t ........................... ok
    ../ext/Tie-Memoize/t/Tie-Memoize.t ................................. ok
    ../ext/Win32CORE/t/win32core.t ..................................... ok
    ../ext/XS-APItest/t/addissub.t ..................................... ok
    ../ext/XS-APItest/t/arrayexpr.t .................................... ok
    ../ext/XS-APItest/t/autoload.t ..................................... ok
    ../ext/XS-APItest/t/blockasexpr.t .................................. ok
    ../ext/XS-APItest/t/blockhooks-csc.t ............................... ok
    ../ext/XS-APItest/t/blockhooks.t ................................... ok
    ../ext/XS-APItest/t/call.t ......................................... ok
    ../ext/XS-APItest/t/call_checker.t ................................. ok
    ../ext/XS-APItest/t/caller.t ....................................... ok
    ../ext/XS-APItest/t/callregexec.t .................................. ok
    ../ext/XS-APItest/t/check_warnings.t ............................... ok
    ../ext/XS-APItest/t/cleanup.t ...................................... ok
    ../ext/XS-APItest/t/clone-with-stack.t ............................. ok
    ../ext/XS-APItest/t/cophh.t ........................................ ok
    ../ext/XS-APItest/t/coplabel.t ..................................... ok
    ../ext/XS-APItest/t/copstash.t ..................................... ok
    ../ext/XS-APItest/t/copyhints.t .................................... ok
    ../ext/XS-APItest/t/customop.t ..................................... ok
    ../ext/XS-APItest/t/cv_name.t ...................................... ok
    ../ext/XS-APItest/t/eval-filter.t .................................. ok
    ../ext/XS-APItest/t/exception.t .................................... ok
    ../ext/XS-APItest/t/extend.t ....................................... ok
    ../ext/XS-APItest/t/fetch_pad_names.t .............................. ok
    ../ext/XS-APItest/t/gotosub.t ...................................... ok
    ../ext/XS-APItest/t/grok.t ......................................... ok
    ../ext/XS-APItest/t/gv_autoload4.t ................................. ok
    ../ext/XS-APItest/t/gv_const_sv.t .................................. ok
    ../ext/XS-APItest/t/gv_fetchmeth.t ................................. ok
    ../ext/XS-APItest/t/gv_fetchmeth_autoload.t ........................ ok
    ../ext/XS-APItest/t/gv_fetchmethod_flags.t ......................... ok
    ../ext/XS-APItest/t/gv_init.t ...................................... ok
    ../ext/XS-APItest/t/handy.t ........................................ ok
    ../ext/XS-APItest/t/hash.t ......................................... ok
    ../ext/XS-APItest/t/join_with_space.t .............................. ok
    ../ext/XS-APItest/t/keyword_multiline.t ............................ ok
    ../ext/XS-APItest/t/keyword_plugin.t ............................... ok
    ../ext/XS-APItest/t/labelconst.t ................................... ok
    ../ext/XS-APItest/t/lexsub.t ....................................... ok
    ../ext/XS-APItest/t/load-module.t .................................. ok
    ../ext/XS-APItest/t/locale.t ....................................... ok
    ../ext/XS-APItest/t/loopblock.t .................................... ok
    ../ext/XS-APItest/t/looprest.t ..................................... ok
    ../ext/XS-APItest/t/lvalue.t ....................................... ok
    ../ext/XS-APItest/t/magic.t ........................................ ok
    ../ext/XS-APItest/t/magic_chain.t .................................. ok
    ../ext/XS-APItest/t/mro.t .......................................... ok
    ../ext/XS-APItest/t/multicall.t .................................... ok
    ../ext/XS-APItest/t/my_cxt.t ....................................... ok
    ../ext/XS-APItest/t/my_exit.t ...................................... ok
    ../ext/XS-APItest/t/newCONSTSUB.t .................................. ok
    ../ext/XS-APItest/t/newDEFSVOP.t ................................... ok
    ../ext/XS-APItest/t/op.t ........................................... ok
    ../ext/XS-APItest/t/op_contextualize.t ............................. ok
    ../ext/XS-APItest/t/op_list.t ...................................... ok
    ../ext/XS-APItest/t/overload.t ..................................... ok
    ../ext/XS-APItest/t/pad_scalar.t ................................... ok
    ../ext/XS-APItest/t/peep.t ......................................... ok
    ../ext/XS-APItest/t/pmflag.t ....................................... ok
    ../ext/XS-APItest/t/postinc.t ...................................... ok
    ../ext/XS-APItest/t/printf.t ....................................... ok
    ../ext/XS-APItest/t/ptr_table.t .................................... ok
    ../ext/XS-APItest/t/push.t ......................................... ok
    ../ext/XS-APItest/t/refs.t ......................................... ok
    ../ext/XS-APItest/t/rmagical.t ..................................... ok
    ../ext/XS-APItest/t/rv2cv_op_cv.t .................................. ok
    ../ext/XS-APItest/t/savehints.t .................................... ok
    ../ext/XS-APItest/t/scopelessblock.t ............................... ok
    ../ext/XS-APItest/t/sort.t ......................................... ok
    ../ext/XS-APItest/t/stmtasexpr.t ................................... ok
    ../ext/XS-APItest/t/stmtsasexpr.t .................................. ok
    ../ext/XS-APItest/t/stuff_modify_bug.t ............................. ok
    ../ext/XS-APItest/t/stuff_svcur_bug.t .............................. ok
    ../ext/XS-APItest/t/subcall.t ...................................... ok
    ../ext/XS-APItest/t/svcat.t ........................................ ok
    ../ext/XS-APItest/t/svcatpvf.t ..................................... ok
    ../ext/XS-APItest/t/sviscow.t ...................................... ok
    ../ext/XS-APItest/t/svpeek.t ....................................... ok
    ../ext/XS-APItest/t/svpv.t ......................................... ok
    ../ext/XS-APItest/t/svpv_magic.t ................................... ok
    ../ext/XS-APItest/t/svsetsv.t ...................................... ok
    ../ext/XS-APItest/t/swaplabel.t .................................... ok
    ../ext/XS-APItest/t/swaptwostmts.t ................................. ok
    ../ext/XS-APItest/t/sym-hook.t ..................................... ok
    ../ext/XS-APItest/t/synthetic_scope.t .............................. ok
    ../ext/XS-APItest/t/temp_lv_sub.t .................................. ok
    ../ext/XS-APItest/t/underscore_length.t ............................ ok
    ../ext/XS-APItest/t/utf16_to_utf8.t ................................ ok
    ../ext/XS-APItest/t/utf8.t ......................................... ok
    ../ext/XS-APItest/t/weaken.t ....................................... ok
    ../ext/XS-APItest/t/whichsig.t ..................................... ok
    ../ext/XS-APItest/t/win32.t ........................................ ok
    ../ext/XS-APItest/t/xs_special_subs.t .............................. ok
    ../ext/XS-APItest/t/xs_special_subs_require.t ...................... ok
    ../ext/XS-APItest/t/xsub_h.t ....................................... ok
    ../ext/XS-Typemap/t/Typemap.t ...................................... ok
    ../ext/arybase/t/aeach.t ........................................... ok
    ../ext/arybase/t/aelem.t ........................................... ok
    ../ext/arybase/t/akeys.t ........................................... ok
    ../ext/arybase/t/arybase.t ......................................... ok
    ../ext/arybase/t/aslice.t .......................................... ok
    ../ext/arybase/t/av2arylen.t ....................................... ok
    ../ext/arybase/t/index.t ........................................... ok
    ../ext/arybase/t/lslice.t .......................................... ok
    ../ext/arybase/t/pos.t ............................................. ok
    ../ext/arybase/t/scope.t ........................................... ok
    ../ext/arybase/t/splice.t .......................................... ok
    ../ext/arybase/t/substr.t .......................................... ok
    ../ext/re/t/lexical_debug.t ........................................ ok
    ../ext/re/t/qr.t ................................................... ok
    ../ext/re/t/re.t ................................................... ok
    ../ext/re/t/re_funcs.t ............................................. ok
    ../ext/re/t/re_funcs_u.t ........................................... ok
    ../ext/re/t/reflags.t .............................................. ok
    ../ext/re/t/regop.t ................................................ ok
    ../ext/re/t/strict.t ............................................... ok
    ../lib/AnyDBM_File.t ............................................... ok
    ../lib/B/Deparse-core.t ............................................ ok
    ../lib/B/Deparse-subclass.t ........................................ ok
    ../lib/B/Deparse.t ................................................. ok
    ../lib/Benchmark.t ................................................. ok
    ../lib/Class/Struct.t .............................................. ok
    ../lib/Config.t .................................................... ok
    ../lib/Config/Extensions.t ......................................... ok
    ../lib/DB.t ........................................................ ok
    ../lib/DBM_Filter/t/01error.t ...................................... ok
    ../lib/DBM_Filter/t/02core.t ....................................... ok
    ../lib/DBM_Filter/t/compress.t ..................................... ok
    ../lib/DBM_Filter/t/encode.t ....................................... ok
    ../lib/DBM_Filter/t/int32.t ........................................ ok
    ../lib/DBM_Filter/t/null.t ......................................... ok
    ../lib/DBM_Filter/t/utf8.t ......................................... ok
    ../lib/DirHandle.t ................................................. ok
    ../lib/English.t ................................................... ok
    ../lib/ExtUtils/t/Embed.t .......................................... ok
    ../lib/File/Basename.t ............................................. ok
    ../lib/File/Compare.t .............................................. ok
    ../lib/File/Copy.t ................................................. ok
    ../lib/File/stat-7896.t ............................................ ok
    ../lib/File/stat.t ................................................. ok
    ../lib/FileHandle.t ................................................ ok
    ../lib/FindBin.t ................................................... ok
    ../lib/Getopt/Std.t ................................................ ok
    ../lib/Internals.t ................................................. ok
    ../lib/Net/hostent.t ............................................... ok
    ../lib/Net/netent.t ................................................ skipped: no getnetbyname
    ../lib/Net/protoent.t .............................................. skipped: no netdb.h
    ../lib/Net/servent.t ............................................... skipped: no netdb.h
    ../lib/Pod/t/InputObjects.t ........................................ ok
    ../lib/Pod/t/Select.t .............................................. ok
    ../lib/Pod/t/Usage.t ............................................... ok
    ../lib/Pod/t/utils.t ............................................... ok
    ../lib/SelectSaver.t ............................................... ok
    ../lib/Symbol.t .................................................... ok
    ../lib/Thread.t .................................................... ok
    ../lib/Tie/ExtraHash.t ............................................. ok
    ../lib/Tie/Hash.t .................................................. ok
    ../lib/Tie/Scalar.t ................................................ ok
    ../lib/Tie/SubstrHash.t ............................................ ok
    ../lib/Tie/Array/push.t ............................................ ok
    ../lib/Tie/Array/splice.t .......................................... ok
    ../lib/Tie/Array/std.t ............................................. ok
    ../lib/Tie/Array/stdpush.t ......................................... ok
    ../lib/Tie/Handle/stdhandle.t ...................................... ok
    ../lib/Tie/Handle/stdhandle_from_handle.t .......................... ok
    ../lib/Time/gmtime.t ............................................... ok
    ../lib/Time/localtime.t ............................................ ok
    ../lib/Unicode/UCD.t ............................................... ok
    ../lib/User/grent.t ................................................ skipped: no getgrgid
    ../lib/User/pwent.t ................................................ skipped: no getpwuid
    ../lib/blib.t ...................................................... ok
    ../lib/bytes.t ..................................................... ok
    ../lib/charnames.t ................................................. ok
    ../lib/diagnostics.t ............................................... ok
    ../lib/dumpvar.t ................................................... ok
    ../lib/feature.t ................................................... ok
    ../lib/feature/unicode_strings.t ................................... ok
    ../lib/filetest.t .................................................. ok
    ../lib/h2ph.t ...................................................... ok
    ../lib/h2xs.t ...................................................... ok
    ../lib/integer.t ................................................... ok
    ../lib/less.t ...................................................... ok
    ../lib/locale.t .................................................... ok
    ../lib/meta_notation.t ............................................. ok
    ../lib/open.t ...................................................... ok
    ../lib/overload.t .................................................. ok
    ../lib/overload64.t ................................................ skipped: -- Perl configured with 32-bit ints
    ../lib/overloading.t ............................................... ok
    ../lib/perl5db.t ................................................... skipped: no /dev/null
    ../lib/perlbug.t ................................................... ok
    ../lib/sigtrap.t ................................................... ok
    ../lib/sort.t ...................................................... ok
    ../lib/strict.t .................................................... ok
    ../lib/subs.t ...................................................... ok
    ../lib/utf8.t ...................................................... ok
    ../lib/vars.t ...................................................... ok
    ../lib/vars_carp.t ................................................. ok
    ../lib/vmsish.t .................................................... ok
    ../lib/warnings.t .................................................. ok

    Test Summary Report
    -------------------
    ../cpan/Archive-Tar/t/09_roundtrip.t (Wstat: 0 Tests: 7 Failed: 0)
       TODO passed: 1, 4, 6
    ../cpan/ExtUtils-MakeMaker/t/basic.t (Wstat: 5888 Tests: 186 Failed: 23)
       Failed tests: 22-23, 34-36, 42-49, 69, 178-186
       Non-zero exit status: 23
    ../cpan/IPC-Cmd/t/01_IPC-Cmd.t (Wstat: 2560 Tests: 459 Failed: 10)
       Failed tests: 52-53, 63-65, 71-72, 76, 82-83
       Non-zero exit status: 10
    ../ext/IPC-Open3/t/IPC-Open3.t (Wstat: 0 Tests: 45 Failed: 0)
       TODO passed: 25
    Files=2469, Tests=826564, 1909 wallclock secs (92.97 usr + 7.11 sys = 100.08 CPU)
    Result: FAIL
    NMAKE : fatal error U1077: '.\perl.exe' : return code '0x21'
    Stop.

    <http://perl5.git.perl.org:8080/job/perl5-win32/ws/win32>exit> 2
    Build step 'Execute Windows batch command' marked build as failure
  • Dave Mitchell at May 30, 2016 at 7:26 pm

    On Mon, May 30, 2016 at 05:51:12PM +0200, dennis+p5p-jenkins@kaarsemaker.net wrote:
    See <http://perl5.git.perl.org:8080/job/perl5-win32/2444/changes>

    ../cpan/ExtUtils-MakeMaker/t/basic.t (Wstat: 5888 Tests: 186 Failed: 23)
    Failed tests: 22-23, 34-36, 42-49, 69, 178-186

    Since v5.25.1-52-gf68c540v5.25.1-52-gf68c540,
    "Update ExtUtils-MakeMaker to CPAN version 7.18",

    this test has been failing on win32 on both smokes and Jenkins.
    The failures seem to vary: I've seen the following permutations in smokes:

         22-23, 34-36, 42-58, 69, 178-186
         22-23, 34-36, 42-49, 69, 178-186
         22-23, 34-36, 69, 178-186

    Anyone have any ideas?


    --
    A walk of a thousand miles begins with a single step...
    then continues for another 1,999,999 or so.
  • Craig A. Berry at May 31, 2016 at 5:40 pm

    On Mon, May 30, 2016 at 2:21 PM, Dave Mitchell wrote:
    On Mon, May 30, 2016 at 05:51:12PM +0200, dennis+p5p-jenkins@kaarsemaker.net wrote:
    See <http://perl5.git.perl.org:8080/job/perl5-win32/2444/changes>

    ../cpan/ExtUtils-MakeMaker/t/basic.t (Wstat: 5888 Tests: 186 Failed: 23)
    Failed tests: 22-23, 34-36, 42-49, 69, 178-186

    Since v5.25.1-52-gf68c540v5.25.1-52-gf68c540,
    "Update ExtUtils-MakeMaker to CPAN version 7.18",

    this test has been failing on win32 on both smokes and Jenkins.
    The failures seem to vary: I've seen the following permutations in smokes:

    22-23, 34-36, 42-58, 69, 178-186
    22-23, 34-36, 42-49, 69, 178-186
    22-23, 34-36, 69, 178-186

    Anyone have any ideas?
    On my laptop from $work, which is Windows 7 with Visual Studio 2012, I
    see the following. Basically it ends up running an installed Perl
    (from c:\perl64) but the libraries it's getting are from the blead
    checkout (c:\perlgit). I'm not that familiar with pl2bat.bat or why
    EUMM is using it (or why it picks up the installed one), but I'll try
    to look into it at some point.

    ../cpan/ExtUtils-MakeMaker/t/basic.t ............................... 10/186
    ../cpan/ExtUtils-MakeMaker/t/basic.t ...............................
    22/186 # Failed test 'make test'
    # at t/basic.t line 144.
    # '
    # Microsoft (R) Program Maintenance Utility Version 11.00.50727.1
    # Copyright (C) Microsoft Corporation. All rights reserved.
    #
    # cp lib/Big/Dummy.pm blib\lib\Big\Dummy.pm
    # nmake -f Makefile all -nologo LIBPERL_A="libperl.lib"
    LINKTYPE="dynamic" PREFIX="../dummy-install" PASTHRU_DEFINE=" "
    PASTHRU_INC=" "
    # cp lib/Big/Liar.pm ..\blib\lib\Big\Liar.pm
    # cd ..
    # "C:\perlgit\t\perl.exe" -MExtUtils::Command -e cp --
    bin/program blib\script\program
    # pl2bat.bat blib\script\program
    # C:\Perl64\bin\pl2bat.bat: Perl lib version (5.25.2) doesn't match
    executable 'C:\Perl64\bin\perl.exe' version (5.20.2) at
    C:\perlgit\lib/Config.pm line 62.
    # Compilation failed in require at C:\Perl64\bin\pl2bat.bat line 20.
    # BEGIN failed--compilation aborted at C:\Perl64\bin\pl2bat.bat line 20.
    # NMAKE : fatal error U1077: 'C:\Perl64\bin\pl2bat.bat' : return code '0x1'
    # Stop.
    # '
    # doesn't match '(?^:All tests successful)'

    # Failed test ' exited normally'
    # at t/basic.t line 145.
    # got: '512'
    # expected: '0'
    #
    # Microsoft (R) Program Maintenance Utility Version 11.00.50727.1
    # Copyright (C) Microsoft Corporation. All rights reserved.
    #
    # cp lib/Big/Dummy.pm blib\lib\Big\Dummy.pm
    # nmake -f Makefile all -nologo LIBPERL_A="libperl.lib"
    LINKTYPE="dynamic" PREFIX="../dummy-install" PASTHRU_DEFINE=" " PASTHR
    U_INC=" "
    # cp lib/Big/Liar.pm ..\blib\lib\Big\Liar.pm
    # cd ..
    # "C:\perlgit\t\perl.exe" -MExtUtils::Command -e cp --
    bin/program blib\script\program
    # pl2bat.bat blib\script\program
    # C:\Perl64\bin\pl2bat.bat: Perl lib version (5.25.2) doesn't match
    executable 'C:\Perl64\bin\perl.exe' version (5.20.2) at C:\perlg
    it\lib/Config.pm line 62.
    # Compilation failed in require at C:\Perl64\bin\pl2bat.bat line 20.
    # BEGIN failed--compilation aborted at C:\Perl64\bin\pl2bat.bat line 20.
    # NMAKE : fatal error U1077: 'C:\Perl64\bin\pl2bat.bat' : return code '0x1'
    # Stop.
    ../cpan/ExtUtils-MakeMaker/t/basic.t ............................... 29/186
    ../cpan/ExtUtils-MakeMaker/t/basic.t ...............................
    34/186 # Failed test 'install'
    # at t/basic.t line 184.
    # got: '512'
    # expected: '0'
    #
    # Microsoft (R) Program Maintenance Utility Version 11.00.50727.1
    <snip>
  • Craig A. Berry at May 31, 2016 at 6:28 pm

    On Tue, May 31, 2016 at 12:40 PM, Craig A. Berry wrote:

    # pl2bat.bat blib\script\program
    # C:\Perl64\bin\pl2bat.bat: Perl lib version (5.25.2) doesn't match
    executable 'C:\Perl64\bin\perl.exe' version (5.20.2) at
    C:\perlgit\lib/Config.pm line 62.
    # Compilation failed in require at C:\Perl64\bin\pl2bat.bat line 20.
    # BEGIN failed--compilation aborted at C:\Perl64\bin\pl2bat.bat line 20.
    The FIXIN macro in EUMM, when PERL_CORE is not set, just runs the
    installed pl2bat.bat. See:

    <https://github.com/Perl-Toolchain-Gang/ExtUtils-MakeMaker/blob/2df481c3227628992c5ad92a2ecb7d7ddb0a090a/lib/ExtUtils/MM_Win32.pm#L145>

    This recent commit:

    <https://github.com/Perl-Toolchain-Gang/ExtUtils-MakeMaker/commit/4bd05555380a30ea7e532bbe8884607b874c420e>

    deletes PERL_CORE from the environment in basic.t. I have no idea why
    and the commit message doesn't say. But I think that's the
    explanation for why it's running the installed pl2bat.bat in my case,
    and probably fails differently if there is no pl2bat.bat in the path
    (e.g., there is no installed Perl).
  • Craig A. Berry at May 31, 2016 at 9:47 pm

    On Tue, May 31, 2016 at 1:28 PM, Craig A. Berry wrote:
    On Tue, May 31, 2016 at 12:40 PM, Craig A. Berry
    wrote:
    # pl2bat.bat blib\script\program
    # C:\Perl64\bin\pl2bat.bat: Perl lib version (5.25.2) doesn't match
    executable 'C:\Perl64\bin\perl.exe' version (5.20.2) at
    C:\perlgit\lib/Config.pm line 62.
    # Compilation failed in require at C:\Perl64\bin\pl2bat.bat line 20.
    # BEGIN failed--compilation aborted at C:\Perl64\bin\pl2bat.bat line 20.
    The FIXIN macro in EUMM, when PERL_CORE is not set, just runs the
    installed pl2bat.bat. See:

    <https://github.com/Perl-Toolchain-Gang/ExtUtils-MakeMaker/blob/2df481c3227628992c5ad92a2ecb7d7ddb0a090a/lib/ExtUtils/MM_Win32.pm#L145>

    This recent commit:

    <https://github.com/Perl-Toolchain-Gang/ExtUtils-MakeMaker/commit/4bd05555380a30ea7e532bbe8884607b874c420e>

    deletes PERL_CORE from the environment in basic.t. I have no idea why
    and the commit message doesn't say. But I think that's the
    explanation for why it's running the installed pl2bat.bat in my case,
    and probably fails differently if there is no pl2bat.bat in the path
    (e.g., there is no installed Perl).
    The problem behind this problem is that when PERL_CORE is set, running
    Makefile.PL does not generate the metafile section of the Makefile.
    That happened last September:

    <https://github.com/Perl-Toolchain-Gang/ExtUtils-MakeMaker/commit/f91b5144ee197e0c875e927e5b2603d65d0797d1>

       I'm guessing there was a desire to test metafile and other things
    depending on it (e.g., disttest) even when running in core, thus the
    deletion of PERL_CORE in some tests more recently. It looks like that
    only causes trouble on Windows because of the FIXIN problem cited
    earlier.

    Not sure what to suggest. It's two different meanings of PERL_CORE
    colliding: 1.) "do things differently when using MakeMaker to build
    the core" and 2.) "do things differently when running MakeMaker's own
    tests in the core."

Related Discussions

Discussion Navigation
viewthread | post
Discussion Overview
groupperl5-porters @
categoriesperl
postedMay 27, '16 at 7:28p
activeMay 31, '16 at 9:47p
posts9
users3
websiteperl.org

People

Translate

site design / logo © 2018 Grokbase