FAQ

On Wed 28 Jul 2004 06:38, "H.Merijn Brand" wrote:
Automated smoke report for 5.9.2 patch 23161
pc03: x86 Family 15 Model 1 Stepping 2, GenuineIntel (x86/1 cpu)
on cygwin_nt-5.0 - 1.5.10(0.116/4/2)
using gcc version 3.3.1 (cygming special)
smoketime 8 hours 12 minutes (average 1 hour 1 minute)

Summary: FAIL(F)
To all reading smoke results: this smoke finished because I manually untied
the %hash1's in ext/DB_File/t/db-hash.t as discussed on perl5-porters
O = OK F = Failure(s), extended report at the bottom
X = Failure(s) under TEST but not under harness
? = still running or test results not (yet) available
Build failures during: - = unknown or N/A
c = Configure, m = make, M = make (after miniperl), t = make test-prep

23161 Configuration (common) none
----------- ---------------------------------------------------------
F F F F
F F F F -Duse64bitint
F F F F -Duseithreads
F F F F -Duseithreads -Duse64bitint
+----- PERLIO = perlio -DDEBUGGING
+------- PERLIO = stdio -DDEBUGGING
+--------- PERLIO = perlio
+----------- PERLIO = stdio


Failures:
[stdio]
[stdio] -DDEBUGGING
[stdio] -Duse64bitint
[stdio] -DDEBUGGING -Duse64bitint
../ext/B/t/optree_specials.t............FAILED 2 6
../ext/Cwd/t/cwd.t......................FAILED 21
../ext/IPC/SysV/t/ipcsysv.t.............FAILED 1-16
../ext/IPC/SysV/t/msg.t.................FAILED ??
../ext/IPC/SysV/t/sem.t.................FAILED ??
../t/io/tell.t..........................FAILED 28
../t/op/taint.t.........................FAILED 150-223

[perlio]
[perlio] -DDEBUGGING
[perlio] -Duse64bitint
../ext/Cwd/t/cwd.t......................FAILED 21
../ext/IPC/SysV/t/ipcsysv.t.............FAILED 1-16
../ext/IPC/SysV/t/msg.t.................FAILED ??
../ext/IPC/SysV/t/sem.t.................FAILED ??
../t/op/taint.t.........................FAILED 150-223

[perlio] -DDEBUGGING -Duse64bitint
[perlio] -Duseithreads
[perlio] -DDEBUGGING -Duseithreads
[perlio] -Duseithreads -Duse64bitint
[perlio] -DDEBUGGING -Duseithreads -Duse64bitint
../ext/Cwd/t/cwd.t......................FAILED 21
../ext/IPC/SysV/t/ipcsysv.t.............FAILED 1-16
../ext/IPC/SysV/t/msg.t.................FAILED ??
../ext/IPC/SysV/t/sem.t.................FAILED ??
../lib/Net/Ping/t/510_ping_udp.t........FAILED 2
../t/op/taint.t.........................FAILED 150-223

[stdio] -Duseithreads
[stdio] -DDEBUGGING -Duseithreads
[stdio] -Duseithreads -Duse64bitint
[stdio] -DDEBUGGING -Duseithreads -Duse64bitint
../ext/B/t/optree_specials.t............FAILED 2 6
../ext/Cwd/t/cwd.t......................FAILED 21
../ext/IPC/SysV/t/ipcsysv.t.............FAILED 1-16
../ext/IPC/SysV/t/msg.t.................FAILED ??
../ext/IPC/SysV/t/sem.t.................FAILED ??
../lib/Net/Ping/t/510_ping_udp.t........FAILED 2
../t/io/tell.t..........................FAILED 28
../t/op/taint.t.........................FAILED 150-223

MANIFEST did not declare 'smoke.cfg'

--
Report by Test::Smoke v1.19#718 running on perl 5.9.2
(Reporter v0.016 / Smoker v0.015)
--
H.Merijn Brand Amsterdam Perl Mongers (http://amsterdam.pm.org/)
using perl-5.6.1, 5.8.3, & 5.9.x, and 809 on HP-UX 10.20 & 11.00, 11i,
AIX 4.3, SuSE 9.0, and Win2k. http://www.cmve.net/~merijn/
http://archives.develooper.com/daily-build@perl.org/ perl-qa@perl.org
send smoke reports to: smokers-reports@perl.org, QA: http://qa.perl.org

Search Discussions

Related Discussions

Discussion Navigation
viewthread | post
Discussion Overview
groupdaily-build @
categoriesperl
postedJul 28, '04 at 6:31a
activeJul 28, '04 at 6:31a
posts1
users1
websiteperl.org

1 user in discussion

H.Merijn Brand: 1 post

People

Translate

site design / logo © 2018 Grokbase