FAQ
Automated smoke report for 5.25.2 patch 6830146276953868aad3dab123e7048a786f9452 v5.25.1-96-g6830146
ALMA: HP rx2600 (1.50GHz/6.0MB) (IA64/2 cpu)
     on openvms - V8.4
     using HP C V7.3-020

     smoketime 3 hours 12 minutes (average 1 hour 36 minutes)

Summary: FAIL(F)

O = OK F = Failure(s), extended report at the bottom
X = Failure(s) under TEST but not under harness
? = still running or test results not (yet) available
Build failures during: - = unknown or N/A
c = Configure, m = make, M = make (after miniperl), t = make test-prep

v5.25.1-96-g6830146 Configuration (common) none
----------- ---------------------------------------------------------
F -
F - -Duseithreads
+--------- -DDEBUGGING
+----------- no debugging


Locally applied patches:
     SMOKE6830146276953868aad3dab123e7048a786f9452

Failures: (common-args) none
[default]
     t/run/locale ................................................... FAILED at test 3
     cpan/ExtUtils-MakeMaker/t/02-xsdynamic ......................... FAILED at test 22
     cpan/HTTP-Tiny/t/140_proxy ..................................... FAILED at test 16
     cpan/Module-Metadata/t/metadata ................................ FAILED--expected 70 tests, saw 41
     cpan/Pod-Simple/t/search50 ..................................... FAILED at test 13
     cpan/Test-Harness/t/proverun ................................... FAILED at test 3
     cpan/Test-Simple/t/Legacy/utf8 ................................. FAILED at test 5
     ext/XS-APItest/t/svpeek ........................................ FAILED at test 14

[default] -Duseithreads
     t/run/locale ................................................... FAILED at test 3
     cpan/ExtUtils-MakeMaker/t/02-xsdynamic ......................... FAILED at test 22
     cpan/HTTP-Tiny/t/140_proxy ..................................... FAILED at test 16
     cpan/Module-Metadata/t/metadata ................................ FAILED--expected 70 tests, saw 41
     cpan/Pod-Simple/t/search50 ..................................... FAILED at test 10
     cpan/Test-Harness/t/proverun ................................... FAILED at test 3
     cpan/Test-Simple/t/Legacy/utf8 ................................. FAILED at test 5
     ext/XS-APItest/t/svpeek ........................................ FAILED at test 14

MANIFEST did not declare '.DIR-LOCALS.EL'
MANIFEST did not declare 'CPAN/.DIR-LOCALS.EL'
MANIFEST declared 'CPAN/_DIR-LOCALS.EL' but it is missing
MANIFEST did not declare 'CROSS/MAKEFILE.SH.PATCH'
MANIFEST declared 'CROSS/MAKEFILE_SH.PATCH' but it is missing
MANIFEST declared '_DIR-LOCALS.EL' but it is missing

--
Report by Test::Smoke v1.53 build 1374 running on perl 5.16.1
(Reporter v0.050 / Smoker v0.045)

Search Discussions

Related Discussions

Discussion Navigation
viewthread | post
Discussion Overview
groupdaily-build-reports @
categoriesperl
postedJun 1, '16 at 3:02a
activeJun 1, '16 at 3:02a
posts1
users1
websiteperl.org

1 user in discussion

Craig A. Berry: 1 post

People

Translate

site design / logo © 2018 Grokbase