FAQ
Automated smoke report for 5.25.2 patch bdc905d035d4f835a808f1825dad9a8cd726d1ec v5.25.1-95-gbdc905d
deimos.tony.develop-help.com: AMD 686-class (amd64/2 cpu)
     on netbsd - 5.1.2
     using cc version 4.1.3 20080704 prerelease (NetBSD nb2 20081120)
     smoketime 4 hours 39 minutes (average 23 minutes 18 seconds)

Summary: FAIL(F)

O = OK F = Failure(s), extended report at the bottom
X = Failure(s) under TEST but not under harness
? = still running or test results not (yet) available
Build failures during: - = unknown or N/A
c = Configure, m = make, M = make (after miniperl), t = make test-prep

v5.25.1-95-gbdc905d Configuration (common) none
----------- ---------------------------------------------------------
O O O O
O O O O -Duse64bitint
O O O O -Dmad
O O O O -Duseithreads
O O O O -Duseithreads -Duse64bitint
F F O O -Duseithreads -Dmad
+----- PERLIO = perlio -DDEBUGGING
+------- PERLIO = stdio -DDEBUGGING
+--------- PERLIO = perlio
+----------- PERLIO = stdio


Locally applied patches:
     SMOKEbdc905d035d4f835a808f1825dad9a8cd726d1ec

Testsuite was run only with 'harness' and HARNESS_OPTIONS=j4

Failures: (common-args) none
[stdio/perlio] -Duseithreads -Dmad
../t/op/threads.t...........................................FAILED
     Non-zero exit status: 1
     Bad plan. You planned 28 tests but ran 9.

Passed Todo tests: (common-args) none
[stdio/perlio]
[stdio/perlio] -DDEBUGGING
[stdio/perlio] -Duse64bitint
[stdio/perlio] -DDEBUGGING -Duse64bitint
[stdio/perlio] -Dmad
[stdio/perlio] -DDEBUGGING -Dmad
[stdio/perlio] -Duseithreads
[stdio/perlio] -DDEBUGGING -Duseithreads
[stdio/perlio] -Duseithreads -Duse64bitint
[stdio/perlio] -DDEBUGGING -Duseithreads -Duse64bitint
[stdio/perlio] -Duseithreads -Dmad
[stdio/perlio] -DDEBUGGING -Duseithreads -Dmad
../cpan/Archive-Tar/t/09_roundtrip.t........................PASSED
     1, 4, 6
UUID: 1538A00C-26A2-11E6-AAD8-67C823E824A9
Branch: blead
Config: default
Logs: http://perl.develop-help.com/reports/

--
Report by Test::Smoke v1.53 build running on perl 5.14.2
(Reporter v0.050 / Smoker v0.045)

Search Discussions

  • Tony Cook at May 31, 2016 at 5:06 am
    Automated smoke report for 5.25.2 patch bdc905d035d4f835a808f1825dad9a8cd726d1ec v5.25.1-95-gbdc905d
    deimos.tony.develop-help.com: AMD 686-class (amd64/2 cpu)
         on netbsd - 5.1.2
         using cc version 4.1.3 20080704 prerelease (NetBSD nb2 20081120)
         smoketime 4 hours 18 minutes (average 21 minutes 34 seconds)

    Summary: FAIL(F)

    O = OK F = Failure(s), extended report at the bottom
    X = Failure(s) under TEST but not under harness
    ? = still running or test results not (yet) available
    Build failures during: - = unknown or N/A
    c = Configure, m = make, M = make (after miniperl), t = make test-prep

    v5.25.1-95-gbdc905d Configuration (common) -Dstatic_ext=Cwd
    ----------- ---------------------------------------------------------
    O O O O
    O O O F -Duse64bitint
    O O O O -Dmad
    O O O O -Duseithreads
    O O O O -Duseithreads -Duse64bitint
    O O O O -Duseithreads -Dmad
    +----- PERLIO = perlio -DDEBUGGING
    +------- PERLIO = stdio -DDEBUGGING
    +--------- PERLIO = perlio
    +----------- PERLIO = stdio


    Locally applied patches:
         SMOKEbdc905d035d4f835a808f1825dad9a8cd726d1ec

    Testsuite was run only with 'harness' and HARNESS_OPTIONS=j4

    Failures: (common-args) -Dstatic_ext=Cwd
    [perlio] -DDEBUGGING -Duse64bitint
    ../t/porting/authors.t......................................FAILED
         No plan found in TAP output

    Passed Todo tests: (common-args) -Dstatic_ext=Cwd
    [stdio/perlio]
    [stdio/perlio] -DDEBUGGING
    [stdio/perlio] -Duse64bitint
    [stdio/perlio] -DDEBUGGING -Duse64bitint
    [stdio/perlio] -Dmad
    [stdio/perlio] -DDEBUGGING -Dmad
    [stdio/perlio] -Duseithreads
    [stdio/perlio] -DDEBUGGING -Duseithreads
    [stdio/perlio] -Duseithreads -Duse64bitint
    [stdio/perlio] -DDEBUGGING -Duseithreads -Duse64bitint
    [stdio/perlio] -Duseithreads -Dmad
    [stdio/perlio] -DDEBUGGING -Duseithreads -Dmad
    ../cpan/Archive-Tar/t/09_roundtrip.t........................PASSED
         1, 4, 6
    UUID: 37A68434-26C9-11E6-AAD8-67C823E824A9
    Branch: blead
    Config: staticcwd
    Logs: http://perl.develop-help.com/reports/

    --
    Report by Test::Smoke v1.53 build running on perl 5.14.2
    (Reporter v0.050 / Smoker v0.045)
  • Tony Cook at May 31, 2016 at 9:29 am
    Automated smoke report for 5.25.2 patch bdc905d035d4f835a808f1825dad9a8cd726d1ec v5.25.1-95-gbdc905d
    deimos.tony.develop-help.com: AMD 686-class (amd64/2 cpu)
         on netbsd - 5.1.2
         using cc version 4.1.3 20080704 prerelease (NetBSD nb2 20081120)
         smoketime 4 hours 22 minutes (average 21 minutes 51 seconds)

    Summary: FAIL(F)

    O = OK F = Failure(s), extended report at the bottom
    X = Failure(s) under TEST but not under harness
    ? = still running or test results not (yet) available
    Build failures during: - = unknown or N/A
    c = Configure, m = make, M = make (after miniperl), t = make test-prep

    v5.25.1-95-gbdc905d Configuration (common) -Dstatic_ext=Socket
    ----------- ---------------------------------------------------------
    O O O O
    O O O O -Duse64bitint
    O O O O -Dmad
    O O O O -Duseithreads
    O O O O -Duseithreads -Duse64bitint
    O O F O -Duseithreads -Dmad
    +----- PERLIO = perlio -DDEBUGGING
    +------- PERLIO = stdio -DDEBUGGING
    +--------- PERLIO = perlio
    +----------- PERLIO = stdio


    Locally applied patches:
         SMOKEbdc905d035d4f835a808f1825dad9a8cd726d1ec

    Testsuite was run only with 'harness' and HARNESS_OPTIONS=j4

    Failures: (common-args) -Dstatic_ext=Socket
    [stdio] -DDEBUGGING -Duseithreads -Dmad
    ../t/op/threads.t...........................................FAILED
         Non-zero exit status: 1
         Bad plan. You planned 28 tests but ran 9.

    Passed Todo tests: (common-args) -Dstatic_ext=Socket
    [stdio/perlio]
    [stdio/perlio] -DDEBUGGING
    [stdio/perlio] -Duse64bitint
    [stdio/perlio] -DDEBUGGING -Duse64bitint
    [stdio/perlio] -Dmad
    [stdio/perlio] -DDEBUGGING -Dmad
    [stdio/perlio] -Duseithreads
    [stdio/perlio] -DDEBUGGING -Duseithreads
    [stdio/perlio] -Duseithreads -Duse64bitint
    [stdio/perlio] -DDEBUGGING -Duseithreads -Duse64bitint
    [stdio/perlio] -Duseithreads -Dmad
    [stdio/perlio] -DDEBUGGING -Duseithreads -Dmad
    ../cpan/Archive-Tar/t/09_roundtrip.t........................PASSED
         1, 4, 6
    UUID: 6FD021C0-26ED-11E6-AAD8-67C823E824A9
    Branch: blead
    Config: staticsock
    Logs: http://perl.develop-help.com/reports/

    --
    Report by Test::Smoke v1.53 build running on perl 5.14.2
    (Reporter v0.050 / Smoker v0.045)

Related Discussions

Discussion Navigation
viewthread | post
Discussion Overview
groupdaily-build-reports @
categoriesperl
postedMay 31, '16 at 12:47a
activeMay 31, '16 at 9:29a
posts3
users1
websiteperl.org

1 user in discussion

Tony Cook: 3 posts

People

Translate

site design / logo © 2018 Grokbase