FAQ
Automated smoke report for 5.25.2 patch 18d04e70ad3150934855463233bb7dc953f33a23 v5.25.1-90-g18d04e7
mimas: AMD64 Family 16 Model 10 Stepping 0, AuthenticAMD (x86/2 cpu)
     on cygwin_nt-10.0-wow - 2.5.1(0.297/5/3)
     using gcc version 5.3.0
     smoketime 4 hours 30 minutes (average 1 hour 7 minutes)

Summary: FAIL(F)

O = OK F = Failure(s), extended report at the bottom
X = Failure(s) under TEST but not under harness
? = still running or test results not (yet) available
Build failures during: - = unknown or N/A
c = Configure, m = make, M = make (after miniperl), t = make test-prep

v5.25.1-90-g18d04e7 Configuration (common) none
----------- ---------------------------------------------------------
F F O F -Uusethreads -Uusemymalloc
F F F F -Duseithreads -Uusemymalloc
+----- PERLIO = perlio -DDEBUGGING
+------- PERLIO = stdio -DDEBUGGING
+--------- PERLIO = perlio
+----------- PERLIO = stdio


Locally applied patches:
     SMOKE18d04e70ad3150934855463233bb7dc953f33a23

Testsuite was run only with 'harness' and HARNESS_OPTIONS=j2

Failures: (common-args) none
[stdio] -Uusethreads -Uusemymalloc
../dist/Time-HiRes/t/alarm.t................................FAILED
     5
     Non-zero exit status: 1

[perlio] -Uusethreads -Uusemymalloc
[stdio] -DDEBUGGING -Duseithreads -Uusemymalloc
../dist/Time-HiRes/t/alarm.t................................FAILED
     5, 9
     Non-zero exit status: 2

[perlio] -DDEBUGGING -Uusethreads -Uusemymalloc
[stdio] -Duseithreads -Uusemymalloc
../dist/Time-HiRes/t/alarm.t................................FAILED
     6, 9
     Non-zero exit status: 2

[perlio] -Duseithreads -Uusemymalloc
../cpan/ExtUtils-MakeMaker/t/basic.t........................FAILED
     69
     Non-zero exit status: 1
../dist/Time-HiRes/t/alarm.t................................FAILED
     5, 9
     Non-zero exit status: 2

[perlio] -DDEBUGGING -Duseithreads -Uusemymalloc
../dist/threads/t/exit.t....................................FAILED
     12, 14

Passed Todo tests: (common-args) none
[stdio/perlio] -Uusethreads -Uusemymalloc
[stdio/perlio] -DDEBUGGING -Uusethreads -Uusemymalloc
[stdio/perlio] -Duseithreads -Uusemymalloc
[stdio/perlio] -DDEBUGGING -Duseithreads -Uusemymalloc
../cpan/Archive-Tar/t/09_roundtrip.t........................PASSED
     1, 4, 6

Compiler messages(gcc):
util.c: In function ‘Perl_ninstr’:
util.h:236:23: warning: implicit declaration of function ‘memmem’ [-Wimplicit-function-declaration]
pp_sys.c: In function ‘Perl_pp_ftrread’:
pp_sys.c:217:38: warning: implicit declaration of function ‘eaccess’ [-Wimplicit-function-declaration]
pp_ctl.c: In function ‘S_require_file’:
time64.c: In function ‘S_copy_little_tm_to_big_TM’:
time64.c:284:25: warning: assignment discards ‘const’ qualifier from pointer target type [-Wdiscarded-qualifiers]
compress.c: In function ‘BZ2_compressBlock’:
compress.c:391:54: warning: ‘cost[5]’ may be used uninitialized in this function [-Wmaybe-uninitialized]
compress.c:401:25: warning: ‘cost[3]’ may be used uninitialized in this function [-Wmaybe-uninitialized]
compress.c:401:25: warning: ‘cost[2]’ may be used uninitialized in this function [-Wmaybe-uninitialized]
inflate.c: In function ‘inflateUndermine’:
inflate.c:1487:9: warning: unused parameter ‘subvert’ [-Wunused-parameter]
RealPPPort.xs: In function ‘XS_Devel__PPPort_other_variables’:
../../pp.h:477:68: warning: cast from pointer to integer of different size [-Wpointer-to-int-cast]
./const-xs.inc: In function ‘XS_Fcntl_AUTOLOAD’:
./const-xs.inc:557:20: warning: format ‘%d’ expects argument of type ‘int’, but argument 4 has type ‘line_t {aka const long unsigned int}’ [-Wformat=]
./const-xs.inc:563:20: warning: format ‘%d’ expects argument of type ‘int’, but argument 4 has type ‘line_t {aka const long unsigned int}’ [-Wformat=]
./const-xs.inc: In function ‘XS_File__Glob_AUTOLOAD’:
./const-xs.inc:133:20: warning: format ‘%d’ expects argument of type ‘int’, but argument 4 has type ‘line_t {aka const long unsigned int}’ [-Wformat=]
./const-xs.inc:139:20: warning: format ‘%d’ expects argument of type ‘int’, but argument 4 has type ‘line_t {aka const long unsigned int}’ [-Wformat=]
Call.xs: In function ‘filter_call’:
../../util.h:236:23: warning: implicit declaration of function ‘memmem’ [-Wimplicit-function-declaration]
./const-xs.inc: In function ‘XS_I18N__Langinfo_AUTOLOAD’:
./const-xs.inc:261:20: warning: format ‘%d’ expects argument of type ‘int’, but argument 4 has type ‘line_t {aka const long unsigned int}’ [-Wformat=]
./const-xs.inc:267:20: warning: format ‘%d’ expects argument of type ‘int’, but argument 4 has type ‘line_t {aka const long unsigned int}’ [-Wformat=]
const-c.inc: In function ‘_constant_5’:
const-c.inc:24:42: warning: unused parameter ‘iv_return’ [-Wunused-parameter]
POSIX.xs:1311:7: warning: ‘_tzname’ redeclared without dllimport attribute: previous dllimport ignored [-Wattributes]
POSIX.xs:1311:20: warning: initialization discards ‘const’ qualifier from pointer target type [-Wdiscarded-qualifiers]
POSIX.xs:1311:25: warning: initialization discards ‘const’ qualifier from pointer target type [-Wdiscarded-qualifiers]
./const-xs.inc: In function ‘XS_POSIX_constant’:
./const-xs.inc:1573:20: warning: format ‘%d’ expects argument of type ‘int’, but argument 4 has type ‘line_t {aka const long unsigned int}’ [-Wformat=]
./const-xs.inc:1579:20: warning: format ‘%d’ expects argument of type ‘int’, but argument 4 has type ‘line_t {aka const long unsigned int}’ [-Wformat=]
./const-xs.inc: In function ‘XS_Socket_AUTOLOAD’:
./const-xs.inc:944:20: warning: format ‘%d’ expects argument of type ‘int’, but argument 4 has type ‘line_t {aka const long unsigned int}’ [-Wformat=]
./const-xs.inc:950:20: warning: format ‘%d’ expects argument of type ‘int’, but argument 4 has type ‘line_t {aka const long unsigned int}’ [-Wformat=]
Win32.xs:129:5: warning: non-local variable ‘g_osver’ with anonymous type is questionable in C++ [-Wc++-compat]
Win32.xs: In function ‘wstr_to_sv’:
Win32.xs:177:21: warning: implicit declaration of function ‘wcslen’ [-Wimplicit-function-declaration]
longpath.inc: In function ‘my_longpathW’:
Win32.xs:277:27: warning: implicit declaration of function ‘wcscpy’ [-Wimplicit-function-declaration]
Win32.xs: In function ‘free_childenv’:
Win32.xs:378:21: warning: unused parameter ‘d’ [-Wunused-parameter]
Win32.xs: In function ‘w32_ExpandEnvironmentStrings’:
../../XSUB.h:127:43: warning: unused parameter ‘cv’ [-Wunused-parameter]
Win32.xs: In function ‘w32_IsAdminUser’:
Win32.xs: In function ‘w32_LookupAccountName’:
Win32.xs: In function ‘w32_LookupAccountSID’:
Win32.xs: In function ‘w32_InitiateSystemShutdown’:
Win32.xs: In function ‘w32_AbortSystemShutdown’:
Win32.xs: In function ‘w32_MsgBox’:
Win32.xs:699:23: warning: initialization discards ‘const’ qualifier from pointer target type [-Wdiscarded-qualifiers]
Win32.xs: In function ‘w32_LoadLibrary’:
Win32.xs: In function ‘w32_FreeLibrary’:
Win32.xs: In function ‘w32_GetProcAddress’:
Win32.xs: In function ‘w32_RegisterServer’:
Win32.xs: In function ‘w32_UnregisterServer’:
Win32.xs: In function ‘w32_GetArchName’:
../../XSUB.h:165:20: warning: unused variable ‘items’ [-Wunused-variable]
Win32.xs: In function ‘w32_GetChipName’:
Win32.xs: In function ‘w32_GuidGen’:
Win32.xs: In function ‘w32_GetFolderPath’:
Win32.xs:902:54: warning: assignment discards ‘const’ qualifier from pointer target type [-Wdiscarded-qualifiers]
Win32.xs:903:54: warning: assignment discards ‘const’ qualifier from pointer target type [-Wdiscarded-qualifiers]
Win32.xs:904:54: warning: assignment discards ‘const’ qualifier from pointer target type [-Wdiscarded-qualifiers]
Win32.xs:905:54: warning: assignment discards ‘const’ qualifier from pointer target type [-Wdiscarded-qualifiers]
Win32.xs:907:54: warning: assignment discards ‘const’ qualifier from pointer target type [-Wdiscarded-qualifiers]
Win32.xs:908:54: warning: assignment discards ‘const’ qualifier from pointer target type [-Wdiscarded-qualifiers]
Win32.xs:909:54: warning: assignment discards ‘const’ qualifier from pointer target type [-Wdiscarded-qualifiers]
Win32.xs:910:54: warning: assignment discards ‘const’ qualifier from pointer target type [-Wdiscarded-qualifiers]
Win32.xs:911:54: warning: assignment discards ‘const’ qualifier from pointer target type [-Wdiscarded-qualifiers]
Win32.xs:912:54: warning: assignment discards ‘const’ qualifier from pointer target type [-Wdiscarded-qualifiers]
Win32.xs:913:54: warning: assignment discards ‘const’ qualifier from pointer target type [-Wdiscarded-qualifiers]
Win32.xs:914:54: warning: assignment discards ‘const’ qualifier from pointer target type [-Wdiscarded-qualifiers]
Win32.xs:915:54: warning: assignment discards ‘const’ qualifier from pointer target type [-Wdiscarded-qualifiers]
Win32.xs:916:54: warning: assignment discards ‘const’ qualifier from pointer target type [-Wdiscarded-qualifiers]
Win32.xs:917:54: warning: assignment discards ‘const’ qualifier from pointer target type [-Wdiscarded-qualifiers]
Win32.xs:918:54: warning: assignment discards ‘const’ qualifier from pointer target type [-Wdiscarded-qualifiers]
Win32.xs:919:54: warning: assignment discards ‘const’ qualifier from pointer target type [-Wdiscarded-qualifiers]
Win32.xs:920:54: warning: assignment discards ‘const’ qualifier from pointer target type [-Wdiscarded-qualifiers]
Win32.xs:921:54: warning: assignment discards ‘const’ qualifier from pointer target type [-Wdiscarded-qualifiers]
Win32.xs:922:54: warning: assignment discards ‘const’ qualifier from pointer target type [-Wdiscarded-qualifiers]
Win32.xs:923:54: warning: assignment discards ‘const’ qualifier from pointer target type [-Wdiscarded-qualifiers]
Win32.xs:924:54: warning: assignment discards ‘const’ qualifier from pointer target type [-Wdiscarded-qualifiers]
Win32.xs:931:54: warning: assignment discards ‘const’ qualifier from pointer target type [-Wdiscarded-qualifiers]
Win32.xs:932:54: warning: assignment discards ‘const’ qualifier from pointer target type [-Wdiscarded-qualifiers]
Win32.xs:933:54: warning: assignment discards ‘const’ qualifier from pointer target type [-Wdiscarded-qualifiers]
Win32.xs:934:54: warning: assignment discards ‘const’ qualifier from pointer target type [-Wdiscarded-qualifiers]
Win32.xs:935:54: warning: assignment discards ‘const’ qualifier from pointer target type [-Wdiscarded-qualifiers]
Win32.xs:936:54: warning: assignment discards ‘const’ qualifier from pointer target type [-Wdiscarded-qualifiers]
Win32.xs:937:54: warning: assignment discards ‘const’ qualifier from pointer target type [-Wdiscarded-qualifiers]
Win32.xs:938:54: warning: assignment discards ‘const’ qualifier from pointer target type [-Wdiscarded-qualifiers]
Win32.xs:939:54: warning: assignment discards ‘const’ qualifier from pointer target type [-Wdiscarded-qualifiers]
Win32.xs:940:54: warning: assignment discards ‘const’ qualifier from pointer target type [-Wdiscarded-qualifiers]
Win32.xs:941:54: warning: assignment discards ‘const’ qualifier from pointer target type [-Wdiscarded-qualifiers]
Win32.xs:942:54: warning: assignment discards ‘const’ qualifier from pointer target type [-Wdiscarded-qualifiers]
Win32.xs:976:69: warning: passing argument 1 of ‘get_unicode_env’ discards ‘const’ qualifier from pointer target type [-Wdiscarded-qualifiers]
Win32.xs:977:69: warning: passing argument 1 of ‘get_unicode_env’ discards ‘const’ qualifier from pointer target type [-Wdiscarded-qualifiers]
Win32.xs:978:69: warning: passing argument 1 of ‘get_unicode_env’ discards ‘const’ qualifier from pointer target type [-Wdiscarded-qualifiers]
Win32.xs:979:69: warning: passing argument 1 of ‘get_unicode_env’ discards ‘const’ qualifier from pointer target type [-Wdiscarded-qualifiers]
Win32.xs:980:69: warning: passing argument 1 of ‘get_unicode_env’ discards ‘const’ qualifier from pointer target type [-Wdiscarded-qualifiers]
Win32.xs: In function ‘w32_GetFileVersion’:
Win32.xs: In function ‘w32_SetChildShowWindow’:
Win32.xs: In function ‘w32_GetCwd’:
Win32.xs: In function ‘w32_SetCwd’:
Win32.xs: In function ‘w32_GetNextAvailDrive’:
Win32.xs: In function ‘w32_GetLastError’:
Win32.xs: In function ‘w32_SetLastError’:
Win32.xs: In function ‘w32_LoginName’:
Win32.xs: In function ‘w32_NodeName’:
Win32.xs: In function ‘w32_DomainName’:
Win32.xs: In function ‘w32_FsType’:
Win32.xs: In function ‘w32_GetOSVersion’:
Win32.xs: In function ‘w32_IsWinNT’:
Win32.xs: In function ‘w32_IsWin95’:
Win32.xs: In function ‘w32_FormatMessage’:
Win32.xs: In function ‘w32_Spawn’:
Win32.xs: In function ‘w32_GetTickCount’:
Win32.xs: In function ‘w32_GetShortPathName’:
Win32.xs: In function ‘w32_GetFullPathName’:
Win32.xs: In function ‘w32_GetLongPathName’:
Win32.xs:1528:26: warning: comparison between signed and unsigned integer expressions [-Wsign-compare]
Win32.xs: In function ‘w32_GetANSIPathName’:
Win32.xs: In function ‘w32_Sleep’:
Win32.xs: In function ‘w32_CopyFile’:
Win32.xs: In function ‘w32_OutputDebugString’:
Win32.xs: In function ‘w32_GetCurrentProcessId’:
Win32.xs: In function ‘w32_GetCurrentThreadId’:
Win32.xs: In function ‘w32_CreateDirectory’:
Win32.xs: In function ‘w32_CreateFile’:
Win32.xs: In function ‘w32_GetSystemMetrics’:
Win32.xs: In function ‘w32_GetProductInfo’:
Win32.xs: In function ‘w32_GetACP’:
Win32.xs: In function ‘w32_GetConsoleCP’:
Win32.xs: In function ‘w32_GetConsoleOutputCP’:
Win32.xs: In function ‘w32_GetOEMCP’:
Win32.xs: In function ‘w32_SetConsoleCP’:
Win32.xs: In function ‘w32_SetConsoleOutputCP’:
Win32.xs: In function ‘boot_Win32’:
Win32.xs:1767:18: warning: initialization discards ‘const’ qualifier from pointer target type [-Wdiscarded-qualifiers]
Win32.xs:1189:16: warning: ‘pfnNetWkstaGetInfo’ may be used uninitialized in this function [-Wmaybe-uninitialized]
Win32.xs:1212:6: warning: ‘pfnNetApiBufferFree’ may be used uninitialized in this function [-Wmaybe-uninitialized]
File.xs: In function ‘XS_Win32API__File_DeviceIoControl’:
File.xs:243:10: warning: format ‘%d’ expects argument of type ‘int’, but argument 4 has type ‘DWORD {aka long unsigned int}’ [-Wformat=]
File.c: In function ‘XS_Win32API__File_GetVolumeInformationW’:
buffers.h:422:24: warning: implicit declaration of function ‘wcslen’ [-Wimplicit-function-declaration]
File.c: In function ‘XS_Win32API__File_OsFHandleOpenFd’:
File.c:1458:8: warning: variable ‘uMode’ set but not used [-Wunused-but-set-variable]
File.c:1457:7: warning: variable ‘hOsFHandle’ set but not used [-Wunused-but-set-variable]
File.xs: In function ‘XS_Win32API__File_SetFilePointer’:
File.xs:604:14: warning: comparison between signed and unsigned integer expressions [-Wsign-compare]
File.xs: In function ‘XS_Win32API__File_WriteFile’:
File.xs:640:13: warning: format ‘%d’ expects argument of type ‘int’, but argument 4 has type ‘DWORD {aka long unsigned int}’ [-Wformat=]
locale.c: In function ‘Perl_new_collate’:
locale.c:680:21: warning: format ‘%llu’ expects argument of type ‘long long unsigned int’, but argument 6 has type ‘size_t {aka unsigned int}’ [-Wformat=]
locale.c:680:21: warning: format ‘%llu’ expects argument of type ‘long long unsigned int’, but argument 7 has type ‘size_t {aka unsigned int}’ [-Wformat=]
locale.c:680:21: warning: format ‘%llu’ expects argument of type ‘long long unsigned int’, but argument 8 has type ‘size_t {aka unsigned int}’ [-Wformat=]
locale.c:680:21: warning: format ‘%llu’ expects argument of type ‘long long unsigned int’, but argument 9 has type ‘size_t {aka unsigned int}’ [-Wformat=]
locale.c: In function ‘Perl__mem_collxfrm’:
locale.c:1874:13: warning: format ‘%d’ expects argument of type ‘int’, but argument 3 has type ‘U32 {aka long unsigned int}’ [-Wformat=]
locale.c:1874:13: warning: format ‘%llu’ expects argument of type ‘long long unsigned int’, but argument 4 has type ‘STRLEN {aka unsigned int}’ [-Wformat=]
locale.c:1901:39: warning: format ‘%d’ expects argument of type ‘int’, but argument 3 has type ‘U32 {aka long unsigned int}’ [-Wformat=]
scalar.xs: In function ‘PerlIOScalar_read’:
scalar.xs:178:27: warning: comparison is always true due to limited range of data type [-Wtype-limits]
File.xs: In function ‘ErrPrintf’:
File.xs:65:7: warning: assignment discards ‘const’ qualifier from pointer target type [-Wdiscarded-qualifiers]
File.xs:58:5: warning: ‘ErrPrintf’ defined but not used [-Wunused-function]
HiRes.c: In function ‘XS_Time__HiRes_CLONE’:
Win32.xs:976:69: warning: passing argument 2 of ‘get_unicode_env’ discards ‘const’ qualifier from pointer target type [-Wdiscarded-qualifiers]
Win32.xs:977:69: warning: passing argument 2 of ‘get_unicode_env’ discards ‘const’ qualifier from pointer target type [-Wdiscarded-qualifiers]
Win32.xs:978:69: warning: passing argument 2 of ‘get_unicode_env’ discards ‘const’ qualifier from pointer target type [-Wdiscarded-qualifiers]
Win32.xs:979:69: warning: passing argument 2 of ‘get_unicode_env’ discards ‘const’ qualifier from pointer target type [-Wdiscarded-qualifiers]
Win32.xs:980:69: warning: passing argument 2 of ‘get_unicode_env’ discards ‘const’ qualifier from pointer target type [-Wdiscarded-qualifiers]
UUID: 37CF7161-6F6F-1014-A75E-76C795C12EC9
Branch: blead
Config: default
Logs: http://perl.develop-help.com/reports/

--
Report by Test::Smoke v1.53 build running on perl 5.22.2
(Reporter v0.050 / Smoker v0.045)

Search Discussions

Related Discussions

Discussion Navigation
viewthread | post
Discussion Overview
groupdaily-build-reports @
categoriesperl
postedMay 30, '16 at 2:10a
activeMay 30, '16 at 2:10a
posts1
users1
websiteperl.org

1 user in discussion

Tony Cook: 1 post

People

Translate

site design / logo © 2018 Grokbase