FAQ
Automated smoke report for 5.25.2 patch fbe0543bcbaefe00657a5aa89d684a59c352cb84 v5.25.1-91-gfbe0543
deimos.tony.develop-help.com: AMD 686-class (amd64/2 cpu)
     on netbsd - 5.1.2
     using cc version 4.1.3 20080704 prerelease (NetBSD nb2 20081120)
     smoketime 4 hours 27 minutes (average 22 minutes 19 seconds)

Summary: FAIL(F)

O = OK F = Failure(s), extended report at the bottom
X = Failure(s) under TEST but not under harness
? = still running or test results not (yet) available
Build failures during: - = unknown or N/A
c = Configure, m = make, M = make (after miniperl), t = make test-prep

v5.25.1-91-gfbe0543 Configuration (common) none
----------- ---------------------------------------------------------
O O O O
O O O O -Duse64bitint
O F O O -Dmad
O O O O -Duseithreads
F O O O -Duseithreads -Duse64bitint
O O O O -Duseithreads -Dmad
+----- PERLIO = perlio -DDEBUGGING
+------- PERLIO = stdio -DDEBUGGING
+--------- PERLIO = perlio
+----------- PERLIO = stdio


Locally applied patches:
     SMOKEfbe0543bcbaefe00657a5aa89d684a59c352cb84

Testsuite was run only with 'harness' and HARNESS_OPTIONS=j4

Failures: (common-args) none
[perlio] -Dmad
../dist/Time-HiRes/t/ualarm.t...............................FAILED
     9
     Non-zero exit status: 1

[stdio] -Duseithreads -Duse64bitint
../t/op/threads.t...........................................FAILED
     Non-zero exit status: 1
     Bad plan. You planned 28 tests but ran 9.

Passed Todo tests: (common-args) none
[stdio/perlio]
[stdio/perlio] -DDEBUGGING
[stdio/perlio] -Duse64bitint
[stdio/perlio] -DDEBUGGING -Duse64bitint
[stdio/perlio] -Dmad
[stdio/perlio] -DDEBUGGING -Dmad
[stdio/perlio] -Duseithreads
[stdio/perlio] -DDEBUGGING -Duseithreads
[stdio/perlio] -Duseithreads -Duse64bitint
[stdio/perlio] -DDEBUGGING -Duseithreads -Duse64bitint
[stdio/perlio] -Duseithreads -Dmad
[stdio/perlio] -DDEBUGGING -Duseithreads -Dmad
../cpan/Archive-Tar/t/09_roundtrip.t........................PASSED
     1, 4, 6
UUID: 9B35ED48-2631-11E6-AAD8-67C823E824A9
Branch: blead
Config: default
Logs: http://perl.develop-help.com/reports/

--
Report by Test::Smoke v1.53 build running on perl 5.14.2
(Reporter v0.050 / Smoker v0.045)

Search Discussions

  • Tony Cook at May 30, 2016 at 3:31 pm
    Automated smoke report for 5.25.2 patch fbe0543bcbaefe00657a5aa89d684a59c352cb84 v5.25.1-91-gfbe0543
    deimos.tony.develop-help.com: AMD 686-class (amd64/2 cpu)
         on netbsd - 5.1.2
         using cc version 4.1.3 20080704 prerelease (NetBSD nb2 20081120)
         smoketime 4 hours 20 minutes (average 21 minutes 41 seconds)

    Summary: FAIL(F)

    O = OK F = Failure(s), extended report at the bottom
    X = Failure(s) under TEST but not under harness
    ? = still running or test results not (yet) available
    Build failures during: - = unknown or N/A
    c = Configure, m = make, M = make (after miniperl), t = make test-prep

    v5.25.1-91-gfbe0543 Configuration (common) -Dstatic_ext=Cwd
    ----------- ---------------------------------------------------------
    O O O O
    O O O O -Duse64bitint
    O O O F -Dmad
    O O O O -Duseithreads
    O O O O -Duseithreads -Duse64bitint
    O O O O -Duseithreads -Dmad
    +----- PERLIO = perlio -DDEBUGGING
    +------- PERLIO = stdio -DDEBUGGING
    +--------- PERLIO = perlio
    +----------- PERLIO = stdio


    Locally applied patches:
         SMOKEfbe0543bcbaefe00657a5aa89d684a59c352cb84

    Testsuite was run only with 'harness' and HARNESS_OPTIONS=j4

    Failures: (common-args) -Dstatic_ext=Cwd
    [perlio] -DDEBUGGING -Dmad
    ../t/porting/authors.t......................................FAILED
         No plan found in TAP output

    Passed Todo tests: (common-args) -Dstatic_ext=Cwd
    [stdio/perlio]
    [stdio/perlio] -DDEBUGGING
    [stdio/perlio] -Duse64bitint
    [stdio/perlio] -DDEBUGGING -Duse64bitint
    [stdio/perlio] -Dmad
    [stdio/perlio] -DDEBUGGING -Dmad
    [stdio/perlio] -Duseithreads
    [stdio/perlio] -DDEBUGGING -Duseithreads
    [stdio/perlio] -Duseithreads -Duse64bitint
    [stdio/perlio] -DDEBUGGING -Duseithreads -Duse64bitint
    [stdio/perlio] -Duseithreads -Dmad
    [stdio/perlio] -DDEBUGGING -Duseithreads -Dmad
    ../cpan/Archive-Tar/t/09_roundtrip.t........................PASSED
         1, 4, 6
    UUID: 154311A4-2657-11E6-AAD8-67C823E824A9
    Branch: blead
    Config: staticcwd
    Logs: http://perl.develop-help.com/reports/

    --
    Report by Test::Smoke v1.53 build running on perl 5.14.2
    (Reporter v0.050 / Smoker v0.045)

Related Discussions

Discussion Navigation
viewthread | post
Discussion Overview
groupdaily-build-reports @
categoriesperl
postedMay 30, '16 at 11:10a
activeMay 30, '16 at 3:31p
posts2
users1
websiteperl.org

1 user in discussion

Tony Cook: 2 posts

People

Translate

site design / logo © 2018 Grokbase