FAQ
Automated smoke report for branch blead 5.25.2 patch 997990fd7b2db8e6636731fc98ed2e1e000c4718 v5.25.1-88-g997990f
r9: PA8900 (PA-RISC2.0/64/1 cpu)
     on HP-UX - B.11.11/64
     using cc version B.11.11.18
     smoketime 1 day 6 hours 21 minutes (average 3 hours 47 minutes)

Summary: FAIL(F)

O = OK F = Failure(s), extended report at the bottom
X = Failure(s) under TEST but not under harness
? = still running or test results not (yet) available
Build failures during: - = unknown or N/A
c = Configure, m = make, M = make (after miniperl), t = make test-prep

v5.25.1-88-g997990f Configuration (common) none
----------- ---------------------------------------------------------
F F O F F O
F F O F F O -Duse64bitall
F F O F F F -Duseithreads
F F O F F O -Duseithreads -Duse64bitall
+- LC_ALL = univ.utf8 -DDEBUGGING
+--- PERLIO = perlio -DDEBUGGING
+----- PERLIO = stdio -DDEBUGGING
+------- LC_ALL = univ.utf8
+--------- PERLIO = perlio
+----------- PERLIO = stdio

Locally applied patches:
     SMOKE997990fd7b2db8e6636731fc98ed2e1e000c4718

Testsuite was run only with 'harness'

Failures: (common-args) none
[stdio]
[stdio] -DDEBUGGING
[stdio] -Duse64bitall
[stdio] -DDEBUGGING -Duse64bitall
[stdio] -Duseithreads
[stdio] -DDEBUGGING -Duseithreads
[stdio] -Duseithreads -Duse64bitall
[stdio] -DDEBUGGING -Duseithreads -Duse64bitall
../cpan/Encode/t/encoding-locale.t..........................FAILED
     2-3
     Non-zero exit status: 255
../lib/warnings.t...........................................FAILED
     377

[perlio]
[perlio] -DDEBUGGING
[perlio] -Duse64bitall
[perlio] -DDEBUGGING -Duse64bitall
[perlio] -Duseithreads
[perlio] -DDEBUGGING -Duseithreads
[perlio] -Duseithreads -Duse64bitall
[perlio] -DDEBUGGING -Duseithreads -Duse64bitall
../cpan/Encode/t/encoding-locale.t..........................FAILED
     2-3
     Non-zero exit status: 255

[univ.utf8] -DDEBUGGING -Duseithreads
../dist/Time-HiRes/t/alarm.t................................FAILED
     8-9
     Non-zero exit status: 2

Passed Todo tests: (common-args) none
[stdio/perlio]
[stdio/perlio] -DDEBUGGING
[stdio/perlio] -Duse64bitall
[stdio/perlio] -DDEBUGGING -Duse64bitall
[stdio/perlio] -Duseithreads
[stdio/perlio] -DDEBUGGING -Duseithreads
[stdio/perlio] -Duseithreads -Duse64bitall
[stdio/perlio] -DDEBUGGING -Duseithreads -Duse64bitall
../cpan/Archive-Tar/t/09_roundtrip.t........................PASSED
     1, 4, 6
../dist/Net-Ping/t/450_service.t............................PASSED
     9, 18

[univ.utf8]
[univ.utf8] -DDEBUGGING
[univ.utf8] -Duse64bitall
[univ.utf8] -DDEBUGGING -Duse64bitall
[univ.utf8] -Duseithreads
[univ.utf8] -DDEBUGGING -Duseithreads
[univ.utf8] -Duseithreads -Duse64bitall
[univ.utf8] -DDEBUGGING -Duseithreads -Duse64bitall
../lib/B/Deparse.t..........................................PASSED
     2
../cpan/Archive-Tar/t/09_roundtrip.t........................PASSED
     1, 4, 6
../dist/Net-Ping/t/450_service.t............................PASSED
     9, 18

Compiler messages(hpux):


Non-Fatal messages(hpux):


Status overview available here: https://smoke.procura.nl/

--
Report by Test::Smoke v1.70_01 running on perl 5.14.2
(Reporter v0.053 / Smoker v0.046)

Search Discussions

Related Discussions

Discussion Navigation
viewthread | post
Discussion Overview
groupdaily-build-reports @
categoriesperl
postedMay 30, '16 at 8:47a
activeMay 30, '16 at 8:47a
posts1
users1
websiteperl.org

1 user in discussion

H.Merijn Brand: 1 post

People

Translate

site design / logo © 2018 Grokbase