FAQ
See <http://toadeater:8080/job/IcedTea6TargetTesting/824/>

------------------------------------------
Started by timer
[workspace] $ /bin/sh -xe /tmp/hudson1299899304021156432.sh
+ cd /notnfs/nighttester/icedtea6-target-testing/
+ bash -x /notnfs/nighttester/nightly-tester-scripts/icedtea6-target-testing
+ OPENJDK6_TARBALL=/notnfs/nighttester/drops/openjdk-6-src-b23-05_jul_2011.tar.gz
+ HS20_TARBALL=/notnfs/nighttester/drops/hs20.tar.gz
+ CACAO_TARBALL=/notnfs/nighttester/drops/cacao-dd4532afd08a.tar.bz2
+ JAXP6_TARBALL=/notnfs/nighttester/drops/jaxp6.zip
+ JAF6_TARBALL=/notnfs/nighttester/drops/jaf6.zip
+ JAXWS6_TARBALL=/notnfs/nighttester/drops/jaxws6.zip
+ PARALLEL=--with-parallel-jobs=3
+ TARBALLS='--with-openjdk-src-zip=/notnfs/nighttester/drops/openjdk-6-src-b23-05_jul_2011.tar.gz --with-cacao-src-zip=/notnfs/nighttester/drops/cacao-dd4532afd08a.tar.bz2 --with-hotspot-src-zip=/notnfs/nighttester/drops/hs20.tar.gz --with-jaxp-drop-zip=/notnfs/nighttester/drops/jaxp6.zip --with-jaf-drop-zip=/notnfs/nighttester/drops/jaf6.zip --with-jaxws-drop-zip=/notnfs/nighttester/drops/jaxws6.zip'
+ SYSTEMTAP=--enable-systemtap
+ COMMON_CONFIG_OPTS='--with-parallel-jobs=3 --with-openjdk-src-zip=/notnfs/nighttester/drops/openjdk-6-src-b23-05_jul_2011.tar.gz --with-cacao-src-zip=/notnfs/nighttester/drops/cacao-dd4532afd08a.tar.bz2 --with-hotspot-src-zip=/notnfs/nighttester/drops/hs20.tar.gz --with-jaxp-drop-zip=/notnfs/nighttester/drops/jaxp6.zip --with-jaf-drop-zip=/notnfs/nighttester/drops/jaf6.zip --with-jaxws-drop-zip=/notnfs/nighttester/drops/jaxws6.zip --enable-systemtap'
+ make distclean
rm -rf test/jtreg/classes
rm -f test/jtreg.jar
rm -f stamps/jtreg.stamp
rm -rf test/hotspot test/langtools test/jdk
rm -f test/check-*.log test/jtreg-summary.log
rm -rf /notnfs/nighttester/icedtea6-target-testing/pulseaudio.build/native
rm -rf /notnfs/nighttester/icedtea6-target-testing/pulseaudio.build/classes
rm -f /notnfs/nighttester/icedtea6-target-testing/pulseaudio.build/pulse-java.jar
rmdir /notnfs/nighttester/icedtea6-target-testing/pulseaudio.build
rmdir: failed to remove `/notnfs/nighttester/icedtea6-target-testing/pulseaudio.build': No such file or directory
make: *** [clean-pulse-java] Error 1
+ hg pull
pulling from http://icedtea.classpath.org/hg/icedtea6
searching for changes
adding changesets
adding manifests
adding file changes
added 3 changesets with 584 changes to 580 files
(run 'hg update' to get a working copy)
+ hg update
580 files updated, 0 files merged, 576 files removed, 0 files unresolved
+ ./autogen.sh
+ ./configure --with-parallel-jobs=3 --with-openjdk-src-zip=/notnfs/nighttester/drops/openjdk-6-src-b23-05_jul_2011.tar.gz --with-cacao-src-zip=/notnfs/nighttester/drops/cacao-dd4532afd08a.tar.bz2 --with-hotspot-src-zip=/notnfs/nighttester/drops/hs20.tar.gz --with-jaxp-drop-zip=/notnfs/nighttester/drops/jaxp6.zip --with-jaf-drop-zip=/notnfs/nighttester/drops/jaf6.zip --with-jaxws-drop-zip=/notnfs/nighttester/drops/jaxws6.zip --enable-systemtap
checking for a BSD-compatible install... /usr/bin/install -c
checking whether build environment is sane... yes
checking for a thread-safe mkdir -p... /bin/mkdir -p
checking for gawk... gawk
checking whether make sets $(MAKE)... yes
checking how to create a pax tar archive... gnutar
checking build system type... x86_64-unknown-linux-gnu
checking host system type... x86_64-unknown-linux-gnu
checking for gcc... gcc
checking whether the C compiler works... yes
checking for C compiler default output file name... a.out
checking for suffix of executables...
checking whether we are cross compiling... no
checking for suffix of object files... o
checking whether we are using the GNU C compiler... yes
checking whether gcc accepts -g... yes
checking for gcc option to accept ISO C89... none needed
checking for style of include used by make... GNU
checking dependency style of gcc... none
checking for g++... g++
checking whether we are using the GNU C++ compiler... yes
checking whether g++ accepts -g... yes
checking dependency style of g++... none
checking for make... /usr/bin/make
checking for gzip... /bin/gzip
checking for ant... /usr/bin/ant
checking for find... /bin/find
checking for patch... /usr/bin/patch
checking for tar... /bin/tar
checking for chmod... /bin/chmod
checking for sha256sum... /usr/bin/sha256sum
checking for wget... /usr/bin/wget
checking for zip... /usr/bin/zip
checking for unzip... /usr/bin/unzip
checking for cpio... /bin/cpio
checking for file... /usr/bin/file
checking for fastjar... fastjar
checking for ldd... ldd
checking for gawk... /bin/gawk
checking for hg... /usr/bin/hg
checking for an OpenJDK source directory... /notnfs/nighttester/icedtea6-target-testing/openjdk
checking for IcedTea Mercurial revision ID... r944802f79a48+
checking for JDK Mercurial revision ID... none
checking for HotSpot Mercurial revision ID... none
checking for lsb_release... /usr/bin/lsb_release
checking whether to compile ecj natively... no
checking which HotSpot build to use... original
checking for linux32... /usr/bin/linux32
checking version of GCC... 4.5.1 (major version 4, minor version 5)
checking for getconf... /usr/bin/getconf
checking the number of online processors... 2
checking how many parallel build jobs to execute... 3
checking if cp supports --reflink... yes
checking if we can hard link rather than copy from /notnfs/nighttester/icedtea6-target-testing... yes
checking if a PaX-enabled kernel is running... no
checking for system library directory...
checking for pkg-config... /usr/bin/pkg-config
checking pkg-config is at least version 0.9.0... yes
checking for NSS... yes
checking whether to disable the execution of the JTReg tests... no
checking whether to disable the execution of the HotSpot JTReg tests... no
checking whether to disable the execution of the langtools JTReg tests... no
checking whether to disable the execution of the JDK JTReg tests... no
checking for xvfb-run... xvfb-run -a -e xvfb-errors
checking for an Ant home directory... /usr/share/ant
checking whether to include PulseAudio support... no
checking whether to build documentation... yes
checking whether to enable experimental OpenJDK cross-compilation support... no
checking whether to include the XRender pipeline... yes
checking whether to include NIO2 support... no
checking whether to include SystemTap tracing support... yes
checking whether to include the NSS-based security provider... disabled by default (edit java.security to enable)
checking for distribution package version... none
checking build identification... Built on Fedora release 14 (Laughlin) (Fri Oct 14 00:03:12 EDT 2011)
checking whether to build a bootstrap version first... yes
checking for a JDK home directory... /usr/lib/jvm/java-gcj
checking if a java binary was specified... no
checking if /usr/lib/jvm/java-gcj/bin/java is a valid executable file... yes
checking for javac... /usr/lib/jvm/java-1.6.0-openjdk.x86_64/bin/javac
checking if a javah binary was specified... no
checking if /usr/lib/jvm/java-gcj/bin/javah is a valid executable file... yes
checking if a jar binary was specified... no
checking if /usr/lib/jvm/java-gcj/bin/jar is a valid executable file... yes
checking whether jar supports @<file> argument... yes
checking whether jar supports stdin file arguments... yes
checking whether jar supports -J options at the end... yes
checking if a rmic binary was specified... no
checking if /usr/lib/jvm/java-gcj/bin/rmic is a valid executable file... yes
checking if a native2ascii binary was specified... no
checking if /usr/lib/jvm/java-gcj/bin/native2ascii is a valid executable file... no
checking for native2ascii... /usr/lib/jvm/java-1.6.0-openjdk.x86_64/bin/native2ascii
checking for an ecj JAR file... /usr/share/java/eclipse-ecj.jar
checking for xsltproc... /usr/bin/xsltproc
checking whether to include Javascript support via Rhino... /usr/share/java/rhino.jar
checking for an OpenJDK source zip... /notnfs/nighttester/drops/openjdk-6-src-b23-05_jul_2011.tar.gz
checking for a HotSpot source zip... /notnfs/nighttester/drops/hs20.tar.gz
checking for an alternate jar command... not specified
checking for a JAXP drop zip... /notnfs/nighttester/drops/jaxp6.zip
checking for a JAF drop zip... /notnfs/nighttester/drops/jaf6.zip
checking for a JAXWS drop zip... /notnfs/nighttester/drops/jaxws6.zip
checking whether to use CACAO as VM... no
checking for a CACAO home directory... $(abs_top_builddir)/cacao/install
checking for a CACAO source zip... /notnfs/nighttester/drops/cacao-dd4532afd08a.tar.bz2
checking for a CACAO source directory... not specified
checking whether to use JamVM as VM... no
checking for a JamVM source zip... not specified
checking whether to disable optimizations and build with -O0 -g... no
checking whether to use the Shark JIT... no
checking how to run the C preprocessor... gcc -E
checking for grep that handles long lines and -e... /bin/grep
checking for egrep... /bin/grep -E
checking for ANSI C header files... yes
checking for sys/types.h... yes
checking for sys/stat.h... yes
checking for stdlib.h... yes
checking for string.h... yes
checking for memory.h... yes
checking for strings.h... yes
checking for inttypes.h... yes
checking for stdint.h... yes
checking for unistd.h... yes
checking whether to use the zero-assembler port... no
checking whether byte ordering is bigendian... no
checking for additional virtual machines to build... none
checking whether to retrieve the source code from Mercurial... no
checking which Mercurial revision to use... tip
checking which Java timezone data directory to use... /usr/share/javazi
checking if javax.xml.stream.events.Attribute.getDTDType() wrongly returns a QName... no
checking if /usr/lib/jvm/java-gcj/bin/javah exhibits Classpath bug 39408... yes
checking if /usr/lib/jvm/java-gcj/bin/javah exhibits Classpath bug 40188... yes
checking cups/cups.h usability... yes
checking cups/cups.h presence... yes
checking for cups/cups.h... yes
checking cups/ppd.h usability... yes
checking cups/ppd.h presence... yes
checking for cups/ppd.h... yes
checking X11/X.h usability... yes
checking X11/X.h presence... yes
checking for X11/X.h... yes
checking for main in -ljpeg... yes
checking for main in -lgif... yes
checking for main in -lz... yes
checking for XPROTO... yes
checking for XT... yes
checking for XP... yes
checking for X11... yes
checking for XINERAMA... yes
checking for XRENDER... yes
checking sys/sdt.h usability... yes
checking sys/sdt.h presence... yes
checking for sys/sdt.h... yes
checking working sys/sdt.h and g++ support... yes
checking for absolute java home install dir... /notnfs/nighttester/icedtea6-target-testing/openjdk.build/j2sdk-image
checking for LIBPNG... yes
checking for XTST... yes
checking for FREETYPE2... yes
checking for ALSA... yes
configure: creating ./config.status
config.status: creating Makefile
config.status: creating nss.cfg
config.status: creating javac
config.status: creating javap
config.status: creating jvm.cfg
config.status: creating ergo.c
config.status: creating tz.properties
config.status: creating tapset/hotspot.stp
config.status: creating tapset/hotspot_jni.stp
config.status: creating tapset/jstack.stp
config.status: executing depfiles commands
+ make env-ecj
Makefile:484: *** Recursive variable `TEST_SUITES' references itself (eventually). Stop.
+ exit 1
Build step 'Execute shell' marked build as failure

Search Discussions

  • Hudson Admin at Oct 14, 2011 at 9:50 pm
    See <http://toadeater:8080/job/IcedTea6TargetTesting/825/>

    ------------------------------------------
    [...truncated 125959 lines...]
    Passed: tools/javac/FlatnameClash.java
    Passed: tools/javac/FlatnameClash2.java
    Passed: tools/javac/FoldConditional.java
    Passed: tools/javac/GoodCovar.java
    Passed: tools/javac/HexFloatLiterals.java
    Passed: tools/javac/HexThree.java
    Passed: tools/javac/IllDefinedOrderOfInit.java
    Passed: tools/javac/IllegalAnnotation.java
    Passed: tools/javac/IllegallyOptimizedException.java
    Passed: tools/javac/ImplicitToString.java
    Passed: tools/javac/InconsistentInheritedSignature.java
    Passed: tools/javac/InconsistentStack.java
    Passed: tools/javac/Increment.java
    Passed: tools/javac/InheritedPrivateImpl.java
    Passed: tools/javac/InitializerCompletion_1.java
    Passed: tools/javac/InitializerCompletion_2.java
    Passed: tools/javac/InitializerCompletion_3.java
    Passed: tools/javac/InitializerCompletion_4.java
    Passed: tools/javac/InnerMemberRegression.java
    Passed: tools/javac/InnerMethSig.java
    Passed: tools/javac/InnerNamedConstant_1.java
    Passed: tools/javac/InnerNamedConstant_2.java
    Passed: tools/javac/InnerTruth.java
    Passed: tools/javac/InstanceInitException_1.java
    Passed: tools/javac/InstanceInitException_2.java
    Passed: tools/javac/InterfaceAssert.java
    Passed: tools/javac/InterfaceFieldParsing_1.java
    Passed: tools/javac/InterfaceInInner.java
    Passed: tools/javac/InterfaceMemberClassModifiers.java
    Passed: tools/javac/InterfaceObjectIncompatibility.java
    Passed: tools/javac/InterfaceObjectInheritance.java
    Passed: tools/javac/InterfaceOverrideCheck.java
    Passed: tools/javac/InterfaceOverrideFinal.java
    Passed: tools/javac/InterfaceOverrideObject.java
    Passed: tools/javac/InvalidIntfCast.java
    Passed: tools/javac/JsrRet.java
    Passed: tools/javac/LabeledDeclaration.java
    Passed: tools/javac/LabelHiding_1.java
    Passed: tools/javac/LocalClasses_1.java
    Passed: tools/javac/LocalClasses_2.java
    Passed: tools/javac/ManyMembers2.java
    Passed: tools/javac/MemberTypeInheritance.java
    Passed: tools/javac/MissingInclude.java
    Passed: tools/javac/NameCollision.java
    Passed: tools/javac/NameCollision2.java
    Passed: tools/javac/NestedDuplicateLabels.java
    Passed: tools/javac/NestedFinallyReturn.java
    Passed: tools/javac/NestedInnerClassNames.java
    Passed: tools/javac/NewGeneric.java
    Passed: tools/javac/NoClass.java
    Passed: tools/javac/NoNoClassDefFoundErrorError.java
    Passed: tools/javac/NonStaticFieldExpr1.java
    Passed: tools/javac/NonStaticFieldExpr2.java
    Passed: tools/javac/NonStaticFieldExpr3.java
    Passed: tools/javac/NonStaticFieldExpr4c.java
    Passed: tools/javac/NonStaticFinalVar.java
    Passed: tools/javac/Null2DArray.java
    Passed: tools/javac/NullQualifiedNew.java
    Passed: tools/javac/NullQualifiedNew2.java
    Passed: tools/javac/NullQualifiedSuper1.java
    Passed: tools/javac/NullQualifiedSuper2.java
    Passed: tools/javac/NullStaticQualifier.java
    Passed: tools/javac/Object1.java
    Passed: tools/javac/Object2.java
    Passed: tools/javac/ObjectIncompatibleInterface.java
    Passed: tools/javac/ObjectMethodRefFromInterface.java
    Passed: tools/javac/OuterParameter_1.java
    Passed: tools/javac/OverridePosition.java
    Passed: tools/javac/Parens1.java
    Passed: tools/javac/Parens2.java
    Passed: tools/javac/Parens3.java
    Passed: tools/javac/Parens4.java
    Passed: tools/javac/ParseConditional.java
    Passed: tools/javac/PrivateLocalConstructor.java
    Passed: tools/javac/PrivateUplevelConstant.java
    Passed: tools/javac/QualifiedConstant.java
    Passed: tools/javac/QualifiedNew.java
    Passed: tools/javac/QualifiedNewScope.java
    Passed: tools/javac/QualifiedOuterThis.java
    Passed: tools/javac/QualifiedOuterThis2.java
    Passed: tools/javac/QualifiedThisAndSuper_1.java
    Passed: tools/javac/QualifiedThisAndSuper_2.java
    Passed: tools/javac/QualifiedThisAndSuper_3.java
    Passed: tools/javac/QualifiedThisExactMatch.java
    Passed: tools/javac/RawCrash.java
    Passed: tools/javac/ReturnAfterIfThenElse.java
    Passed: tools/javac/SerialWarn.java
    Passed: tools/javac/ShiftExpressionTest.java
    Passed: tools/javac/Source5.java
    Passed: tools/javac/StandaloneQualifiedSuper.java
    Passed: tools/javac/StaticBlockScope.java
    Passed: tools/javac/StoreClass.java
    Passed: tools/javac/StrictAbstract.java
    Passed: tools/javac/StringAppendAccessMethodOnLHS.java
    Passed: tools/javac/StringConversion.java
    Passed: tools/javac/SuperclassConstructorException.java
    Passed: tools/javac/SuperField.java
    Passed: tools/javac/SuperMeth.java
    Passed: tools/javac/SuperMethodResolve.java
    Passed: tools/javac/SuperNew.java
    Passed: tools/javac/SuperNew2.java
    Passed: tools/javac/SuperNew3.java
    Passed: tools/javac/SuperNew4.java
    Passed: tools/javac/SwitchFence.java
    Passed: tools/javac/SwitchScope.java
    Passed: tools/javac/SynchronizedClass.java
    Passed: tools/javac/SynthName1.java
    Passed: tools/javac/SynthName2.java
    Passed: tools/javac/T4906100.java
    Passed: tools/javac/T5048776.java
    Passed: tools/javac/T5092545.java
    Passed: tools/javac/T5105890.java
    Passed: tools/javac/T6214885.java
    Passed: tools/javac/T6224167.java
    Passed: tools/javac/T6227617.java
    Passed: tools/javac/T6230128.java
    Passed: tools/javac/T6231847.java
    Passed: tools/javac/T6232928.java
    Passed: tools/javac/T6234077.java
    Passed: tools/javac/T6238612.java
    Passed: tools/javac/T6241723.java
    Passed: tools/javac/T6245591.java
    Passed: tools/javac/T6247324.java
    Passed: tools/javac/T6265400.java
    Passed: tools/javac/T6266772.java
    Passed: tools/javac/T6294589.java
    Passed: tools/javac/T6304128.java
    Passed: tools/javac/T6306967.java
    Passed: tools/javac/T6341023.java
    Passed: tools/javac/T6351767.java
    Passed: tools/javac/T6358024.java
    Passed: tools/javac/T6358166.java
    Passed: tools/javac/T6358168.java
    Passed: tools/javac/T6361619.java
    Passed: tools/javac/T6366196.java
    Passed: tools/javac/T6370653.java
    Passed: tools/javac/T6379327.java
    Passed: tools/javac/T6394563.java
    Passed: tools/javac/T6395974.java
    Passed: tools/javac/T6397044.java
    Passed: tools/javac/T6397286.java
    Passed: tools/javac/T6403466.java
    Passed: tools/javac/T6404756.java
    Passed: tools/javac/T6406771.java
    Passed: tools/javac/T6407066.java
    Passed: tools/javac/T6407257.java
    Passed: tools/javac/T6410706.java
    Passed: tools/javac/T6411379.java
    Passed: tools/javac/T6413876.java
    Passed: tools/javac/T6423583.java
    Passed: tools/javac/T6557865.java
    Passed: tools/javac/T6558476.java
    Passed: tools/javac/T6595666.java
    Passed: tools/javac/T6625520.java
    Passed: tools/javac/T6705935.java
    Passed: tools/javac/T6725036.java
    Passed: tools/javac/T6759996.java
    Passed: tools/javac/T6855236.java
    Passed: tools/javac/T6882235.java
    Passed: tools/javac/T6956638.java
    Passed: tools/javac/ThrowNull.java
    Passed: tools/javac/ThrowsIntersection_1.java
    Passed: tools/javac/ThrowsIntersection_2.java
    Passed: tools/javac/ThrowsIntersection_3.java
    Passed: tools/javac/ThrowsIntersection_4.java
    Passed: tools/javac/TryInInstanceInit.java
    Passed: tools/javac/UncaughtOverflow.java
    Passed: tools/javac/UncaughtOverflow2.java
    Passed: tools/javac/UnreachableVar.java
    Passed: tools/javac/UnterminatedLineComment.java
    Passed: tools/javac/UplevelFromAnonInSuperCall.java
    Passed: tools/javac/UseEnum.java
    Passed: tools/javac/VarDeclarationWithAssignment.java
    Passed: tools/javac/Verify.java
    Passed: tools/javac/VerifyDA.java
    Passed: tools/javac/VersionOpt.java
    Passed: tools/javac/VoidArray.java
    Passed: tools/javadoc/6176978/T6176978.java
    Passed: tools/javadoc/annotations/annotateMethodsFields/Main.java
    Passed: tools/javadoc/annotations/annotatePackage/Main.java
    Passed: tools/javadoc/annotations/annotateParams/Main.java
    Passed: tools/javadoc/annotations/badVals/Main.java
    Passed: tools/javadoc/annotations/defaults/Main.java
    Passed: tools/javadoc/annotations/elementTypes/Main.java
    Passed: tools/javadoc/annotations/shortcuts/Main.java
    Passed: tools/javadoc/badSuper/BadSuper.java
    Passed: tools/javadoc/completionFailure/CompletionFailure.java
    Passed: tools/javadoc/dupOk/DupOk.java
    Passed: tools/javadoc/enum/docComments/Main.java
    Passed: tools/javadoc/enum/enumType/Main.java
    Passed: tools/javadoc/generics/genericClass/Main.java
    Passed: tools/javadoc/generics/genericInnerAndOuter/Main.java
    Passed: tools/javadoc/generics/genericInterface/Main.java
    Passed: tools/javadoc/generics/genericMethod/Main.java
    Passed: tools/javadoc/generics/genericSuper/Main.java
    Passed: tools/javadoc/generics/supertypes/Main.java
    Passed: tools/javadoc/generics/throwsGeneric/Main.java
    Passed: tools/javadoc/generics/tparamCycle/Main.java
    Passed: tools/javadoc/generics/tparamTagOnMethod/Main.java
    Passed: tools/javadoc/generics/tparamTagOnType/Main.java
    Passed: tools/javadoc/generics/wildcards/Main.java
    Passed: tools/javadoc/imports/MissingImport.java
    Passed: tools/javadoc/nestedClass/NestedClass.java
    Passed: tools/javadoc/outputRedirect/Test.java
    Passed: tools/javadoc/sourceOnly/Test.java
    Passed: tools/javadoc/sourceOption/SourceOption.java
    Passed: tools/javadoc/subpackageIgnore/SubpackageIgnore.java
    Passed: tools/javadoc/T4994049/T4994049.java
    Passed: tools/javadoc/varArgs/Main.java
    Passed: tools/javadoc/BooleanConst.java
    Passed: tools/javadoc/BreakIteratorWarning.java
    Passed: tools/javadoc/FlagsTooEarly.java
    Passed: tools/javadoc/InlineTagsWithBraces.java
    Passed: tools/javadoc/LangVers.java
    Passed: tools/javadoc/MethodLinks.java
    Passed: tools/javadoc/NoStar.java
    Passed: tools/javadoc/XWerror.java
    Passed: tools/javah/6257087/foo.sh
    Passed: tools/javah/ConstMacroTest.sh
    Passed: tools/javah/MissingParamClassTest.sh
    Passed: tools/javah/ReadOldClass.sh
    Passed: tools/javah/T5070898.java
    Passed: tools/javap/stackmap/T6271292.sh
    Passed: tools/javap/ExtPath.java
    Passed: tools/javap/pathsep.sh
    Passed: tools/javap/PublicInterfaceTest.sh
    Test results: passed: 1,416
    Report written to /notnfs/nighttester/icedtea6-target-testing/test/langtools/JTreport/html/report.html
    Results written to /notnfs/nighttester/icedtea6-target-testing/test/langtools/JTwork
    test -z `grep \"^Error:\|^FAILED:\" test/check-langtools.log`
    for i in hotspot jdk langtools; do \
    echo "--------------- jtreg console summary for $i ---------------"; \
    egrep -v '^(Passed:|Directory|Re[a-z]+\ written\ to)' test/check-$i.log; \
    done | tee test/jtreg-summary.log
    --------------- jtreg console summary for hotspot ---------------
    FAILED: runtime/6196102/LoopTest.java
    Test results: passed: 109; failed: 1
    --------------- jtreg console summary for jdk ---------------
    --------------- jtreg console summary for langtools ---------------
    Test results: passed: 1,416
    : # kill testsuite processes still hanging
    nothing to cleanup
    if [ -e bootstrap ]; then \
    rmdir bootstrap ; \
    fi
    rmdir: failed to remove `bootstrap': Directory not empty
    make: *** [clean-local] Error 1
    + exit 1
    Build step 'Execute shell' marked build as failure
  • Hudson Admin at Oct 15, 2011 at 10:18 pm
    See <http://toadeater:8080/job/IcedTea6TargetTesting/826/>

    ------------------------------------------
    [...truncated 170441 lines...]
    Passed: tools/javac/FlatnameClash.java
    Passed: tools/javac/FlatnameClash2.java
    Passed: tools/javac/FoldConditional.java
    Passed: tools/javac/GoodCovar.java
    Passed: tools/javac/HexFloatLiterals.java
    Passed: tools/javac/HexThree.java
    Passed: tools/javac/IllDefinedOrderOfInit.java
    Passed: tools/javac/IllegalAnnotation.java
    Passed: tools/javac/IllegallyOptimizedException.java
    Passed: tools/javac/ImplicitToString.java
    Passed: tools/javac/InconsistentInheritedSignature.java
    Passed: tools/javac/InconsistentStack.java
    Passed: tools/javac/Increment.java
    Passed: tools/javac/InheritedPrivateImpl.java
    Passed: tools/javac/InitializerCompletion_1.java
    Passed: tools/javac/InitializerCompletion_2.java
    Passed: tools/javac/InitializerCompletion_3.java
    Passed: tools/javac/InitializerCompletion_4.java
    Passed: tools/javac/InnerMemberRegression.java
    Passed: tools/javac/InnerMethSig.java
    Passed: tools/javac/InnerNamedConstant_1.java
    Passed: tools/javac/InnerNamedConstant_2.java
    Passed: tools/javac/InnerTruth.java
    Passed: tools/javac/InstanceInitException_1.java
    Passed: tools/javac/InstanceInitException_2.java
    Passed: tools/javac/InterfaceAssert.java
    Passed: tools/javac/InterfaceFieldParsing_1.java
    Passed: tools/javac/InterfaceInInner.java
    Passed: tools/javac/InterfaceMemberClassModifiers.java
    Passed: tools/javac/InterfaceObjectIncompatibility.java
    Passed: tools/javac/InterfaceObjectInheritance.java
    Passed: tools/javac/InterfaceOverrideCheck.java
    Passed: tools/javac/InterfaceOverrideFinal.java
    Passed: tools/javac/InterfaceOverrideObject.java
    Passed: tools/javac/InvalidIntfCast.java
    Passed: tools/javac/JsrRet.java
    Passed: tools/javac/LabeledDeclaration.java
    Passed: tools/javac/LabelHiding_1.java
    Passed: tools/javac/LocalClasses_1.java
    Passed: tools/javac/LocalClasses_2.java
    Passed: tools/javac/ManyMembers2.java
    Passed: tools/javac/MemberTypeInheritance.java
    Passed: tools/javac/MissingInclude.java
    Passed: tools/javac/NameCollision.java
    Passed: tools/javac/NameCollision2.java
    Passed: tools/javac/NestedDuplicateLabels.java
    Passed: tools/javac/NestedFinallyReturn.java
    Passed: tools/javac/NestedInnerClassNames.java
    Passed: tools/javac/NewGeneric.java
    Passed: tools/javac/NoClass.java
    Passed: tools/javac/NoNoClassDefFoundErrorError.java
    Passed: tools/javac/NonStaticFieldExpr1.java
    Passed: tools/javac/NonStaticFieldExpr2.java
    Passed: tools/javac/NonStaticFieldExpr3.java
    Passed: tools/javac/NonStaticFieldExpr4c.java
    Passed: tools/javac/NonStaticFinalVar.java
    Passed: tools/javac/Null2DArray.java
    Passed: tools/javac/NullQualifiedNew.java
    Passed: tools/javac/NullQualifiedNew2.java
    Passed: tools/javac/NullQualifiedSuper1.java
    Passed: tools/javac/NullQualifiedSuper2.java
    Passed: tools/javac/NullStaticQualifier.java
    Passed: tools/javac/Object1.java
    Passed: tools/javac/Object2.java
    Passed: tools/javac/ObjectIncompatibleInterface.java
    Passed: tools/javac/ObjectMethodRefFromInterface.java
    Passed: tools/javac/OuterParameter_1.java
    Passed: tools/javac/OverridePosition.java
    Passed: tools/javac/Parens1.java
    Passed: tools/javac/Parens2.java
    Passed: tools/javac/Parens3.java
    Passed: tools/javac/Parens4.java
    Passed: tools/javac/ParseConditional.java
    Passed: tools/javac/PrivateLocalConstructor.java
    Passed: tools/javac/PrivateUplevelConstant.java
    Passed: tools/javac/QualifiedConstant.java
    Passed: tools/javac/QualifiedNew.java
    Passed: tools/javac/QualifiedNewScope.java
    Passed: tools/javac/QualifiedOuterThis.java
    Passed: tools/javac/QualifiedOuterThis2.java
    Passed: tools/javac/QualifiedThisAndSuper_1.java
    Passed: tools/javac/QualifiedThisAndSuper_2.java
    Passed: tools/javac/QualifiedThisAndSuper_3.java
    Passed: tools/javac/QualifiedThisExactMatch.java
    Passed: tools/javac/RawCrash.java
    Passed: tools/javac/ReturnAfterIfThenElse.java
    Passed: tools/javac/SerialWarn.java
    Passed: tools/javac/ShiftExpressionTest.java
    Passed: tools/javac/Source5.java
    Passed: tools/javac/StandaloneQualifiedSuper.java
    Passed: tools/javac/StaticBlockScope.java
    Passed: tools/javac/StoreClass.java
    Passed: tools/javac/StrictAbstract.java
    Passed: tools/javac/StringAppendAccessMethodOnLHS.java
    Passed: tools/javac/StringConversion.java
    Passed: tools/javac/SuperclassConstructorException.java
    Passed: tools/javac/SuperField.java
    Passed: tools/javac/SuperMeth.java
    Passed: tools/javac/SuperMethodResolve.java
    Passed: tools/javac/SuperNew.java
    Passed: tools/javac/SuperNew2.java
    Passed: tools/javac/SuperNew3.java
    Passed: tools/javac/SuperNew4.java
    Passed: tools/javac/SwitchFence.java
    Passed: tools/javac/SwitchScope.java
    Passed: tools/javac/SynchronizedClass.java
    Passed: tools/javac/SynthName1.java
    Passed: tools/javac/SynthName2.java
    Passed: tools/javac/T4906100.java
    Passed: tools/javac/T5048776.java
    Passed: tools/javac/T5092545.java
    Passed: tools/javac/T5105890.java
    Passed: tools/javac/T6214885.java
    Passed: tools/javac/T6224167.java
    Passed: tools/javac/T6227617.java
    Passed: tools/javac/T6230128.java
    Passed: tools/javac/T6231847.java
    Passed: tools/javac/T6232928.java
    Passed: tools/javac/T6234077.java
    Passed: tools/javac/T6238612.java
    Passed: tools/javac/T6241723.java
    Passed: tools/javac/T6245591.java
    Passed: tools/javac/T6247324.java
    Passed: tools/javac/T6265400.java
    Passed: tools/javac/T6266772.java
    Passed: tools/javac/T6294589.java
    Passed: tools/javac/T6304128.java
    Passed: tools/javac/T6306967.java
    Passed: tools/javac/T6341023.java
    Passed: tools/javac/T6351767.java
    Passed: tools/javac/T6358024.java
    Passed: tools/javac/T6358166.java
    Passed: tools/javac/T6358168.java
    Passed: tools/javac/T6361619.java
    Passed: tools/javac/T6366196.java
    Passed: tools/javac/T6370653.java
    Passed: tools/javac/T6379327.java
    Passed: tools/javac/T6394563.java
    Passed: tools/javac/T6395974.java
    Passed: tools/javac/T6397044.java
    Passed: tools/javac/T6397286.java
    Passed: tools/javac/T6403466.java
    Passed: tools/javac/T6404756.java
    Passed: tools/javac/T6406771.java
    Passed: tools/javac/T6407066.java
    Passed: tools/javac/T6407257.java
    Passed: tools/javac/T6410706.java
    Passed: tools/javac/T6411379.java
    Passed: tools/javac/T6413876.java
    Passed: tools/javac/T6423583.java
    Passed: tools/javac/T6557865.java
    Passed: tools/javac/T6558476.java
    Passed: tools/javac/T6595666.java
    Passed: tools/javac/T6625520.java
    Passed: tools/javac/T6705935.java
    Passed: tools/javac/T6725036.java
    Passed: tools/javac/T6759996.java
    Passed: tools/javac/T6855236.java
    Passed: tools/javac/T6882235.java
    Passed: tools/javac/T6956638.java
    Passed: tools/javac/ThrowNull.java
    Passed: tools/javac/ThrowsIntersection_1.java
    Passed: tools/javac/ThrowsIntersection_2.java
    Passed: tools/javac/ThrowsIntersection_3.java
    Passed: tools/javac/ThrowsIntersection_4.java
    Passed: tools/javac/TryInInstanceInit.java
    Passed: tools/javac/UncaughtOverflow.java
    Passed: tools/javac/UncaughtOverflow2.java
    Passed: tools/javac/UnreachableVar.java
    Passed: tools/javac/UnterminatedLineComment.java
    Passed: tools/javac/UplevelFromAnonInSuperCall.java
    Passed: tools/javac/UseEnum.java
    Passed: tools/javac/VarDeclarationWithAssignment.java
    Passed: tools/javac/Verify.java
    Passed: tools/javac/VerifyDA.java
    Passed: tools/javac/VersionOpt.java
    Passed: tools/javac/VoidArray.java
    Passed: tools/javadoc/6176978/T6176978.java
    Passed: tools/javadoc/annotations/annotateMethodsFields/Main.java
    Passed: tools/javadoc/annotations/annotatePackage/Main.java
    Passed: tools/javadoc/annotations/annotateParams/Main.java
    Passed: tools/javadoc/annotations/badVals/Main.java
    Passed: tools/javadoc/annotations/defaults/Main.java
    Passed: tools/javadoc/annotations/elementTypes/Main.java
    Passed: tools/javadoc/annotations/shortcuts/Main.java
    Passed: tools/javadoc/badSuper/BadSuper.java
    Passed: tools/javadoc/completionFailure/CompletionFailure.java
    Passed: tools/javadoc/dupOk/DupOk.java
    Passed: tools/javadoc/enum/docComments/Main.java
    Passed: tools/javadoc/enum/enumType/Main.java
    Passed: tools/javadoc/generics/genericClass/Main.java
    Passed: tools/javadoc/generics/genericInnerAndOuter/Main.java
    Passed: tools/javadoc/generics/genericInterface/Main.java
    Passed: tools/javadoc/generics/genericMethod/Main.java
    Passed: tools/javadoc/generics/genericSuper/Main.java
    Passed: tools/javadoc/generics/supertypes/Main.java
    Passed: tools/javadoc/generics/throwsGeneric/Main.java
    Passed: tools/javadoc/generics/tparamCycle/Main.java
    Passed: tools/javadoc/generics/tparamTagOnMethod/Main.java
    Passed: tools/javadoc/generics/tparamTagOnType/Main.java
    Passed: tools/javadoc/generics/wildcards/Main.java
    Passed: tools/javadoc/imports/MissingImport.java
    Passed: tools/javadoc/nestedClass/NestedClass.java
    Passed: tools/javadoc/outputRedirect/Test.java
    Passed: tools/javadoc/sourceOnly/Test.java
    Passed: tools/javadoc/sourceOption/SourceOption.java
    Passed: tools/javadoc/subpackageIgnore/SubpackageIgnore.java
    Passed: tools/javadoc/T4994049/T4994049.java
    Passed: tools/javadoc/varArgs/Main.java
    Passed: tools/javadoc/BooleanConst.java
    Passed: tools/javadoc/BreakIteratorWarning.java
    Passed: tools/javadoc/FlagsTooEarly.java
    Passed: tools/javadoc/InlineTagsWithBraces.java
    Passed: tools/javadoc/LangVers.java
    Passed: tools/javadoc/MethodLinks.java
    Passed: tools/javadoc/NoStar.java
    Passed: tools/javadoc/XWerror.java
    Passed: tools/javah/6257087/foo.sh
    Passed: tools/javah/ConstMacroTest.sh
    Passed: tools/javah/MissingParamClassTest.sh
    Passed: tools/javah/ReadOldClass.sh
    Passed: tools/javah/T5070898.java
    Passed: tools/javap/stackmap/T6271292.sh
    Passed: tools/javap/ExtPath.java
    Passed: tools/javap/pathsep.sh
    Passed: tools/javap/PublicInterfaceTest.sh
    Test results: passed: 1,416
    Report written to /notnfs/nighttester/icedtea6-target-testing/test/langtools/JTreport/html/report.html
    Results written to /notnfs/nighttester/icedtea6-target-testing/test/langtools/JTwork
    test -z `grep \"^Error:\|^FAILED:\" test/check-langtools.log`
    for i in hotspot jdk langtools; do \
    echo "--------------- jtreg console summary for $i ---------------"; \
    egrep -v '^(Passed:|Directory|Re[a-z]+\ written\ to)' test/check-$i.log; \
    done | tee test/jtreg-summary.log
    --------------- jtreg console summary for hotspot ---------------
    FAILED: runtime/6196102/LoopTest.java
    Test results: passed: 109; failed: 1
    --------------- jtreg console summary for jdk ---------------
    --------------- jtreg console summary for langtools ---------------
    Test results: passed: 1,416
    : # kill testsuite processes still hanging
    nothing to cleanup
    if [ -e bootstrap ]; then \
    rmdir bootstrap ; \
    fi
    rmdir: failed to remove `bootstrap': Directory not empty
    make: *** [clean-local] Error 1
    + exit 1
    Build step 'Execute shell' marked build as failure
  • Hudson Admin at Oct 16, 2011 at 10:18 pm
    See <http://toadeater:8080/job/IcedTea6TargetTesting/827/>

    ------------------------------------------
    [...truncated 170442 lines...]
    Passed: tools/javac/FlatnameClash.java
    Passed: tools/javac/FlatnameClash2.java
    Passed: tools/javac/FoldConditional.java
    Passed: tools/javac/GoodCovar.java
    Passed: tools/javac/HexFloatLiterals.java
    Passed: tools/javac/HexThree.java
    Passed: tools/javac/IllDefinedOrderOfInit.java
    Passed: tools/javac/IllegalAnnotation.java
    Passed: tools/javac/IllegallyOptimizedException.java
    Passed: tools/javac/ImplicitToString.java
    Passed: tools/javac/InconsistentInheritedSignature.java
    Passed: tools/javac/InconsistentStack.java
    Passed: tools/javac/Increment.java
    Passed: tools/javac/InheritedPrivateImpl.java
    Passed: tools/javac/InitializerCompletion_1.java
    Passed: tools/javac/InitializerCompletion_2.java
    Passed: tools/javac/InitializerCompletion_3.java
    Passed: tools/javac/InitializerCompletion_4.java
    Passed: tools/javac/InnerMemberRegression.java
    Passed: tools/javac/InnerMethSig.java
    Passed: tools/javac/InnerNamedConstant_1.java
    Passed: tools/javac/InnerNamedConstant_2.java
    Passed: tools/javac/InnerTruth.java
    Passed: tools/javac/InstanceInitException_1.java
    Passed: tools/javac/InstanceInitException_2.java
    Passed: tools/javac/InterfaceAssert.java
    Passed: tools/javac/InterfaceFieldParsing_1.java
    Passed: tools/javac/InterfaceInInner.java
    Passed: tools/javac/InterfaceMemberClassModifiers.java
    Passed: tools/javac/InterfaceObjectIncompatibility.java
    Passed: tools/javac/InterfaceObjectInheritance.java
    Passed: tools/javac/InterfaceOverrideCheck.java
    Passed: tools/javac/InterfaceOverrideFinal.java
    Passed: tools/javac/InterfaceOverrideObject.java
    Passed: tools/javac/InvalidIntfCast.java
    Passed: tools/javac/JsrRet.java
    Passed: tools/javac/LabeledDeclaration.java
    Passed: tools/javac/LabelHiding_1.java
    Passed: tools/javac/LocalClasses_1.java
    Passed: tools/javac/LocalClasses_2.java
    Passed: tools/javac/ManyMembers2.java
    Passed: tools/javac/MemberTypeInheritance.java
    Passed: tools/javac/MissingInclude.java
    Passed: tools/javac/NameCollision.java
    Passed: tools/javac/NameCollision2.java
    Passed: tools/javac/NestedDuplicateLabels.java
    Passed: tools/javac/NestedFinallyReturn.java
    Passed: tools/javac/NestedInnerClassNames.java
    Passed: tools/javac/NewGeneric.java
    Passed: tools/javac/NoClass.java
    Passed: tools/javac/NoNoClassDefFoundErrorError.java
    Passed: tools/javac/NonStaticFieldExpr1.java
    Passed: tools/javac/NonStaticFieldExpr2.java
    Passed: tools/javac/NonStaticFieldExpr3.java
    Passed: tools/javac/NonStaticFieldExpr4c.java
    Passed: tools/javac/NonStaticFinalVar.java
    Passed: tools/javac/Null2DArray.java
    Passed: tools/javac/NullQualifiedNew.java
    Passed: tools/javac/NullQualifiedNew2.java
    Passed: tools/javac/NullQualifiedSuper1.java
    Passed: tools/javac/NullQualifiedSuper2.java
    Passed: tools/javac/NullStaticQualifier.java
    Passed: tools/javac/Object1.java
    Passed: tools/javac/Object2.java
    Passed: tools/javac/ObjectIncompatibleInterface.java
    Passed: tools/javac/ObjectMethodRefFromInterface.java
    Passed: tools/javac/OuterParameter_1.java
    Passed: tools/javac/OverridePosition.java
    Passed: tools/javac/Parens1.java
    Passed: tools/javac/Parens2.java
    Passed: tools/javac/Parens3.java
    Passed: tools/javac/Parens4.java
    Passed: tools/javac/ParseConditional.java
    Passed: tools/javac/PrivateLocalConstructor.java
    Passed: tools/javac/PrivateUplevelConstant.java
    Passed: tools/javac/QualifiedConstant.java
    Passed: tools/javac/QualifiedNew.java
    Passed: tools/javac/QualifiedNewScope.java
    Passed: tools/javac/QualifiedOuterThis.java
    Passed: tools/javac/QualifiedOuterThis2.java
    Passed: tools/javac/QualifiedThisAndSuper_1.java
    Passed: tools/javac/QualifiedThisAndSuper_2.java
    Passed: tools/javac/QualifiedThisAndSuper_3.java
    Passed: tools/javac/QualifiedThisExactMatch.java
    Passed: tools/javac/RawCrash.java
    Passed: tools/javac/ReturnAfterIfThenElse.java
    Passed: tools/javac/SerialWarn.java
    Passed: tools/javac/ShiftExpressionTest.java
    Passed: tools/javac/Source5.java
    Passed: tools/javac/StandaloneQualifiedSuper.java
    Passed: tools/javac/StaticBlockScope.java
    Passed: tools/javac/StoreClass.java
    Passed: tools/javac/StrictAbstract.java
    Passed: tools/javac/StringAppendAccessMethodOnLHS.java
    Passed: tools/javac/StringConversion.java
    Passed: tools/javac/SuperclassConstructorException.java
    Passed: tools/javac/SuperField.java
    Passed: tools/javac/SuperMeth.java
    Passed: tools/javac/SuperMethodResolve.java
    Passed: tools/javac/SuperNew.java
    Passed: tools/javac/SuperNew2.java
    Passed: tools/javac/SuperNew3.java
    Passed: tools/javac/SuperNew4.java
    Passed: tools/javac/SwitchFence.java
    Passed: tools/javac/SwitchScope.java
    Passed: tools/javac/SynchronizedClass.java
    Passed: tools/javac/SynthName1.java
    Passed: tools/javac/SynthName2.java
    Passed: tools/javac/T4906100.java
    Passed: tools/javac/T5048776.java
    Passed: tools/javac/T5092545.java
    Passed: tools/javac/T5105890.java
    Passed: tools/javac/T6214885.java
    Passed: tools/javac/T6224167.java
    Passed: tools/javac/T6227617.java
    Passed: tools/javac/T6230128.java
    Passed: tools/javac/T6231847.java
    Passed: tools/javac/T6232928.java
    Passed: tools/javac/T6234077.java
    Passed: tools/javac/T6238612.java
    Passed: tools/javac/T6241723.java
    Passed: tools/javac/T6245591.java
    Passed: tools/javac/T6247324.java
    Passed: tools/javac/T6265400.java
    Passed: tools/javac/T6266772.java
    Passed: tools/javac/T6294589.java
    Passed: tools/javac/T6304128.java
    Passed: tools/javac/T6306967.java
    Passed: tools/javac/T6341023.java
    Passed: tools/javac/T6351767.java
    Passed: tools/javac/T6358024.java
    Passed: tools/javac/T6358166.java
    Passed: tools/javac/T6358168.java
    Passed: tools/javac/T6361619.java
    Passed: tools/javac/T6366196.java
    Passed: tools/javac/T6370653.java
    Passed: tools/javac/T6379327.java
    Passed: tools/javac/T6394563.java
    Passed: tools/javac/T6395974.java
    Passed: tools/javac/T6397044.java
    Passed: tools/javac/T6397286.java
    Passed: tools/javac/T6403466.java
    Passed: tools/javac/T6404756.java
    Passed: tools/javac/T6406771.java
    Passed: tools/javac/T6407066.java
    Passed: tools/javac/T6407257.java
    Passed: tools/javac/T6410706.java
    Passed: tools/javac/T6411379.java
    Passed: tools/javac/T6413876.java
    Passed: tools/javac/T6423583.java
    Passed: tools/javac/T6557865.java
    Passed: tools/javac/T6558476.java
    Passed: tools/javac/T6595666.java
    Passed: tools/javac/T6625520.java
    Passed: tools/javac/T6705935.java
    Passed: tools/javac/T6725036.java
    Passed: tools/javac/T6759996.java
    Passed: tools/javac/T6855236.java
    Passed: tools/javac/T6882235.java
    Passed: tools/javac/T6956638.java
    Passed: tools/javac/ThrowNull.java
    Passed: tools/javac/ThrowsIntersection_1.java
    Passed: tools/javac/ThrowsIntersection_2.java
    Passed: tools/javac/ThrowsIntersection_3.java
    Passed: tools/javac/ThrowsIntersection_4.java
    Passed: tools/javac/TryInInstanceInit.java
    Passed: tools/javac/UncaughtOverflow.java
    Passed: tools/javac/UncaughtOverflow2.java
    Passed: tools/javac/UnreachableVar.java
    Passed: tools/javac/UnterminatedLineComment.java
    Passed: tools/javac/UplevelFromAnonInSuperCall.java
    Passed: tools/javac/UseEnum.java
    Passed: tools/javac/VarDeclarationWithAssignment.java
    Passed: tools/javac/Verify.java
    Passed: tools/javac/VerifyDA.java
    Passed: tools/javac/VersionOpt.java
    Passed: tools/javac/VoidArray.java
    Passed: tools/javadoc/6176978/T6176978.java
    Passed: tools/javadoc/annotations/annotateMethodsFields/Main.java
    Passed: tools/javadoc/annotations/annotatePackage/Main.java
    Passed: tools/javadoc/annotations/annotateParams/Main.java
    Passed: tools/javadoc/annotations/badVals/Main.java
    Passed: tools/javadoc/annotations/defaults/Main.java
    Passed: tools/javadoc/annotations/elementTypes/Main.java
    Passed: tools/javadoc/annotations/shortcuts/Main.java
    Passed: tools/javadoc/badSuper/BadSuper.java
    Passed: tools/javadoc/completionFailure/CompletionFailure.java
    Passed: tools/javadoc/dupOk/DupOk.java
    Passed: tools/javadoc/enum/docComments/Main.java
    Passed: tools/javadoc/enum/enumType/Main.java
    Passed: tools/javadoc/generics/genericClass/Main.java
    Passed: tools/javadoc/generics/genericInnerAndOuter/Main.java
    Passed: tools/javadoc/generics/genericInterface/Main.java
    Passed: tools/javadoc/generics/genericMethod/Main.java
    Passed: tools/javadoc/generics/genericSuper/Main.java
    Passed: tools/javadoc/generics/supertypes/Main.java
    Passed: tools/javadoc/generics/throwsGeneric/Main.java
    Passed: tools/javadoc/generics/tparamCycle/Main.java
    Passed: tools/javadoc/generics/tparamTagOnMethod/Main.java
    Passed: tools/javadoc/generics/tparamTagOnType/Main.java
    Passed: tools/javadoc/generics/wildcards/Main.java
    Passed: tools/javadoc/imports/MissingImport.java
    Passed: tools/javadoc/nestedClass/NestedClass.java
    Passed: tools/javadoc/outputRedirect/Test.java
    Passed: tools/javadoc/sourceOnly/Test.java
    Passed: tools/javadoc/sourceOption/SourceOption.java
    Passed: tools/javadoc/subpackageIgnore/SubpackageIgnore.java
    Passed: tools/javadoc/T4994049/T4994049.java
    Passed: tools/javadoc/varArgs/Main.java
    Passed: tools/javadoc/BooleanConst.java
    Passed: tools/javadoc/BreakIteratorWarning.java
    Passed: tools/javadoc/FlagsTooEarly.java
    Passed: tools/javadoc/InlineTagsWithBraces.java
    Passed: tools/javadoc/LangVers.java
    Passed: tools/javadoc/MethodLinks.java
    Passed: tools/javadoc/NoStar.java
    Passed: tools/javadoc/XWerror.java
    Passed: tools/javah/6257087/foo.sh
    Passed: tools/javah/ConstMacroTest.sh
    Passed: tools/javah/MissingParamClassTest.sh
    Passed: tools/javah/ReadOldClass.sh
    Passed: tools/javah/T5070898.java
    Passed: tools/javap/stackmap/T6271292.sh
    Passed: tools/javap/ExtPath.java
    Passed: tools/javap/pathsep.sh
    Passed: tools/javap/PublicInterfaceTest.sh
    Test results: passed: 1,416
    Report written to /notnfs/nighttester/icedtea6-target-testing/test/langtools/JTreport/html/report.html
    Results written to /notnfs/nighttester/icedtea6-target-testing/test/langtools/JTwork
    test -z `grep \"^Error:\|^FAILED:\" test/check-langtools.log`
    for i in hotspot jdk langtools; do \
    echo "--------------- jtreg console summary for $i ---------------"; \
    egrep -v '^(Passed:|Directory|Re[a-z]+\ written\ to)' test/check-$i.log; \
    done | tee test/jtreg-summary.log
    --------------- jtreg console summary for hotspot ---------------
    FAILED: runtime/6196102/LoopTest.java
    Test results: passed: 109; failed: 1
    --------------- jtreg console summary for jdk ---------------
    --------------- jtreg console summary for langtools ---------------
    Test results: passed: 1,416
    : # kill testsuite processes still hanging
    nothing to cleanup
    if [ -e bootstrap ]; then \
    rmdir bootstrap ; \
    fi
    rmdir: failed to remove `bootstrap': Directory not empty
    make: *** [clean-local] Error 1
    + exit 1
    Build step 'Execute shell' marked build as failure
  • Hudson Admin at Oct 17, 2011 at 10:19 pm
    See <http://toadeater:8080/job/IcedTea6TargetTesting/828/>

    ------------------------------------------
    [...truncated 170442 lines...]
    Passed: tools/javac/FlatnameClash.java
    Passed: tools/javac/FlatnameClash2.java
    Passed: tools/javac/FoldConditional.java
    Passed: tools/javac/GoodCovar.java
    Passed: tools/javac/HexFloatLiterals.java
    Passed: tools/javac/HexThree.java
    Passed: tools/javac/IllDefinedOrderOfInit.java
    Passed: tools/javac/IllegalAnnotation.java
    Passed: tools/javac/IllegallyOptimizedException.java
    Passed: tools/javac/ImplicitToString.java
    Passed: tools/javac/InconsistentInheritedSignature.java
    Passed: tools/javac/InconsistentStack.java
    Passed: tools/javac/Increment.java
    Passed: tools/javac/InheritedPrivateImpl.java
    Passed: tools/javac/InitializerCompletion_1.java
    Passed: tools/javac/InitializerCompletion_2.java
    Passed: tools/javac/InitializerCompletion_3.java
    Passed: tools/javac/InitializerCompletion_4.java
    Passed: tools/javac/InnerMemberRegression.java
    Passed: tools/javac/InnerMethSig.java
    Passed: tools/javac/InnerNamedConstant_1.java
    Passed: tools/javac/InnerNamedConstant_2.java
    Passed: tools/javac/InnerTruth.java
    Passed: tools/javac/InstanceInitException_1.java
    Passed: tools/javac/InstanceInitException_2.java
    Passed: tools/javac/InterfaceAssert.java
    Passed: tools/javac/InterfaceFieldParsing_1.java
    Passed: tools/javac/InterfaceInInner.java
    Passed: tools/javac/InterfaceMemberClassModifiers.java
    Passed: tools/javac/InterfaceObjectIncompatibility.java
    Passed: tools/javac/InterfaceObjectInheritance.java
    Passed: tools/javac/InterfaceOverrideCheck.java
    Passed: tools/javac/InterfaceOverrideFinal.java
    Passed: tools/javac/InterfaceOverrideObject.java
    Passed: tools/javac/InvalidIntfCast.java
    Passed: tools/javac/JsrRet.java
    Passed: tools/javac/LabeledDeclaration.java
    Passed: tools/javac/LabelHiding_1.java
    Passed: tools/javac/LocalClasses_1.java
    Passed: tools/javac/LocalClasses_2.java
    Passed: tools/javac/ManyMembers2.java
    Passed: tools/javac/MemberTypeInheritance.java
    Passed: tools/javac/MissingInclude.java
    Passed: tools/javac/NameCollision.java
    Passed: tools/javac/NameCollision2.java
    Passed: tools/javac/NestedDuplicateLabels.java
    Passed: tools/javac/NestedFinallyReturn.java
    Passed: tools/javac/NestedInnerClassNames.java
    Passed: tools/javac/NewGeneric.java
    Passed: tools/javac/NoClass.java
    Passed: tools/javac/NoNoClassDefFoundErrorError.java
    Passed: tools/javac/NonStaticFieldExpr1.java
    Passed: tools/javac/NonStaticFieldExpr2.java
    Passed: tools/javac/NonStaticFieldExpr3.java
    Passed: tools/javac/NonStaticFieldExpr4c.java
    Passed: tools/javac/NonStaticFinalVar.java
    Passed: tools/javac/Null2DArray.java
    Passed: tools/javac/NullQualifiedNew.java
    Passed: tools/javac/NullQualifiedNew2.java
    Passed: tools/javac/NullQualifiedSuper1.java
    Passed: tools/javac/NullQualifiedSuper2.java
    Passed: tools/javac/NullStaticQualifier.java
    Passed: tools/javac/Object1.java
    Passed: tools/javac/Object2.java
    Passed: tools/javac/ObjectIncompatibleInterface.java
    Passed: tools/javac/ObjectMethodRefFromInterface.java
    Passed: tools/javac/OuterParameter_1.java
    Passed: tools/javac/OverridePosition.java
    Passed: tools/javac/Parens1.java
    Passed: tools/javac/Parens2.java
    Passed: tools/javac/Parens3.java
    Passed: tools/javac/Parens4.java
    Passed: tools/javac/ParseConditional.java
    Passed: tools/javac/PrivateLocalConstructor.java
    Passed: tools/javac/PrivateUplevelConstant.java
    Passed: tools/javac/QualifiedConstant.java
    Passed: tools/javac/QualifiedNew.java
    Passed: tools/javac/QualifiedNewScope.java
    Passed: tools/javac/QualifiedOuterThis.java
    Passed: tools/javac/QualifiedOuterThis2.java
    Passed: tools/javac/QualifiedThisAndSuper_1.java
    Passed: tools/javac/QualifiedThisAndSuper_2.java
    Passed: tools/javac/QualifiedThisAndSuper_3.java
    Passed: tools/javac/QualifiedThisExactMatch.java
    Passed: tools/javac/RawCrash.java
    Passed: tools/javac/ReturnAfterIfThenElse.java
    Passed: tools/javac/SerialWarn.java
    Passed: tools/javac/ShiftExpressionTest.java
    Passed: tools/javac/Source5.java
    Passed: tools/javac/StandaloneQualifiedSuper.java
    Passed: tools/javac/StaticBlockScope.java
    Passed: tools/javac/StoreClass.java
    Passed: tools/javac/StrictAbstract.java
    Passed: tools/javac/StringAppendAccessMethodOnLHS.java
    Passed: tools/javac/StringConversion.java
    Passed: tools/javac/SuperclassConstructorException.java
    Passed: tools/javac/SuperField.java
    Passed: tools/javac/SuperMeth.java
    Passed: tools/javac/SuperMethodResolve.java
    Passed: tools/javac/SuperNew.java
    Passed: tools/javac/SuperNew2.java
    Passed: tools/javac/SuperNew3.java
    Passed: tools/javac/SuperNew4.java
    Passed: tools/javac/SwitchFence.java
    Passed: tools/javac/SwitchScope.java
    Passed: tools/javac/SynchronizedClass.java
    Passed: tools/javac/SynthName1.java
    Passed: tools/javac/SynthName2.java
    Passed: tools/javac/T4906100.java
    Passed: tools/javac/T5048776.java
    Passed: tools/javac/T5092545.java
    Passed: tools/javac/T5105890.java
    Passed: tools/javac/T6214885.java
    Passed: tools/javac/T6224167.java
    Passed: tools/javac/T6227617.java
    Passed: tools/javac/T6230128.java
    Passed: tools/javac/T6231847.java
    Passed: tools/javac/T6232928.java
    Passed: tools/javac/T6234077.java
    Passed: tools/javac/T6238612.java
    Passed: tools/javac/T6241723.java
    Passed: tools/javac/T6245591.java
    Passed: tools/javac/T6247324.java
    Passed: tools/javac/T6265400.java
    Passed: tools/javac/T6266772.java
    Passed: tools/javac/T6294589.java
    Passed: tools/javac/T6304128.java
    Passed: tools/javac/T6306967.java
    Passed: tools/javac/T6341023.java
    Passed: tools/javac/T6351767.java
    Passed: tools/javac/T6358024.java
    Passed: tools/javac/T6358166.java
    Passed: tools/javac/T6358168.java
    Passed: tools/javac/T6361619.java
    Passed: tools/javac/T6366196.java
    Passed: tools/javac/T6370653.java
    Passed: tools/javac/T6379327.java
    Passed: tools/javac/T6394563.java
    Passed: tools/javac/T6395974.java
    Passed: tools/javac/T6397044.java
    Passed: tools/javac/T6397286.java
    Passed: tools/javac/T6403466.java
    Passed: tools/javac/T6404756.java
    Passed: tools/javac/T6406771.java
    Passed: tools/javac/T6407066.java
    Passed: tools/javac/T6407257.java
    Passed: tools/javac/T6410706.java
    Passed: tools/javac/T6411379.java
    Passed: tools/javac/T6413876.java
    Passed: tools/javac/T6423583.java
    Passed: tools/javac/T6557865.java
    Passed: tools/javac/T6558476.java
    Passed: tools/javac/T6595666.java
    Passed: tools/javac/T6625520.java
    Passed: tools/javac/T6705935.java
    Passed: tools/javac/T6725036.java
    Passed: tools/javac/T6759996.java
    Passed: tools/javac/T6855236.java
    Passed: tools/javac/T6882235.java
    Passed: tools/javac/T6956638.java
    Passed: tools/javac/ThrowNull.java
    Passed: tools/javac/ThrowsIntersection_1.java
    Passed: tools/javac/ThrowsIntersection_2.java
    Passed: tools/javac/ThrowsIntersection_3.java
    Passed: tools/javac/ThrowsIntersection_4.java
    Passed: tools/javac/TryInInstanceInit.java
    Passed: tools/javac/UncaughtOverflow.java
    Passed: tools/javac/UncaughtOverflow2.java
    Passed: tools/javac/UnreachableVar.java
    Passed: tools/javac/UnterminatedLineComment.java
    Passed: tools/javac/UplevelFromAnonInSuperCall.java
    Passed: tools/javac/UseEnum.java
    Passed: tools/javac/VarDeclarationWithAssignment.java
    Passed: tools/javac/Verify.java
    Passed: tools/javac/VerifyDA.java
    Passed: tools/javac/VersionOpt.java
    Passed: tools/javac/VoidArray.java
    Passed: tools/javadoc/6176978/T6176978.java
    Passed: tools/javadoc/annotations/annotateMethodsFields/Main.java
    Passed: tools/javadoc/annotations/annotatePackage/Main.java
    Passed: tools/javadoc/annotations/annotateParams/Main.java
    Passed: tools/javadoc/annotations/badVals/Main.java
    Passed: tools/javadoc/annotations/defaults/Main.java
    Passed: tools/javadoc/annotations/elementTypes/Main.java
    Passed: tools/javadoc/annotations/shortcuts/Main.java
    Passed: tools/javadoc/badSuper/BadSuper.java
    Passed: tools/javadoc/completionFailure/CompletionFailure.java
    Passed: tools/javadoc/dupOk/DupOk.java
    Passed: tools/javadoc/enum/docComments/Main.java
    Passed: tools/javadoc/enum/enumType/Main.java
    Passed: tools/javadoc/generics/genericClass/Main.java
    Passed: tools/javadoc/generics/genericInnerAndOuter/Main.java
    Passed: tools/javadoc/generics/genericInterface/Main.java
    Passed: tools/javadoc/generics/genericMethod/Main.java
    Passed: tools/javadoc/generics/genericSuper/Main.java
    Passed: tools/javadoc/generics/supertypes/Main.java
    Passed: tools/javadoc/generics/throwsGeneric/Main.java
    Passed: tools/javadoc/generics/tparamCycle/Main.java
    Passed: tools/javadoc/generics/tparamTagOnMethod/Main.java
    Passed: tools/javadoc/generics/tparamTagOnType/Main.java
    Passed: tools/javadoc/generics/wildcards/Main.java
    Passed: tools/javadoc/imports/MissingImport.java
    Passed: tools/javadoc/nestedClass/NestedClass.java
    Passed: tools/javadoc/outputRedirect/Test.java
    Passed: tools/javadoc/sourceOnly/Test.java
    Passed: tools/javadoc/sourceOption/SourceOption.java
    Passed: tools/javadoc/subpackageIgnore/SubpackageIgnore.java
    Passed: tools/javadoc/T4994049/T4994049.java
    Passed: tools/javadoc/varArgs/Main.java
    Passed: tools/javadoc/BooleanConst.java
    Passed: tools/javadoc/BreakIteratorWarning.java
    Passed: tools/javadoc/FlagsTooEarly.java
    Passed: tools/javadoc/InlineTagsWithBraces.java
    Passed: tools/javadoc/LangVers.java
    Passed: tools/javadoc/MethodLinks.java
    Passed: tools/javadoc/NoStar.java
    Passed: tools/javadoc/XWerror.java
    Passed: tools/javah/6257087/foo.sh
    Passed: tools/javah/ConstMacroTest.sh
    Passed: tools/javah/MissingParamClassTest.sh
    Passed: tools/javah/ReadOldClass.sh
    Passed: tools/javah/T5070898.java
    Passed: tools/javap/stackmap/T6271292.sh
    Passed: tools/javap/ExtPath.java
    Passed: tools/javap/pathsep.sh
    Passed: tools/javap/PublicInterfaceTest.sh
    Test results: passed: 1,416
    Report written to /notnfs/nighttester/icedtea6-target-testing/test/langtools/JTreport/html/report.html
    Results written to /notnfs/nighttester/icedtea6-target-testing/test/langtools/JTwork
    test -z `grep \"^Error:\|^FAILED:\" test/check-langtools.log`
    for i in hotspot jdk langtools; do \
    echo "--------------- jtreg console summary for $i ---------------"; \
    egrep -v '^(Passed:|Directory|Re[a-z]+\ written\ to)' test/check-$i.log; \
    done | tee test/jtreg-summary.log
    --------------- jtreg console summary for hotspot ---------------
    FAILED: runtime/6196102/LoopTest.java
    Test results: passed: 109; failed: 1
    --------------- jtreg console summary for jdk ---------------
    --------------- jtreg console summary for langtools ---------------
    Test results: passed: 1,416
    : # kill testsuite processes still hanging
    nothing to cleanup
    if [ -e bootstrap ]; then \
    rmdir bootstrap ; \
    fi
    rmdir: failed to remove `bootstrap': Directory not empty
    make: *** [clean-local] Error 1
    + exit 1
    Build step 'Execute shell' marked build as failure
  • Hudson Admin at Oct 18, 2011 at 10:19 pm
    See <http://toadeater:8080/job/IcedTea6TargetTesting/829/>

    ------------------------------------------
    [...truncated 170446 lines...]
    Passed: tools/javac/FlatnameClash2.java
    Passed: tools/javac/FoldConditional.java
    Passed: tools/javac/GoodCovar.java
    Passed: tools/javac/HexFloatLiterals.java
    Passed: tools/javac/HexThree.java
    Passed: tools/javac/IllDefinedOrderOfInit.java
    Passed: tools/javac/IllegalAnnotation.java
    Passed: tools/javac/IllegallyOptimizedException.java
    Passed: tools/javac/ImplicitToString.java
    Passed: tools/javac/InconsistentInheritedSignature.java
    Passed: tools/javac/InconsistentStack.java
    Passed: tools/javac/Increment.java
    Passed: tools/javac/InheritedPrivateImpl.java
    Passed: tools/javac/InitializerCompletion_1.java
    Passed: tools/javac/InitializerCompletion_2.java
    Passed: tools/javac/InitializerCompletion_3.java
    Passed: tools/javac/InitializerCompletion_4.java
    Passed: tools/javac/InnerMemberRegression.java
    Passed: tools/javac/InnerMethSig.java
    Passed: tools/javac/InnerNamedConstant_1.java
    Passed: tools/javac/InnerNamedConstant_2.java
    Passed: tools/javac/InnerTruth.java
    Passed: tools/javac/InstanceInitException_1.java
    Passed: tools/javac/InstanceInitException_2.java
    Passed: tools/javac/InterfaceAssert.java
    Passed: tools/javac/InterfaceFieldParsing_1.java
    Passed: tools/javac/InterfaceInInner.java
    Passed: tools/javac/InterfaceMemberClassModifiers.java
    Passed: tools/javac/InterfaceObjectIncompatibility.java
    Passed: tools/javac/InterfaceObjectInheritance.java
    Passed: tools/javac/InterfaceOverrideCheck.java
    Passed: tools/javac/InterfaceOverrideFinal.java
    Passed: tools/javac/InterfaceOverrideObject.java
    Passed: tools/javac/InvalidIntfCast.java
    Passed: tools/javac/JsrRet.java
    Passed: tools/javac/LabeledDeclaration.java
    Passed: tools/javac/LabelHiding_1.java
    Passed: tools/javac/LocalClasses_1.java
    Passed: tools/javac/LocalClasses_2.java
    Passed: tools/javac/ManyMembers2.java
    Passed: tools/javac/MemberTypeInheritance.java
    Passed: tools/javac/MissingInclude.java
    Passed: tools/javac/NameCollision.java
    Passed: tools/javac/NameCollision2.java
    Passed: tools/javac/NestedDuplicateLabels.java
    Passed: tools/javac/NestedFinallyReturn.java
    Passed: tools/javac/NestedInnerClassNames.java
    Passed: tools/javac/NewGeneric.java
    Passed: tools/javac/NoClass.java
    Passed: tools/javac/NoNoClassDefFoundErrorError.java
    Passed: tools/javac/NonStaticFieldExpr1.java
    Passed: tools/javac/NonStaticFieldExpr2.java
    Passed: tools/javac/NonStaticFieldExpr3.java
    Passed: tools/javac/NonStaticFieldExpr4c.java
    Passed: tools/javac/NonStaticFinalVar.java
    Passed: tools/javac/Null2DArray.java
    Passed: tools/javac/NullQualifiedNew.java
    Passed: tools/javac/NullQualifiedNew2.java
    Passed: tools/javac/NullQualifiedSuper1.java
    Passed: tools/javac/NullQualifiedSuper2.java
    Passed: tools/javac/NullStaticQualifier.java
    Passed: tools/javac/Object1.java
    Passed: tools/javac/Object2.java
    Passed: tools/javac/ObjectIncompatibleInterface.java
    Passed: tools/javac/ObjectMethodRefFromInterface.java
    Passed: tools/javac/OuterParameter_1.java
    Passed: tools/javac/OverridePosition.java
    Passed: tools/javac/Parens1.java
    Passed: tools/javac/Parens2.java
    Passed: tools/javac/Parens3.java
    Passed: tools/javac/Parens4.java
    Passed: tools/javac/ParseConditional.java
    Passed: tools/javac/PrivateLocalConstructor.java
    Passed: tools/javac/PrivateUplevelConstant.java
    Passed: tools/javac/QualifiedConstant.java
    Passed: tools/javac/QualifiedNew.java
    Passed: tools/javac/QualifiedNewScope.java
    Passed: tools/javac/QualifiedOuterThis.java
    Passed: tools/javac/QualifiedOuterThis2.java
    Passed: tools/javac/QualifiedThisAndSuper_1.java
    Passed: tools/javac/QualifiedThisAndSuper_2.java
    Passed: tools/javac/QualifiedThisAndSuper_3.java
    Passed: tools/javac/QualifiedThisExactMatch.java
    Passed: tools/javac/RawCrash.java
    Passed: tools/javac/ReturnAfterIfThenElse.java
    Passed: tools/javac/SerialWarn.java
    Passed: tools/javac/ShiftExpressionTest.java
    Passed: tools/javac/Source5.java
    Passed: tools/javac/StandaloneQualifiedSuper.java
    Passed: tools/javac/StaticBlockScope.java
    Passed: tools/javac/StoreClass.java
    Passed: tools/javac/StrictAbstract.java
    Passed: tools/javac/StringAppendAccessMethodOnLHS.java
    Passed: tools/javac/StringConversion.java
    Passed: tools/javac/SuperclassConstructorException.java
    Passed: tools/javac/SuperField.java
    Passed: tools/javac/SuperMeth.java
    Passed: tools/javac/SuperMethodResolve.java
    Passed: tools/javac/SuperNew.java
    Passed: tools/javac/SuperNew2.java
    Passed: tools/javac/SuperNew3.java
    Passed: tools/javac/SuperNew4.java
    Passed: tools/javac/SwitchFence.java
    Passed: tools/javac/SwitchScope.java
    Passed: tools/javac/SynchronizedClass.java
    Passed: tools/javac/SynthName1.java
    Passed: tools/javac/SynthName2.java
    Passed: tools/javac/T4906100.java
    Passed: tools/javac/T5048776.java
    Passed: tools/javac/T5092545.java
    Passed: tools/javac/T5105890.java
    Passed: tools/javac/T6214885.java
    Passed: tools/javac/T6224167.java
    Passed: tools/javac/T6227617.java
    Passed: tools/javac/T6230128.java
    Passed: tools/javac/T6231847.java
    Passed: tools/javac/T6232928.java
    Passed: tools/javac/T6234077.java
    Passed: tools/javac/T6238612.java
    Passed: tools/javac/T6241723.java
    Passed: tools/javac/T6245591.java
    Passed: tools/javac/T6247324.java
    Passed: tools/javac/T6265400.java
    Passed: tools/javac/T6266772.java
    Passed: tools/javac/T6294589.java
    Passed: tools/javac/T6304128.java
    Passed: tools/javac/T6306967.java
    Passed: tools/javac/T6341023.java
    Passed: tools/javac/T6351767.java
    Passed: tools/javac/T6358024.java
    Passed: tools/javac/T6358166.java
    Passed: tools/javac/T6358168.java
    Passed: tools/javac/T6361619.java
    Passed: tools/javac/T6366196.java
    Passed: tools/javac/T6370653.java
    Passed: tools/javac/T6379327.java
    Passed: tools/javac/T6394563.java
    Passed: tools/javac/T6395974.java
    Passed: tools/javac/T6397044.java
    Passed: tools/javac/T6397286.java
    Passed: tools/javac/T6403466.java
    Passed: tools/javac/T6404756.java
    Passed: tools/javac/T6406771.java
    Passed: tools/javac/T6407066.java
    Passed: tools/javac/T6407257.java
    Passed: tools/javac/T6410706.java
    Passed: tools/javac/T6411379.java
    Passed: tools/javac/T6413876.java
    Passed: tools/javac/T6423583.java
    Passed: tools/javac/T6557865.java
    Passed: tools/javac/T6558476.java
    Passed: tools/javac/T6595666.java
    Passed: tools/javac/T6625520.java
    Passed: tools/javac/T6705935.java
    Passed: tools/javac/T6725036.java
    Passed: tools/javac/T6759996.java
    Passed: tools/javac/T6855236.java
    Passed: tools/javac/T6882235.java
    Passed: tools/javac/T6956638.java
    Passed: tools/javac/ThrowNull.java
    Passed: tools/javac/ThrowsIntersection_1.java
    Passed: tools/javac/ThrowsIntersection_2.java
    Passed: tools/javac/ThrowsIntersection_3.java
    Passed: tools/javac/ThrowsIntersection_4.java
    Passed: tools/javac/TryInInstanceInit.java
    Passed: tools/javac/UncaughtOverflow.java
    Passed: tools/javac/UncaughtOverflow2.java
    Passed: tools/javac/UnreachableVar.java
    Passed: tools/javac/UnterminatedLineComment.java
    Passed: tools/javac/UplevelFromAnonInSuperCall.java
    Passed: tools/javac/UseEnum.java
    Passed: tools/javac/VarDeclarationWithAssignment.java
    Passed: tools/javac/Verify.java
    Passed: tools/javac/VerifyDA.java
    Passed: tools/javac/VersionOpt.java
    Passed: tools/javac/VoidArray.java
    Passed: tools/javadoc/6176978/T6176978.java
    Passed: tools/javadoc/annotations/annotateMethodsFields/Main.java
    Passed: tools/javadoc/annotations/annotatePackage/Main.java
    Passed: tools/javadoc/annotations/annotateParams/Main.java
    Passed: tools/javadoc/annotations/badVals/Main.java
    Passed: tools/javadoc/annotations/defaults/Main.java
    Passed: tools/javadoc/annotations/elementTypes/Main.java
    Passed: tools/javadoc/annotations/shortcuts/Main.java
    Passed: tools/javadoc/badSuper/BadSuper.java
    Passed: tools/javadoc/completionFailure/CompletionFailure.java
    Passed: tools/javadoc/dupOk/DupOk.java
    Passed: tools/javadoc/enum/docComments/Main.java
    Passed: tools/javadoc/enum/enumType/Main.java
    Passed: tools/javadoc/generics/genericClass/Main.java
    Passed: tools/javadoc/generics/genericInnerAndOuter/Main.java
    Passed: tools/javadoc/generics/genericInterface/Main.java
    Passed: tools/javadoc/generics/genericMethod/Main.java
    Passed: tools/javadoc/generics/genericSuper/Main.java
    Passed: tools/javadoc/generics/supertypes/Main.java
    Passed: tools/javadoc/generics/throwsGeneric/Main.java
    Passed: tools/javadoc/generics/tparamCycle/Main.java
    Passed: tools/javadoc/generics/tparamTagOnMethod/Main.java
    Passed: tools/javadoc/generics/tparamTagOnType/Main.java
    Passed: tools/javadoc/generics/wildcards/Main.java
    Passed: tools/javadoc/imports/MissingImport.java
    Passed: tools/javadoc/nestedClass/NestedClass.java
    Passed: tools/javadoc/outputRedirect/Test.java
    Passed: tools/javadoc/sourceOnly/Test.java
    Passed: tools/javadoc/sourceOption/SourceOption.java
    Passed: tools/javadoc/subpackageIgnore/SubpackageIgnore.java
    Passed: tools/javadoc/T4994049/T4994049.java
    Passed: tools/javadoc/varArgs/Main.java
    Passed: tools/javadoc/BooleanConst.java
    Passed: tools/javadoc/BreakIteratorWarning.java
    Passed: tools/javadoc/FlagsTooEarly.java
    Passed: tools/javadoc/InlineTagsWithBraces.java
    Passed: tools/javadoc/LangVers.java
    Passed: tools/javadoc/MethodLinks.java
    Passed: tools/javadoc/NoStar.java
    Passed: tools/javadoc/XWerror.java
    Passed: tools/javah/6257087/foo.sh
    Passed: tools/javah/ConstMacroTest.sh
    Passed: tools/javah/MissingParamClassTest.sh
    Passed: tools/javah/ReadOldClass.sh
    Passed: tools/javah/T5070898.java
    Passed: tools/javap/stackmap/T6271292.sh
    Passed: tools/javap/ExtPath.java
    Passed: tools/javap/pathsep.sh
    Passed: tools/javap/PublicInterfaceTest.sh
    Test results: passed: 1,416
    Report written to /notnfs/nighttester/icedtea6-target-testing/test/langtools/JTreport/html/report.html
    Results written to /notnfs/nighttester/icedtea6-target-testing/test/langtools/JTwork
    test -z `grep \"^Error:\|^FAILED:\" test/check-langtools.log`
    for i in hotspot jdk langtools; do \
    echo "--------------- jtreg console summary for $i ---------------"; \
    egrep -v '^(Passed:|Directory|Re[a-z]+\ written\ to)' test/check-$i.log; \
    done | tee test/jtreg-summary.log
    --------------- jtreg console summary for hotspot ---------------
    FAILED: runtime/6196102/LoopTest.java
    FAILED: runtime/6626217/Test6626217.sh
    Test results: passed: 108; failed: 2
    --------------- jtreg console summary for jdk ---------------
    --------------- jtreg console summary for langtools ---------------
    Test results: passed: 1,416
    : # kill testsuite processes still hanging
    nothing to cleanup
    if [ -e bootstrap ]; then \
    rmdir bootstrap ; \
    fi
    rmdir: failed to remove `bootstrap': Directory not empty
    make: *** [clean-local] Error 1
    + exit 1
    Build step 'Execute shell' marked build as failure
  • Hudson Admin at Oct 19, 2011 at 11:08 pm

Related Discussions

Discussion Navigation
viewthread | post
Discussion Overview
groupicedtea-test @
categoriesopenjdk
postedOct 13, '11 at 9:03p
activeOct 19, '11 at 11:08p
posts7
users1
websiteopenjdk.java.net

1 user in discussion

Hudson Admin: 7 posts

People

Translate

site design / logo © 2018 Grokbase