FAQ
See <http://toadeater:8080/job/IcedTea6TargetTesting/723/>

------------------------------------------
Started by timer
[workspace] $ /bin/sh -xe /tmp/hudson5329862384328255910.sh
+ cd /notnfs/nighttester/icedtea6-target-testing/
+ bash -x /notnfs/nighttester/nightly-tester-scripts/icedtea6-target-testing
+ OPENJDK6_TARBALL=/notnfs/nighttester/drops/openjdk-6-src-b22-28_feb_2011.tar.gz
+ HS20_TARBALL=/notnfs/nighttester/drops/hs20.tar.gz
+ CACAO_TARBALL=/notnfs/nighttester/drops/cacao-dd4532afd08a.tar.bz2
+ JAXP6_TARBALL=/notnfs/nighttester/drops/jaxp6.zip
+ JAF6_TARBALL=/notnfs/nighttester/drops/jaf6.zip
+ JAXWS6_TARBALL=/notnfs/nighttester/drops/jaxws6.zip
+ PARALLEL=--with-parallel-jobs=3
+ TARBALLS='--with-openjdk-src-zip=/notnfs/nighttester/drops/openjdk-6-src-b22-28_feb_2011.tar.gz --with-cacao-src-zip=/notnfs/nighttester/drops/cacao-dd4532afd08a.tar.bz2 --with-hotspot-src-zip=/notnfs/nighttester/drops/hs20.tar.gz --with-jaxp-drop-zip=/notnfs/nighttester/drops/jaxp6.zip --with-jaf-drop-zip=/notnfs/nighttester/drops/jaf6.zip --with-jaxws-drop-zip=/notnfs/nighttester/drops/jaxws6.zip'
+ SYSTEMTAP=--enable-systemtap
+ COMMON_CONFIG_OPTS='--with-parallel-jobs=3 --with-openjdk-src-zip=/notnfs/nighttester/drops/openjdk-6-src-b22-28_feb_2011.tar.gz --with-cacao-src-zip=/notnfs/nighttester/drops/cacao-dd4532afd08a.tar.bz2 --with-hotspot-src-zip=/notnfs/nighttester/drops/hs20.tar.gz --with-jaxp-drop-zip=/notnfs/nighttester/drops/jaxp6.zip --with-jaf-drop-zip=/notnfs/nighttester/drops/jaf6.zip --with-jaxws-drop-zip=/notnfs/nighttester/drops/jaxws6.zip --enable-systemtap'
+ make distclean
rm -rf test/jtreg/classes
rm -f test/jtreg.jar
rm -f stamps/jtreg.stamp
rm -rf test/hotspot test/langtools test/jdk
rm -f test/check-*.log test/jtreg-summary.log
rm -rf /notnfs/nighttester/icedtea6-target-testing/pulseaudio.build/native
rm -rf /notnfs/nighttester/icedtea6-target-testing/pulseaudio.build/classes
rm -f /notnfs/nighttester/icedtea6-target-testing/pulseaudio.build/pulse-java.jar
rmdir /notnfs/nighttester/icedtea6-target-testing/pulseaudio.build
rmdir: failed to remove `/notnfs/nighttester/icedtea6-target-testing/pulseaudio.build': No such file or directory
make: *** [clean-pulse-java] Error 1
+ hg pull
pulling from http://icedtea.classpath.org/hg/icedtea6
searching for changes
adding changesets
adding manifests
adding file changes
added 14 changesets with 48 changes to 22 files
(run 'hg update' to get a working copy)
+ hg update
22 files updated, 0 files merged, 36 files removed, 0 files unresolved
+ ./autogen.sh
+ ./configure --with-parallel-jobs=3 --with-openjdk-src-zip=/notnfs/nighttester/drops/openjdk-6-src-b22-28_feb_2011.tar.gz --with-cacao-src-zip=/notnfs/nighttester/drops/cacao-dd4532afd08a.tar.bz2 --with-hotspot-src-zip=/notnfs/nighttester/drops/hs20.tar.gz --with-jaxp-drop-zip=/notnfs/nighttester/drops/jaxp6.zip --with-jaf-drop-zip=/notnfs/nighttester/drops/jaf6.zip --with-jaxws-drop-zip=/notnfs/nighttester/drops/jaxws6.zip --enable-systemtap
checking for a BSD-compatible install... /usr/bin/install -c
checking whether build environment is sane... yes
checking for a thread-safe mkdir -p... /bin/mkdir -p
checking for gawk... gawk
checking whether make sets $(MAKE)... yes
checking how to create a pax tar archive... gnutar
checking build system type... x86_64-unknown-linux-gnu
checking host system type... x86_64-unknown-linux-gnu
checking for gcc... gcc
checking whether the C compiler works... yes
checking for C compiler default output file name... a.out
checking for suffix of executables...
checking whether we are cross compiling... no
checking for suffix of object files... o
checking whether we are using the GNU C compiler... yes
checking whether gcc accepts -g... yes
checking for gcc option to accept ISO C89... none needed
checking for style of include used by make... GNU
checking dependency style of gcc... none
checking for g++... g++
checking whether we are using the GNU C++ compiler... yes
checking whether g++ accepts -g... yes
checking dependency style of g++... none
checking for make... /usr/bin/make
checking for gzip... /bin/gzip
checking for ant... /usr/bin/ant
checking for find... /bin/find
checking for patch... /usr/bin/patch
checking for tar... /bin/tar
checking for chmod... /bin/chmod
checking for sha256sum... /usr/bin/sha256sum
checking for wget... /usr/bin/wget
checking for zip... /usr/bin/zip
checking for unzip... /usr/bin/unzip
checking for cpio... /bin/cpio
checking for file... /usr/bin/file
checking for fastjar... fastjar
checking for ldd... ldd
checking for gawk... /bin/gawk
checking for hg... /usr/bin/hg
checking for an OpenJDK source directory... /notnfs/nighttester/icedtea6-target-testing/openjdk
checking for IcedTea Mercurial revision ID... r0911ad28ea98+
checking for JDK Mercurial revision ID... none
checking for HotSpot Mercurial revision ID... none
checking for lsb_release... /usr/bin/lsb_release
checking whether to compile ecj natively... no
checking which HotSpot build to use... original
checking for linux32... /usr/bin/linux32
checking version of GCC... 4.5.1 (major version 4, minor version 5)
checking for getconf... /usr/bin/getconf
checking the number of online processors... 2
checking how many parallel build jobs to execute... 3
checking if cp supports --reflink... yes
checking if we can hard link rather than copy from /notnfs/nighttester/icedtea6-target-testing... yes
checking if a PaX-enabled kernel is running... no
checking for system library directory...
checking for pkg-config... /usr/bin/pkg-config
checking pkg-config is at least version 0.9.0... yes
checking for NSS... yes
checking for xvfb-run... xvfb-run -a -e xvfb-errors
checking for an Ant home directory... /usr/share/ant
checking whether to include PulseAudio support... no
checking whether to build documentation... yes
checking whether to enable experimental OpenJDK cross-compilation support... no
checking whether to include the XRender pipeline... yes
checking whether to include NIO2 support... no
checking whether to include SystemTap tracing support... yes
checking whether to include the NSS-based security provider... disabled by default (edit java.security to enable)
checking for distribution package version... none
checking build identification... Built on Fedora release 14 (Laughlin) (Fri Jul 8 00:03:14 EDT 2011)
checking whether to build a bootstrap version first... yes
checking for a JDK home directory... /usr/lib/jvm/java-gcj
checking if a java binary was specified... no
checking if /usr/lib/jvm/java-gcj/bin/java is a valid executable file... yes
checking for javac... /usr/bin/javac
checking if a javah binary was specified... no
checking if /usr/lib/jvm/java-gcj/bin/javah is a valid executable file... yes
checking if a jar binary was specified... no
checking if /usr/lib/jvm/java-gcj/bin/jar is a valid executable file... yes
checking whether jar supports @<file> argument... yes
checking whether jar supports stdin file arguments... yes
checking whether jar supports -J options at the end... yes
checking if a rmic binary was specified... no
checking if /usr/lib/jvm/java-gcj/bin/rmic is a valid executable file... yes
checking if a native2ascii binary was specified... no
checking if /usr/lib/jvm/java-gcj/bin/native2ascii is a valid executable file... no
checking for native2ascii... /usr/bin/native2ascii
checking for an ecj JAR file... /usr/share/java/eclipse-ecj.jar
checking for a xalan2 jar... /usr/share/java/xalan-j2.jar
checking for a xalan2 serializer jar... /usr/share/java/xalan-j2-serializer.jar
checking for a xerces2 jar... /usr/share/java/xerces-j2.jar
checking if org.apache.xerces.dom.DeferredDocumentImpl is instantiable... yes
checking whether to include Javascript support via Rhino... /usr/share/java/rhino.jar
checking for an OpenJDK source zip... /notnfs/nighttester/drops/openjdk-6-src-b22-28_feb_2011.tar.gz
checking for a HotSpot source zip... /notnfs/nighttester/drops/hs20.tar.gz
checking for an alternate jar command... not specified
checking for a JAXP drop zip... /notnfs/nighttester/drops/jaxp6.zip
checking for a JAF drop zip... /notnfs/nighttester/drops/jaf6.zip
checking for a JAXWS drop zip... /notnfs/nighttester/drops/jaxws6.zip
checking whether to use CACAO as VM... no
checking for a CACAO home directory... $(abs_top_builddir)/cacao/install
checking for a CACAO source zip... /notnfs/nighttester/drops/cacao-dd4532afd08a.tar.bz2
checking for a CACAO source directory... not specified
checking whether to use JamVM as VM... no
checking for a JamVM source zip... not specified
checking whether to disable optimizations and build with -O0 -g... no
checking whether to use the Shark JIT... no
checking how to run the C preprocessor... gcc -E
checking for grep that handles long lines and -e... /bin/grep
checking for egrep... /bin/grep -E
checking for ANSI C header files... yes
checking for sys/types.h... yes
checking for sys/stat.h... yes
checking for stdlib.h... yes
checking for string.h... yes
checking for memory.h... yes
checking for strings.h... yes
checking for inttypes.h... yes
checking for stdint.h... yes
checking for unistd.h... yes
checking whether to use the zero-assembler port... no
checking whether byte ordering is bigendian... no
checking for additional virtual machines to build... none
checking whether to retrieve the source code from Mercurial... no
checking which Mercurial revision to use... tip
checking which Java timezone data directory to use... /usr/share/javazi
checking if javax.xml.stream.events.Attribute.getDTDType() wrongly returns a QName... no
checking if /usr/lib/jvm/java-gcj/bin/javah exhibits Classpath bug 39408... yes
checking if /usr/lib/jvm/java-gcj/bin/javah exhibits Classpath bug 40188... yes
checking cups/cups.h usability... yes
checking cups/cups.h presence... yes
checking for cups/cups.h... yes
checking cups/ppd.h usability... yes
checking cups/ppd.h presence... yes
checking for cups/ppd.h... yes
checking X11/X.h usability... yes
checking X11/X.h presence... yes
checking for X11/X.h... yes
checking for main in -ljpeg... yes
checking for main in -lgif... yes
checking for main in -lz... yes
checking for XPROTO... yes
checking for XT... yes
checking for XP... yes
checking for X11... yes
checking for XINERAMA... yes
checking for XRENDER... yes
checking sys/sdt.h usability... yes
checking sys/sdt.h presence... yes
checking for sys/sdt.h... yes
checking working sys/sdt.h and g++ support... yes
checking for absolute java home install dir... /notnfs/nighttester/icedtea6-target-testing/openjdk.build/j2sdk-image
checking for LIBPNG... yes
checking for XTST... yes
checking for FREETYPE2... yes
checking for ALSA... yes
configure: creating ./config.status
config.status: creating Makefile
config.status: creating nss.cfg
config.status: creating javac
config.status: creating javap
config.status: creating jvm.cfg
config.status: creating ergo.c
config.status: creating tz.properties
config.status: creating tapset/hotspot.stp
config.status: creating tapset/hotspot_jni.stp
config.status: creating tapset/jstack.stp
config.status: executing depfiles commands
+ make env-ecj
unset JAVA_HOME
export ALT_JDK_IMPORT_PATH="/notnfs/nighttester/icedtea6-target-testing/bootstrap/jdk1.6.0" ANT="/usr/bin/ant" BUILD_NUMBER="b23" JDK_UPDATE_VERSION="23" JRE_RELEASE_VERSION="1.6.0_23-b23" MILESTONE="fcs" LANG="C" PATH="/notnfs/nighttester/icedtea6-target-testing/bootstrap/jdk1.6.0/bin::$PATH" ALT_BOOTDIR="/notnfs/nighttester/icedtea6-target-testing/bootstrap/jdk1.6.0" BUILD_ARCH_DIR="amd64" ICEDTEA_CLS_DIR="/notnfs/nighttester/icedtea6-target-testing/openjdk.build/classes" CLASSPATH="" LD_LIBRARY_PATH="" ZERO_BUILD="" SHARK_BUILD="" ZERO_LIBARCH="amd64" ARCH_DATA_MODEL="64" ZERO_ENDIANNESS="little" ZERO_ARCHDEF="AMD64" ZERO_ARCHFLAG="-m64" LIBFFI_CFLAGS="" LIBFFI_LIBS="" LLVM_CFLAGS="" LLVM_LDFLAGS="" LLVM_LIBS="" FREETYPE2_HEADERS="-I/usr/include/freetype2 " FT2_LIB="-lfreetype " ALT_PARALLEL_COMPILE_JOBS="3" HOTSPOT_BUILD_JOBS="3" JAVAC="" JAVA_HOME="" JDK_HOME="" DISTRIBUTION_ID="Built on Fedora release 14 (Laughlin) (Fri Jul 8 00:03:14 EDT 2011)" DERIVATIVE_ID="IcedTea6 1.11pre+r0911ad28ea98+" DEBUG_CLASSFILES="true" DEBUG_BINARIES="true" ALT_DROPS_DIR="/notnfs/nighttester/icedtea6-target-testing/drops" VERBOSE="" ALT_OUTPUTDIR="/notnfs/nighttester/icedtea6-target-testing/openjdk.build" RHINO_JAR="/notnfs/nighttester/icedtea6-target-testing/rhino/rhino.jar" ALT_OUTPUTDIR="/notnfs/nighttester/icedtea6-target-testing/openjdk.build-ecj" JAVA_TOOLS_DIR="/notnfs/nighttester/icedtea6-target-testing/bootstrap/jdk1.6.0/bin" ICEDTEA_RT="/notnfs/nighttester/icedtea6-target-testing/bootstrap/jdk1.6.0/jre/lib/rt.jar" ICEDTEA_CLS_DIR="/notnfs/nighttester/icedtea6-target-testing/openjdk.build-ecj/classes" BOOTCLASSPATH_CLS_RT="-bootclasspath /notnfs/nighttester/icedtea6-target-testing/openjdk.build-ecj/classes:/notnfs/nighttester/icedtea6-target-testing/bootstrap/jdk1.6.0/jre/lib/rt.jar" BOOTCLASSPATH_CLS="-bootclasspath /notnfs/nighttester/icedtea6-target-testing/openjdk.build-ecj/classes" BOOTCLASSPATH_RT_LIBGCJ="-bootclasspath /notnfs/nighttester/icedtea6-target-testing/bootstrap/jdk1.6.0/jre/lib/rt.jar" CLASSPATH="" ICEDTEA_ENDORSED_DIR="/notnfs/nighttester/icedtea6-target-testing/bootstrap/jdk1.6.0/lib/endorsed" ENDORSED="-Djava.endorsed.dirs=/notnfs/nighttester/icedtea6-target-testing/bootstrap/jdk1.6.0/lib/endorsed" LD_LIBRARY_PATH="" GENSRCDIR="/notnfs/nighttester/icedtea6-target-testing/generated" JAR_KNOWS_ATFILE="1" JAR_KNOWS_J_OPTIONS="1" JAR_ACCEPTS_STDIN_LIST="1" DISABLE_NIMBUS="true" NO_DOCS="true"
+ make extract-ecj
set -e ; \
if ! test -d openjdk ; \
then \
mkdir openjdk ; \
/bin/tar xf openjdk-6-src-b23-05_jul_2011.tar.gz -C openjdk; \
chmod -R ug+w openjdk ; \
sh /notnfs/nighttester/icedtea6-target-testing/fsg.sh ; \
fi
/bin/tar: openjdk-6-src-b23-05_jul_2011.tar.gz: Cannot open: No such file or directory
/bin/tar: Error is not recoverable: exiting now
make: *** [stamps/extract-openjdk.stamp] Error 2
+ exit 1

Search Discussions

  • Hudson Admin at Jul 8, 2011 at 9:03 pm
    See <http://toadeater:8080/job/IcedTea6TargetTesting/724/>

    ------------------------------------------
    [...truncated 412 lines...]
    2250K .......... .......... .......... .......... .......... 39% 1.12M 4s
    2300K .......... .......... .......... .......... .......... 40% 1.16M 4s
    2350K .......... .......... .......... .......... .......... 41% 1.15M 4s
    2400K .......... .......... .......... .......... .......... 42% 1.12M 4s
    2450K .......... .......... .......... .......... .......... 42% 969K 4s
    2500K .......... .......... .......... .......... .......... 43% 998K 4s
    2550K .......... .......... .......... .......... .......... 44% 1.02M 4s
    2600K .......... .......... .......... .......... .......... 45% 973K 4s
    2650K .......... .......... .......... .......... .......... 46% 1013K 4s
    2700K .......... .......... .......... .......... .......... 47% 1.01M 4s
    2750K .......... .......... .......... .......... .......... 48% 878K 4s
    2800K .......... .......... .......... .......... .......... 48% 992K 4s
    2850K .......... .......... .......... .......... .......... 49% 745K 3s
    2900K .......... .......... .......... .......... .......... 50% 787K 3s
    2950K .......... .......... .......... .......... .......... 51% 719K 3s
    3000K .......... .......... .......... .......... .......... 52% 675K 3s
    3050K .......... .......... .......... .......... .......... 53% 870K 3s
    3100K .......... .......... .......... .......... .......... 54% 805K 3s
    3150K .......... .......... .......... .......... .......... 54% 868K 3s
    3200K .......... .......... .......... .......... .......... 55% 786K 3s
    3250K .......... .......... .......... .......... .......... 56% 854K 3s
    3300K .......... .......... .......... .......... .......... 57% 969K 3s
    3350K .......... .......... .......... .......... .......... 58% 925K 3s
    3400K .......... .......... .......... .......... .......... 59% 773K 3s
    3450K .......... .......... .......... .......... .......... 60% 907K 3s
    3500K .......... .......... .......... .......... .......... 60% 1.04M 3s
    3550K .......... .......... .......... .......... .......... 61% 947K 3s
    3600K .......... .......... .......... .......... .......... 62% 789K 3s
    3650K .......... .......... .......... .......... .......... 63% 927K 3s
    3700K .......... .......... .......... .......... .......... 64% 946K 2s
    3750K .......... .......... .......... .......... .......... 65% 967K 2s
    3800K .......... .......... .......... .......... .......... 66% 788K 2s
    3850K .......... .......... .......... .......... .......... 66% 946K 2s
    3900K .......... .......... .......... .......... .......... 67% 1.02M 2s
    3950K .......... .......... .......... .......... .......... 68% 1.12M 2s
    4000K .......... .......... .......... .......... .......... 69% 1.13M 2s
    4050K .......... .......... .......... .......... .......... 70% 1.13M 2s
    4100K .......... .......... .......... .......... .......... 71% 1.16M 2s
    4150K .......... .......... .......... .......... .......... 72% 1.14M 2s
    4200K .......... .......... .......... .......... .......... 72% 1.10M 2s
    4250K .......... .......... .......... .......... .......... 73% 1.12M 2s
    4300K .......... .......... .......... .......... .......... 74% 1.16M 2s
    4350K .......... .......... .......... .......... .......... 75% 1.15M 2s
    4400K .......... .......... .......... .......... .......... 76% 1.12M 2s
    4450K .......... .......... .......... .......... .......... 77% 1.09M 2s
    4500K .......... .......... .......... .......... .......... 78% 819K 1s
    4550K .......... .......... .......... .......... .......... 78% 818K 1s
    4600K .......... .......... .......... .......... .......... 79% 763K 1s
    4650K .......... .......... .......... .......... .......... 80% 402K 1s
    4700K .......... .......... .......... .......... .......... 81% 1004K 1s
    4750K .......... .......... .......... .......... .......... 82% 1021K 1s
    4800K .......... .......... .......... .......... .......... 83% 907K 1s
    4850K .......... .......... .......... .......... .......... 84% 872K 1s
    4900K .......... .......... .......... .......... .......... 84% 760K 1s
    4950K .......... .......... .......... .......... .......... 85% 788K 1s
    5000K .......... .......... .......... .......... .......... 86% 686K 1s
    5050K .......... .......... .......... .......... .......... 87% 761K 1s
    5100K .......... .......... .......... .......... .......... 88% 835K 1s
    5150K .......... .......... .......... .......... .......... 89% 836K 1s
    5200K .......... .......... .......... .......... .......... 90% 835K 1s
    5250K .......... .......... .......... .......... .......... 90% 889K 1s
    5300K .......... .......... .......... .......... .......... 91% 817K 1s
    5350K .......... .......... .......... .......... .......... 92% 907K 0s
    5400K .......... .......... .......... .......... .......... 93% 867K 0s
    5450K .......... .......... .......... .......... .......... 94% 790K 0s
    5500K .......... .......... .......... .......... .......... 95% 1.04M 0s
    5550K .......... .......... .......... .......... .......... 96% 871K 0s
    5600K .......... .......... .......... .......... .......... 96% 859K 0s
    5650K .......... .......... .......... .......... .......... 97% 959K 0s
    5700K .......... .......... .......... .......... .......... 98% 953K 0s
    5750K .......... .......... .......... .......... .......... 99% 869K 0s
    5800K .......... .......... ..... 100% 966K=6.8s

    2011-07-09 00:03:16 (862 KB/s) - ?drops/jaxp144_03.zip? saved [5964999/5964999]

    drops/jaxp144_03.zip: OK
    mkdir -p stamps
    touch stamps/download-jaxp-drop.stamp
    mkdir -p drops
    ln -sf /notnfs/nighttester/drops/jaxws6.zip drops/jdk6-jaxws2_1_6-2011_06_08.zip
    if ! echo "be95ff0ae05b474d0bbb3ad8bdb2a23f20cb8c48b1a21f16aa079e43a50c057f drops/jdk6-jaxws2_1_6-2011_06_08.zip" \
    /usr/bin/sha256sum --check ; \
    then \
    if [ -f drops/jdk6-jaxws2_1_6-2011_06_08.zip ] ; \
    then \
    mv drops/jdk6-jaxws2_1_6-2011_06_08.zip drops/jdk6-jaxws2_1_6-2011_06_08.zip.old ; \
    fi ; \
    /usr/bin/wget http://icedtea.classpath.org/download/drops/jdk6-jaxws2_1_6-2011_06_08.zip -O drops/jdk6-jaxws2_1_6-2011_06_08.zip; \
    if ! echo "be95ff0ae05b474d0bbb3ad8bdb2a23f20cb8c48b1a21f16aa079e43a50c057f drops/jdk6-jaxws2_1_6-2011_06_08.zip" \
    /usr/bin/sha256sum --check ; \
    then echo "ERROR: Bad download of jaxws drop zip"; false; \
    fi; \
    fi ;
    drops/jdk6-jaxws2_1_6-2011_06_08.zip: FAILED
    /usr/bin/sha256sum: WARNING: 1 of 1 computed checksum did NOT match
    --2011-07-09 00:03:16-- http://icedtea.classpath.org/download/drops/jdk6-jaxws2_1_6-2011_06_08.zip
    Resolving icedtea.classpath.org... 208.78.240.231
    Connecting to icedtea.classpath.org|208.78.240.231|:80... connected.
    HTTP request sent, awaiting response... 200 OK
    Length: 5512710 (5.3M) [application/zip]
    Saving to: ?drops/jdk6-jaxws2_1_6-2011_06_08.zip?

    0K .......... .......... .......... .......... .......... 0% 136K 39s
    50K .......... .......... .......... .......... .......... 1% 325K 28s
    100K .......... .......... .......... .......... .......... 2% 370K 23s
    150K .......... .......... .......... .......... .......... 3% 409K 20s
    200K .......... .......... .......... .......... .......... 4% 729K 17s
    250K .......... .......... .......... .......... .......... 5% 1.08M 15s
    300K .......... .......... .......... .......... .......... 6% 1.14M 13s
    350K .......... .......... .......... .......... .......... 7% 1.06M 12s
    400K .......... .......... .......... .......... .......... 8% 1.15M 11s
    450K .......... .......... .......... .......... .......... 9% 1.15M 10s
    500K .......... .......... .......... .......... .......... 10% 1.15M 10s
    550K .......... .......... .......... .......... .......... 11% 1.17M 9s
    600K .......... .......... .......... .......... .......... 12% 1.13M 9s
    650K .......... .......... .......... .......... .......... 13% 1.12M 8s
    700K .......... .......... .......... .......... .......... 13% 1.16M 8s
    750K .......... .......... .......... .......... .......... 14% 1.15M 8s
    800K .......... .......... .......... .......... .......... 15% 1.04M 7s
    850K .......... .......... .......... .......... .......... 16% 1.12M 7s
    900K .......... .......... .......... .......... .......... 17% 1.15M 7s
    950K .......... .......... .......... .......... .......... 18% 1.16M 7s
    1000K .......... .......... .......... .......... .......... 19% 1.13M 6s
    1050K .......... .......... .......... .......... .......... 20% 1.12M 6s
    1100K .......... .......... .......... .......... .......... 21% 1024K 6s
    1150K .......... .......... .......... .......... .......... 22% 1024K 6s
    1200K .......... .......... .......... .......... .......... 23% 971K 6s
    1250K .......... .......... .......... .......... .......... 24% 925K 6s
    1300K .......... .......... .......... .......... .......... 25% 887K 6s
    1350K .......... .......... .......... .......... .......... 26% 760K 5s
    1400K .......... .......... .......... .......... .......... 26% 661K 5s
    1450K .......... .......... .......... .......... .......... 27% 774K 5s
    1500K .......... .......... .......... .......... .......... 28% 838K 5s
    1550K .......... .......... .......... .......... .......... 29% 820K 5s
    1600K .......... .......... .......... .......... .......... 30% 758K 5s
    1650K .......... .......... .......... .......... .......... 31% 890K 5s
    1700K .......... .......... .......... .......... .......... 32% 803K 5s
    1750K .......... .......... .......... .......... .......... 33% 969K 5s
    1800K .......... .......... .......... .......... .......... 34% 802K 5s
    1850K .......... .......... .......... .......... .......... 35% 850K 5s
    1900K .......... .......... .......... .......... .......... 36% 971K 5s
    1950K .......... .......... .......... .......... .......... 37% 969K 4s
    2000K .......... .......... .......... .......... .......... 38% 839K 4s
    2050K .......... .......... .......... .......... .......... 39% 872K 4s
    2100K .......... .......... .......... .......... .......... 39% 948K 4s
    2150K .......... .......... .......... .......... .......... 40% 907K 4s
    2200K .......... .......... .......... .......... .......... 41% 969K 4s
    2250K .......... .......... .......... .......... .......... 42% 870K 4s
    2300K .......... .......... .......... .......... .......... 43% 904K 4s
    2350K .......... .......... .......... .......... .......... 44% 967K 4s
    2400K .......... .......... .......... .......... .......... 45% 1.13M 4s
    2450K .......... .......... .......... .......... .......... 46% 1.13M 4s
    2500K .......... .......... .......... .......... .......... 47% 1.16M 4s
    2550K .......... .......... .......... .......... .......... 48% 1.12M 3s
    2600K .......... .......... .......... .......... .......... 49% 1.12M 3s
    2650K .......... .......... .......... .......... .......... 50% 1.13M 3s
    2700K .......... .......... .......... .......... .......... 51% 1.16M 3s
    2750K .......... .......... .......... .......... .......... 52% 1.16M 3s
    2800K .......... .......... .......... .......... .......... 52% 1.03M 3s
    2850K .......... .......... .......... .......... .......... 53% 1.13M 3s
    2900K .......... .......... .......... .......... .......... 54% 1.16M 3s
    2950K .......... .......... .......... .......... .......... 55% 1.16M 3s
    3000K .......... .......... .......... .......... .......... 56% 1.13M 3s
    3050K .......... .......... .......... .......... .......... 57% 1.13M 3s
    3100K .......... .......... .......... .......... .......... 58% 1.15M 3s
    3150K .......... .......... .......... .......... .......... 59% 1.16M 3s
    3200K .......... .......... .......... .......... .......... 60% 1.12M 2s
    3250K .......... .......... .......... .......... .......... 61% 1.04M 2s
    3300K .......... .......... .......... .......... .......... 62% 1.16M 2s
    3350K .......... .......... .......... .......... .......... 63% 1.16M 2s
    3400K .......... .......... .......... .......... .......... 64% 1.12M 2s
    3450K .......... .......... .......... .......... .......... 65% 1.13M 2s
    3500K .......... .......... .......... .......... .......... 65% 1.16M 2s
    3550K .......... .......... .......... .......... .......... 66% 1.16M 2s
    3600K .......... .......... .......... .......... .......... 67% 1.12M 2s
    3650K .......... .......... .......... .......... .......... 68% 1.12M 2s
    3700K .......... .......... .......... .......... .......... 69% 1.06M 2s
    3750K .......... .......... .......... .......... .......... 70% 1.14M 2s
    3800K .......... .......... .......... .......... .......... 71% 994K 2s
    3850K .......... .......... .......... .......... .......... 72% 973K 2s
    3900K .......... .......... .......... .......... .......... 73% 1019K 2s
    3950K .......... .......... .......... .......... .......... 74% 923K 2s
    4000K .......... .......... .......... .......... .......... 75% 907K 1s
    4050K .......... .......... .......... .......... .......... 76% 723K 1s
    4100K .......... .......... .......... .......... .......... 77% 654K 1s
    4150K .......... .......... .......... .......... .......... 78% 888K 1s
    4200K .......... .......... .......... .......... .......... 78% 757K 1s
    4250K .......... .......... .......... .......... .......... 79% 820K 1s
    4300K .......... .......... .......... .......... .......... 80% 759K 1s
    4350K .......... .......... .......... .......... .......... 81% 927K 1s
    4400K .......... .......... .......... .......... .......... 82% 788K 1s
    4450K .......... .......... .......... .......... .......... 83% 925K 1s
    4500K .......... .......... .......... .......... .......... 84% 833K 1s
    4550K .......... .......... .......... .......... .......... 85% 870K 1s
    4600K .......... .......... .......... .......... .......... 86% 947K 1s
    4650K .......... .......... .......... .......... .......... 87% 852K 1s
    4700K .......... .......... .......... .......... .......... 88% 971K 1s
    4750K .......... .......... .......... .......... .......... 89% 384K 1s
    4800K .......... .......... .......... .......... .......... 90% 210M 1s
    4850K .......... .......... .......... .......... .......... 91% 1.22M 1s
    4900K .......... .......... .......... .......... .......... 91% 971K 0s
    4950K .......... .......... .......... .......... .......... 92% 887K 0s
    5000K .......... .......... .......... .......... .......... 93% 931K 0s
    5050K .......... .......... .......... .......... .......... 94% 996K 0s
    5100K .......... .......... .......... .......... .......... 95% 1.18M 0s
    5150K .......... .......... .......... .......... .......... 96% 1.17M 0s
    5200K .......... .......... .......... .......... .......... 97% 1.14M 0s
    5250K .......... .......... .......... .......... .......... 98% 1.14M 0s
    5300K .......... .......... .......... .......... .......... 99% 1.08M 0s
    5350K .......... .......... .......... ... 100% 1.18M=6.0s

    2011-07-09 00:03:22 (895 KB/s) - ?drops/jdk6-jaxws2_1_6-2011_06_08.zip? saved [5512710/5512710]

    drops/jdk6-jaxws2_1_6-2011_06_08.zip: OK
    mkdir -p stamps
    touch stamps/download-jaxws-drop.stamp
    mkdir -p drops
    ln -sf /notnfs/nighttester/drops/jaf6.zip drops/jdk6-jaf-b20.zip
    if ! echo "78c7b5c9d6271e88ee46abadd018a61f1e9645f8936cc8df1617e5f4f5074012 drops/jdk6-jaf-b20.zip" \
    /usr/bin/sha256sum --check ; \
    then \
    if [ -f drops/jdk6-jaf-b20.zip ] ; \
    then \
    mv drops/jdk6-jaf-b20.zip drops/jdk6-jaf-b20.zip.old ; \
    fi ; \
    /usr/bin/wget http://icedtea.classpath.org/download/drops/jdk6-jaf-b20.zip -O drops/jdk6-jaf-b20.zip; \
    if ! echo "78c7b5c9d6271e88ee46abadd018a61f1e9645f8936cc8df1617e5f4f5074012 drops/jdk6-jaf-b20.zip" \
    /usr/bin/sha256sum --check ; \
    then echo "ERROR: Bad download of jaf drop zip"; false; \
    fi; \
    fi ;
    drops/jdk6-jaf-b20.zip: OK
    mkdir -p stamps
    touch stamps/download-jaf-drop.stamp
    mkdir -p stamps
    touch stamps/download-drops.stamp
    touch stamps/download.stamp
    set -e ; \
    if ! test -d openjdk ; \
    then \
    mkdir openjdk ; \
    /bin/tar xf openjdk-6-src-b23-05_jul_2011.tar.gz -C openjdk; \
    chmod -R ug+w openjdk ; \
    sh /notnfs/nighttester/icedtea6-target-testing/fsg.sh ; \
    fi
    /bin/tar: openjdk-6-src-b23-05_jul_2011.tar.gz: Cannot open: No such file or directory
    /bin/tar: Error is not recoverable: exiting now
    make: *** [stamps/extract-openjdk.stamp] Error 2
    + exit 1
  • Hudson Admin at Jul 9, 2011 at 9:03 pm
    See <http://toadeater:8080/job/IcedTea6TargetTesting/725/>

    ------------------------------------------
    [...truncated 408 lines...]
    2250K .......... .......... .......... .......... .......... 39% 1.02M 4s
    2300K .......... .......... .......... .......... .......... 40% 947K 4s
    2350K .......... .......... .......... .......... .......... 41% 970K 4s
    2400K .......... .......... .......... .......... .......... 42% 887K 4s
    2450K .......... .......... .......... .......... .......... 42% 564K 4s
    2500K .......... .......... .......... .......... .......... 43% 2.52M 4s
    2550K .......... .......... .......... .......... .......... 44% 803K 4s
    2600K .......... .......... .......... .......... .......... 45% 1.01M 4s
    2650K .......... .......... .......... .......... .......... 46% 927K 4s
    2700K .......... .......... .......... .......... .......... 47% 1017K 4s
    2750K .......... .......... .......... .......... .......... 48% 817K 4s
    2800K .......... .......... .......... .......... .......... 48% 1.13M 4s
    2850K .......... .......... .......... .......... .......... 49% 1.13M 4s
    2900K .......... .......... .......... .......... .......... 50% 1.07M 3s
    2950K .......... .......... .......... .......... .......... 51% 1.15M 3s
    3000K .......... .......... .......... .......... .......... 52% 1.12M 3s
    3050K .......... .......... .......... .......... .......... 53% 1.13M 3s
    3100K .......... .......... .......... .......... .......... 54% 1.16M 3s
    3150K .......... .......... .......... .......... .......... 54% 1.15M 3s
    3200K .......... .......... .......... .......... .......... 55% 1.13M 3s
    3250K .......... .......... .......... .......... .......... 56% 1.04M 3s
    3300K .......... .......... .......... .......... .......... 57% 1.16M 3s
    3350K .......... .......... .......... .......... .......... 58% 1.16M 3s
    3400K .......... .......... .......... .......... .......... 59% 1.13M 3s
    3450K .......... .......... .......... .......... .......... 60% 1.12M 3s
    3500K .......... .......... .......... .......... .......... 60% 1.16M 3s
    3550K .......... .......... .......... .......... .......... 61% 1.16M 3s
    3600K .......... .......... .......... .......... .......... 62% 1.13M 2s
    3650K .......... .......... .......... .......... .......... 63% 1.04M 2s
    3700K .......... .......... .......... .......... .......... 64% 1.16M 2s
    3750K .......... .......... .......... .......... .......... 65% 1.15M 2s
    3800K .......... .......... .......... .......... .......... 66% 1.12M 2s
    3850K .......... .......... .......... .......... .......... 66% 1.12M 2s
    3900K .......... .......... .......... .......... .......... 67% 1.15M 2s
    3950K .......... .......... .......... .......... .......... 68% 1.06M 2s
    4000K .......... .......... .......... .......... .......... 69% 1.11M 2s
    4050K .......... .......... .......... .......... .......... 70% 1.12M 2s
    4100K .......... .......... .......... .......... .......... 71% 1.05M 2s
    4150K .......... .......... .......... .......... .......... 72% 999K 2s
    4200K .......... .......... .......... .......... .......... 72% 972K 2s
    4250K .......... .......... .......... .......... .......... 73% 990K 2s
    4300K .......... .......... .......... .......... .......... 74% 909K 2s
    4350K .......... .......... .......... .......... .......... 75% 851K 2s
    4400K .......... .......... .......... .......... .......... 76% 673K 2s
    4450K .......... .......... .......... .......... .......... 77% 870K 1s
    4500K .......... .......... .......... .......... .......... 78% 748K 1s
    4550K .......... .......... .......... .......... .......... 78% 947K 1s
    4600K .......... .......... .......... .......... .......... 79% 758K 1s
    4650K .......... .......... .......... .......... .......... 80% 870K 1s
    4700K .......... .......... .......... .......... .......... 81% 927K 1s
    4750K .......... .......... .......... .......... .......... 82% 949K 1s
    4800K .......... .......... .......... .......... .......... 83% 786K 1s
    4850K .......... .......... .......... .......... .......... 84% 854K 1s
    4900K .......... .......... .......... .......... .......... 84% 948K 1s
    4950K .......... .......... .......... .......... .......... 85% 970K 1s
    5000K .......... .......... .......... .......... .......... 86% 850K 1s
    5050K .......... .......... .......... .......... .......... 87% 888K 1s
    5100K .......... .......... .......... .......... .......... 88% 969K 1s
    5150K .......... .......... .......... .......... .......... 89% 949K 1s
    5200K .......... .......... .......... .......... .......... 90% 967K 1s
    5250K .......... .......... .......... .......... .......... 90% 848K 1s
    5300K .......... .......... .......... .......... .......... 91% 969K 1s
    5350K .......... .......... .......... .......... .......... 92% 967K 0s
    5400K .......... .......... .......... .......... .......... 93% 803K 0s
    5450K .......... .......... .......... .......... .......... 94% 1.02M 0s
    5500K .......... .......... .......... .......... .......... 95% 967K 0s
    5550K .......... .......... .......... .......... .......... 96% 949K 0s
    5600K .......... .......... .......... .......... .......... 96% 1.14M 0s
    5650K .......... .......... .......... .......... .......... 97% 1.14M 0s
    5700K .......... .......... .......... .......... .......... 98% 1.17M 0s
    5750K .......... .......... .......... .......... .......... 99% 1.07M 0s
    5800K .......... .......... ..... 100% 1.15M=6.4s

    2011-07-10 00:03:11 (904 KB/s) - ?drops/jaxp144_03.zip? saved [5964999/5964999]

    drops/jaxp144_03.zip: OK
    mkdir -p stamps
    touch stamps/download-jaxp-drop.stamp
    mkdir -p drops
    ln -sf /notnfs/nighttester/drops/jaxws6.zip drops/jdk6-jaxws2_1_6-2011_06_08.zip
    if ! echo "be95ff0ae05b474d0bbb3ad8bdb2a23f20cb8c48b1a21f16aa079e43a50c057f drops/jdk6-jaxws2_1_6-2011_06_08.zip" \
    /usr/bin/sha256sum --check ; \
    then \
    if [ -f drops/jdk6-jaxws2_1_6-2011_06_08.zip ] ; \
    then \
    mv drops/jdk6-jaxws2_1_6-2011_06_08.zip drops/jdk6-jaxws2_1_6-2011_06_08.zip.old ; \
    fi ; \
    /usr/bin/wget http://icedtea.classpath.org/download/drops/jdk6-jaxws2_1_6-2011_06_08.zip -O drops/jdk6-jaxws2_1_6-2011_06_08.zip; \
    if ! echo "be95ff0ae05b474d0bbb3ad8bdb2a23f20cb8c48b1a21f16aa079e43a50c057f drops/jdk6-jaxws2_1_6-2011_06_08.zip" \
    /usr/bin/sha256sum --check ; \
    then echo "ERROR: Bad download of jaxws drop zip"; false; \
    fi; \
    fi ;
    drops/jdk6-jaxws2_1_6-2011_06_08.zip: FAILED
    /usr/bin/sha256sum: WARNING: 1 of 1 computed checksum did NOT match
    --2011-07-10 00:03:11-- http://icedtea.classpath.org/download/drops/jdk6-jaxws2_1_6-2011_06_08.zip
    Resolving icedtea.classpath.org... 208.78.240.231
    Connecting to icedtea.classpath.org|208.78.240.231|:80... connected.
    HTTP request sent, awaiting response... 200 OK
    Length: 5512710 (5.3M) [application/zip]
    Saving to: ?drops/jdk6-jaxws2_1_6-2011_06_08.zip?

    0K .......... .......... .......... .......... .......... 0% 111K 48s
    50K .......... .......... .......... .......... .......... 1% 403K 30s
    100K .......... .......... .......... .......... .......... 2% 570K 23s
    150K .......... .......... .......... .......... .......... 3% 541K 20s
    200K .......... .......... .......... .......... .......... 4% 1.15M 16s
    250K .......... .......... .......... .......... .......... 5% 800K 15s
    300K .......... .......... .......... .......... .......... 6% 1.14M 13s
    350K .......... .......... .......... .......... .......... 7% 1.14M 12s
    400K .......... .......... .......... .......... .......... 8% 1.14M 11s
    450K .......... .......... .......... .......... .......... 9% 1.14M 10s
    500K .......... .......... .......... .......... .......... 10% 1.14M 9s
    550K .......... .......... .......... .......... .......... 11% 1.15M 9s
    600K .......... .......... .......... .......... .......... 12% 1.11M 8s
    650K .......... .......... .......... .......... .......... 13% 1.12M 8s
    700K .......... .......... .......... .......... .......... 13% 1.15M 8s
    750K .......... .......... .......... .......... .......... 14% 1.06M 7s
    800K .......... .......... .......... .......... .......... 15% 1.11M 7s
    850K .......... .......... .......... .......... .......... 16% 1.12M 7s
    900K .......... .......... .......... .......... .......... 17% 1.15M 7s
    950K .......... .......... .......... .......... .......... 18% 1.14M 6s
    1000K .......... .......... .......... .......... .......... 19% 1.08M 6s
    1050K .......... .......... .......... .......... .......... 20% 959K 6s
    1100K .......... .......... .......... .......... .......... 21% 939K 6s
    1150K .......... .......... .......... .......... .......... 22% 864K 6s
    1200K .......... .......... .......... .......... .......... 23% 670K 6s
    1250K .......... .......... .......... .......... .......... 24% 685K 6s
    1300K .......... .......... .......... .......... .......... 25% 885K 6s
    1350K .......... .......... .......... .......... .......... 26% 847K 6s
    1400K .......... .......... .......... .......... .......... 26% 798K 5s
    1450K .......... .......... .......... .......... .......... 27% 944K 5s
    1500K .......... .......... .......... .......... .......... 28% 882K 5s
    1550K .......... .......... .......... .......... .......... 29% 845K 5s
    1600K .......... .......... .......... .......... .......... 30% 987K 5s
    1650K .......... .......... .......... .......... .......... 31% 847K 5s
    1700K .......... .......... .......... .......... .......... 32% 923K 5s
    1750K .......... .......... .......... .......... .......... 33% 985K 5s
    1800K .......... .......... .......... .......... .......... 34% 832K 5s
    1850K .......... .......... .......... .......... .......... 35% 848K 5s
    1900K .......... .......... .......... .......... .......... 36% 1.04M 4s
    1950K .......... .......... .......... .......... .......... 37% 1.04M 4s
    2000K .......... .......... .......... .......... .......... 38% 799K 4s
    2050K .......... .......... .......... .......... .......... 39% 944K 4s
    2100K .......... .......... .......... .......... .......... 39% 987K 4s
    2150K .......... .......... .......... .......... .......... 40% 900K 4s
    2200K .......... .......... .......... .......... .......... 41% 815K 4s
    2250K .......... .......... .......... .......... .......... 42% 989K 4s
    2300K .......... .......... .......... .......... .......... 43% 1.03M 4s
    2350K .......... .......... .......... .......... .......... 44% 947K 4s
    2400K .......... .......... .......... .......... .......... 45% 850K 4s
    2450K .......... .......... .......... .......... .......... 46% 950K 4s
    2500K .......... .......... .......... .......... .......... 47% 1.06M 4s
    2550K .......... .......... .......... .......... .......... 48% 1.07M 3s
    2600K .......... .......... .......... .......... .......... 49% 1.13M 3s
    2650K .......... .......... .......... .......... .......... 50% 1.13M 3s
    2700K .......... .......... .......... .......... .......... 51% 1.16M 3s
    2750K .......... .......... .......... .......... .......... 52% 1.15M 3s
    2800K .......... .......... .......... .......... .......... 52% 1.11M 3s
    2850K .......... .......... .......... .......... .......... 53% 1.13M 3s
    2900K .......... .......... .......... .......... .......... 54% 1.06M 3s
    2950K .......... .......... .......... .......... .......... 55% 1.16M 3s
    3000K .......... .......... .......... .......... .......... 56% 1.11M 3s
    3050K .......... .......... .......... .......... .......... 57% 1.13M 3s
    3100K .......... .......... .......... .......... .......... 58% 1.15M 3s
    3150K .......... .......... .......... .......... .......... 59% 1.15M 3s
    3200K .......... .......... .......... .......... .......... 60% 1.12M 2s
    3250K .......... .......... .......... .......... .......... 61% 1.13M 2s
    3300K .......... .......... .......... .......... .......... 62% 1.07M 2s
    3350K .......... .......... .......... .......... .......... 63% 1.16M 2s
    3400K .......... .......... .......... .......... .......... 64% 1.13M 2s
    3450K .......... .......... .......... .......... .......... 65% 1.12M 2s
    3500K .......... .......... .......... .......... .......... 65% 1.15M 2s
    3550K .......... .......... .......... .......... .......... 66% 1.16M 2s
    3600K .......... .......... .......... .......... .......... 67% 1.11M 2s
    3650K .......... .......... .......... .......... .......... 68% 1.13M 2s
    3700K .......... .......... .......... .......... .......... 69% 1.06M 2s
    3750K .......... .......... .......... .......... .......... 70% 1.15M 2s
    3800K .......... .......... .......... .......... .......... 71% 1.11M 2s
    3850K .......... .......... .......... .......... .......... 72% 1.12M 2s
    3900K .......... .......... .......... .......... .......... 73% 1019K 2s
    3950K .......... .......... .......... .......... .......... 74% 1017K 2s
    4000K .......... .......... .......... .......... .......... 75% 907K 1s
    4050K .......... .......... .......... .......... .......... 76% 994K 1s
    4100K .......... .......... .......... .......... .......... 77% 885K 1s
    4150K .......... .......... .......... .......... .......... 78% 787K 1s
    4200K .......... .......... .......... .......... .......... 78% 695K 1s
    4250K .......... .......... .......... .......... .......... 79% 762K 1s
    4300K .......... .......... .......... .......... .......... 80% 983K 1s
    4350K .......... .......... .......... .......... .......... 81% 721K 1s
    4400K .......... .......... .......... .......... .......... 82% 969K 1s
    4450K .......... .......... .......... .......... .......... 83% 834K 1s
    4500K .......... .......... .......... .......... .......... 84% 1.04M 1s
    4550K .......... .......... .......... .......... .......... 85% 820K 1s
    4600K .......... .......... .......... .......... .......... 86% 851K 1s
    4650K .......... .......... .......... .......... .......... 87% 867K 1s
    4700K .......... .......... .......... .......... .......... 88% 928K 1s
    4750K .......... .......... .......... .......... .......... 89% 886K 1s
    4800K .......... .......... .......... .......... .......... 90% 967K 1s
    4850K .......... .......... .......... .......... .......... 91% 923K 1s
    4900K .......... .......... .......... .......... .......... 91% 802K 0s
    4950K .......... .......... .......... .......... .......... 92% 1.16M 0s
    5000K .......... .......... .......... .......... .......... 93% 793K 0s
    5050K .......... .......... .......... .......... .......... 94% 895K 0s
    5100K .......... .......... .......... .......... .......... 95% 973K 0s
    5150K .......... .......... .......... .......... .......... 96% 1024K 0s
    5200K .......... .......... .......... .......... .......... 97% 872K 0s
    5250K .......... .......... .......... .......... .......... 98% 861K 0s
    5300K .......... .......... .......... .......... .......... 99% 1.11M 0s
    5350K .......... .......... .......... ... 100% 1.16M=6.0s

    2011-07-10 00:03:18 (897 KB/s) - ?drops/jdk6-jaxws2_1_6-2011_06_08.zip? saved [5512710/5512710]

    drops/jdk6-jaxws2_1_6-2011_06_08.zip: OK
    mkdir -p stamps
    touch stamps/download-jaxws-drop.stamp
    mkdir -p drops
    ln -sf /notnfs/nighttester/drops/jaf6.zip drops/jdk6-jaf-b20.zip
    if ! echo "78c7b5c9d6271e88ee46abadd018a61f1e9645f8936cc8df1617e5f4f5074012 drops/jdk6-jaf-b20.zip" \
    /usr/bin/sha256sum --check ; \
    then \
    if [ -f drops/jdk6-jaf-b20.zip ] ; \
    then \
    mv drops/jdk6-jaf-b20.zip drops/jdk6-jaf-b20.zip.old ; \
    fi ; \
    /usr/bin/wget http://icedtea.classpath.org/download/drops/jdk6-jaf-b20.zip -O drops/jdk6-jaf-b20.zip; \
    if ! echo "78c7b5c9d6271e88ee46abadd018a61f1e9645f8936cc8df1617e5f4f5074012 drops/jdk6-jaf-b20.zip" \
    /usr/bin/sha256sum --check ; \
    then echo "ERROR: Bad download of jaf drop zip"; false; \
    fi; \
    fi ;
    drops/jdk6-jaf-b20.zip: OK
    mkdir -p stamps
    touch stamps/download-jaf-drop.stamp
    mkdir -p stamps
    touch stamps/download-drops.stamp
    touch stamps/download.stamp
    set -e ; \
    if ! test -d openjdk ; \
    then \
    mkdir openjdk ; \
    /bin/tar xf openjdk-6-src-b23-05_jul_2011.tar.gz -C openjdk; \
    chmod -R ug+w openjdk ; \
    sh /notnfs/nighttester/icedtea6-target-testing/fsg.sh ; \
    fi
    /bin/tar: openjdk-6-src-b23-05_jul_2011.tar.gz: Cannot open: No such file or directory
    /bin/tar: Error is not recoverable: exiting now
    make: *** [stamps/extract-openjdk.stamp] Error 2
    + exit 1
  • Hudson Admin at Jul 10, 2011 at 9:03 pm
    See <http://toadeater:8080/job/IcedTea6TargetTesting/726/>

    ------------------------------------------
    [...truncated 408 lines...]
    2250K .......... .......... .......... .......... .......... 39% 996K 4s
    2300K .......... .......... .......... .......... .......... 40% 1015K 4s
    2350K .......... .......... .......... .......... .......... 41% 1011K 4s
    2400K .......... .......... .......... .......... .......... 42% 923K 4s
    2450K .......... .......... .......... .......... .......... 42% 747K 4s
    2500K .......... .......... .......... .......... .......... 43% 687K 4s
    2550K .......... .......... .......... .......... .......... 44% 803K 4s
    2600K .......... .......... .......... .......... .......... 45% 665K 4s
    2650K .......... .......... .......... .......... .......... 46% 925K 4s
    2700K .......... .......... .......... .......... .......... 47% 788K 4s
    2750K .......... .......... .......... .......... .......... 48% 803K 4s
    2800K .......... .......... .......... .......... .......... 48% 927K 4s
    2850K .......... .......... .......... .......... .......... 49% 867K 4s
    2900K .......... .......... .......... .......... .......... 50% 907K 3s
    2950K .......... .......... .......... .......... .......... 51% 850K 3s
    3000K .......... .......... .......... .......... .......... 52% 867K 3s
    3050K .......... .......... .......... .......... .......... 53% 1.02M 3s
    3100K .......... .......... .......... .......... .......... 54% 774K 3s
    3150K .......... .......... .......... .......... .......... 54% 992K 3s
    3200K .......... .......... .......... .......... .......... 55% 945K 3s
    3250K .......... .......... .......... .......... .......... 56% 870K 3s
    3300K .......... .......... .......... .......... .......... 57% 870K 3s
    3350K .......... .......... .......... .......... .......... 58% 1017K 3s
    3400K .......... .......... .......... .......... .......... 59% 925K 3s
    3450K .......... .......... .......... .......... .......... 60% 851K 3s
    3500K .......... .......... .......... .......... .......... 60% 1.16M 3s
    3550K .......... .......... .......... .......... .......... 61% 1.16M 3s
    3600K .......... .......... .......... .......... .......... 62% 1.12M 3s
    3650K .......... .......... .......... .......... .......... 63% 1.13M 2s
    3700K .......... .......... .......... .......... .......... 64% 1.15M 2s
    3750K .......... .......... .......... .......... .......... 65% 1.16M 2s
    3800K .......... .......... .......... .......... .......... 66% 1.13M 2s
    3850K .......... .......... .......... .......... .......... 66% 1.13M 2s
    3900K .......... .......... .......... .......... .......... 67% 1.15M 2s
    3950K .......... .......... .......... .......... .......... 68% 1.16M 2s
    4000K .......... .......... .......... .......... .......... 69% 1.13M 2s
    4050K .......... .......... .......... .......... .......... 70% 1.13M 2s
    4100K .......... .......... .......... .......... .......... 71% 1.16M 2s
    4150K .......... .......... .......... .......... .......... 72% 1.16M 2s
    4200K .......... .......... .......... .......... .......... 72% 1.12M 2s
    4250K .......... .......... .......... .......... .......... 73% 1.12M 2s
    4300K .......... .......... .......... .......... .......... 74% 1.16M 2s
    4350K .......... .......... .......... .......... .......... 75% 1.16M 2s
    4400K .......... .......... .......... .......... .......... 76% 1.12M 2s
    4450K .......... .......... .......... .......... .......... 77% 1.13M 1s
    4500K .......... .......... .......... .......... .......... 78% 1.16M 1s
    4550K .......... .......... .......... .......... .......... 78% 1.16M 1s
    4600K .......... .......... .......... .......... .......... 79% 1.13M 1s
    4650K .......... .......... .......... .......... .......... 80% 1.13M 1s
    4700K .......... .......... .......... .......... .......... 81% 1000K 1s
    4750K .......... .......... .......... .......... .......... 82% 1.06M 1s
    4800K .......... .......... .......... .......... .......... 83% 1.12M 1s
    4850K .......... .......... .......... .......... .......... 84% 1.05M 1s
    4900K .......... .......... .......... .......... .......... 84% 1000K 1s
    4950K .......... .......... .......... .......... .......... 85% 1019K 1s
    5000K .......... .......... .......... .......... .......... 86% 948K 1s
    5050K .......... .......... .......... .......... .......... 87% 963K 1s
    5100K .......... .......... .......... .......... .......... 88% 851K 1s
    5150K .......... .......... .......... .......... .......... 89% 686K 1s
    5200K .......... .......... .......... .......... .......... 90% 709K 1s
    5250K .......... .......... .......... .......... .......... 90% 789K 1s
    5300K .......... .......... .......... .......... .......... 91% 851K 1s
    5350K .......... .......... .......... .......... .......... 92% 774K 0s
    5400K .......... .......... .......... .......... .......... 93% 802K 0s
    5450K .......... .......... .......... .......... .......... 94% 853K 0s
    5500K .......... .......... .......... .......... .......... 95% 888K 0s
    5550K .......... .......... .......... .......... .......... 96% 951K 0s
    5600K .......... .......... .......... .......... .......... 96% 809K 0s
    5650K .......... .......... .......... .......... .......... 97% 878K 0s
    5700K .......... .......... .......... .......... .......... 98% 959K 0s
    5750K .......... .......... .......... .......... .......... 99% 895K 0s
    5800K .......... .......... ..... 100% 966K=6.5s

    2011-07-11 00:03:11 (900 KB/s) - ?drops/jaxp144_03.zip? saved [5964999/5964999]

    drops/jaxp144_03.zip: OK
    mkdir -p stamps
    touch stamps/download-jaxp-drop.stamp
    mkdir -p drops
    ln -sf /notnfs/nighttester/drops/jaxws6.zip drops/jdk6-jaxws2_1_6-2011_06_08.zip
    if ! echo "be95ff0ae05b474d0bbb3ad8bdb2a23f20cb8c48b1a21f16aa079e43a50c057f drops/jdk6-jaxws2_1_6-2011_06_08.zip" \
    /usr/bin/sha256sum --check ; \
    then \
    if [ -f drops/jdk6-jaxws2_1_6-2011_06_08.zip ] ; \
    then \
    mv drops/jdk6-jaxws2_1_6-2011_06_08.zip drops/jdk6-jaxws2_1_6-2011_06_08.zip.old ; \
    fi ; \
    /usr/bin/wget http://icedtea.classpath.org/download/drops/jdk6-jaxws2_1_6-2011_06_08.zip -O drops/jdk6-jaxws2_1_6-2011_06_08.zip; \
    if ! echo "be95ff0ae05b474d0bbb3ad8bdb2a23f20cb8c48b1a21f16aa079e43a50c057f drops/jdk6-jaxws2_1_6-2011_06_08.zip" \
    /usr/bin/sha256sum --check ; \
    then echo "ERROR: Bad download of jaxws drop zip"; false; \
    fi; \
    fi ;
    drops/jdk6-jaxws2_1_6-2011_06_08.zip: FAILED
    /usr/bin/sha256sum: WARNING: 1 of 1 computed checksum did NOT match
    --2011-07-11 00:03:11-- http://icedtea.classpath.org/download/drops/jdk6-jaxws2_1_6-2011_06_08.zip
    Resolving icedtea.classpath.org... 208.78.240.231
    Connecting to icedtea.classpath.org|208.78.240.231|:80... connected.
    HTTP request sent, awaiting response... 200 OK
    Length: 5512710 (5.3M) [application/zip]
    Saving to: ?drops/jdk6-jaxws2_1_6-2011_06_08.zip?

    0K .......... .......... .......... .......... .......... 0% 111K 48s
    50K .......... .......... .......... .......... .......... 1% 374K 31s
    100K .......... .......... .......... .......... .......... 2% 563K 23s
    150K .......... .......... .......... .......... .......... 3% 460K 20s
    200K .......... .......... .......... .......... .......... 4% 893K 17s
    250K .......... .......... .......... .......... .......... 5% 1.14M 15s
    300K .......... .......... .......... .......... .......... 6% 1.15M 13s
    350K .......... .......... .......... .......... .......... 7% 1.15M 12s
    400K .......... .......... .......... .......... .......... 8% 1.11M 11s
    450K .......... .......... .......... .......... .......... 9% 1.15M 10s
    500K .......... .......... .......... .......... .......... 10% 1.05M 10s
    550K .......... .......... .......... .......... .......... 11% 1.13M 9s
    600K .......... .......... .......... .......... .......... 12% 1.05M 9s
    650K .......... .......... .......... .......... .......... 13% 1.12M 8s
    700K .......... .......... .......... .......... .......... 13% 1.15M 8s
    750K .......... .......... .......... .......... .......... 14% 1.16M 8s
    800K .......... .......... .......... .......... .......... 15% 1.12M 7s
    850K .......... .......... .......... .......... .......... 16% 1.10M 7s
    900K .......... .......... .......... .......... .......... 17% 1.16M 7s
    950K .......... .......... .......... .......... .......... 18% 402K 7s
    1000K .......... .......... .......... .......... .......... 19% 5.70M 7s
    1050K .......... .......... .......... .......... .......... 20% 191M 6s
    1100K .......... .......... .......... .......... .......... 21% 1.17M 6s
    1150K .......... .......... .......... .......... .......... 22% 951K 6s
    1200K .......... .......... .......... .......... .......... 23% 918K 6s
    1250K .......... .......... .......... .......... .......... 24% 1.04M 6s
    1300K .......... .......... .......... .......... .......... 25% 1017K 5s
    1350K .......... .......... .......... .......... .......... 26% 850K 5s
    1400K .......... .......... .......... .......... .......... 26% 655K 5s
    1450K .......... .......... .......... .......... .......... 27% 759K 5s
    1500K .......... .......... .......... .......... .......... 28% 722K 5s
    1550K .......... .......... .......... .......... .......... 29% 887K 5s
    1600K .......... .......... .......... .......... .......... 30% 734K 5s
    1650K .......... .......... .......... .......... .......... 31% 971K 5s
    1700K .......... .......... .......... .......... .......... 32% 820K 5s
    1750K .......... .......... .......... .......... .......... 33% 870K 5s
    1800K .......... .......... .......... .......... .......... 34% 851K 5s
    1850K .......... .......... .......... .......... .......... 35% 889K 5s
    1900K .......... .......... .......... .......... .......... 36% 870K 5s
    1950K .......... .......... .......... .......... .......... 37% 969K 4s
    2000K .......... .......... .......... .......... .......... 38% 787K 4s
    2050K .......... .......... .......... .......... .......... 39% 994K 4s
    2100K .......... .......... .......... .......... .......... 39% 936K 4s
    2150K .......... .......... .......... .......... .......... 40% 925K 4s
    2200K .......... .......... .......... .......... .......... 41% 852K 4s
    2250K .......... .......... .......... .......... .......... 42% 871K 4s
    2300K .......... .......... .......... .......... .......... 43% 992K 4s
    2350K .......... .......... .......... .......... .......... 44% 949K 4s
    2400K .......... .......... .......... .......... .......... 45% 1017K 4s
    2450K .......... .......... .......... .......... .......... 46% 1.13M 4s
    2500K .......... .......... .......... .......... .......... 47% 1.16M 4s
    2550K .......... .......... .......... .......... .......... 48% 1.16M 3s
    2600K .......... .......... .......... .......... .......... 49% 1.12M 3s
    2650K .......... .......... .......... .......... .......... 50% 1.12M 3s
    2700K .......... .......... .......... .......... .......... 51% 1.16M 3s
    2750K .......... .......... .......... .......... .......... 52% 1.16M 3s
    2800K .......... .......... .......... .......... .......... 52% 1.12M 3s
    2850K .......... .......... .......... .......... .......... 53% 1.13M 3s
    2900K .......... .......... .......... .......... .......... 54% 1.16M 3s
    2950K .......... .......... .......... .......... .......... 55% 1.15M 3s
    3000K .......... .......... .......... .......... .......... 56% 1.10M 3s
    3050K .......... .......... .......... .......... .......... 57% 1.13M 3s
    3100K .......... .......... .......... .......... .......... 58% 1.15M 3s
    3150K .......... .......... .......... .......... .......... 59% 1.16M 3s
    3200K .......... .......... .......... .......... .......... 60% 1.11M 2s
    3250K .......... .......... .......... .......... .......... 61% 1.13M 2s
    3300K .......... .......... .......... .......... .......... 62% 1.16M 2s
    3350K .......... .......... .......... .......... .......... 63% 1.15M 2s
    3400K .......... .......... .......... .......... .......... 64% 1.13M 2s
    3450K .......... .......... .......... .......... .......... 65% 1.12M 2s
    3500K .......... .......... .......... .......... .......... 65% 1.15M 2s
    3550K .......... .......... .......... .......... .......... 66% 1.16M 2s
    3600K .......... .......... .......... .......... .......... 67% 1.12M 2s
    3650K .......... .......... .......... .......... .......... 68% 1.12M 2s
    3700K .......... .......... .......... .......... .......... 69% 932K 2s
    3750K .......... .......... .......... .......... .......... 70% 816K 2s
    3800K .......... .......... .......... .......... .......... 71% 1.12M 2s
    3850K .......... .......... .......... .......... .......... 72% 1.12M 2s
    3900K .......... .......... .......... .......... .......... 73% 1.12M 2s
    3950K .......... .......... .......... .......... .......... 74% 1.01M 2s
    4000K .......... .......... .......... .......... .......... 75% 758K 1s
    4050K .......... .......... .......... .......... .......... 76% 719K 1s
    4100K .......... .......... .......... .......... .......... 77% 814K 1s
    4150K .......... .......... .......... .......... .......... 78% 902K 1s
    4200K .......... .......... .......... .......... .......... 78% 675K 1s
    4250K .......... .......... .......... .......... .......... 79% 989K 1s
    4300K .......... .......... .......... .......... .......... 80% 864K 1s
    4350K .......... .......... .......... .......... .......... 81% 923K 1s
    4400K .......... .......... .......... .......... .......... 82% 844K 1s
    4450K .......... .......... .......... .......... .......... 83% 865K 1s
    4500K .......... .......... .......... .......... .......... 84% 987K 1s
    4550K .......... .......... .......... .......... .......... 85% 873K 1s
    4600K .......... .......... .......... .......... .......... 86% 848K 1s
    4650K .......... .......... .......... .......... .......... 87% 1.01M 1s
    4700K .......... .......... .......... .......... .......... 88% 864K 1s
    4750K .......... .......... .......... .......... .......... 89% 959K 1s
    4800K .......... .......... .......... .......... .......... 90% 940K 1s
    4850K .......... .......... .......... .......... .......... 91% 814K 1s
    4900K .......... .......... .......... .......... .......... 91% 985K 0s
    4950K .......... .......... .......... .......... .......... 92% 939K 0s
    5000K .......... .......... .......... .......... .......... 93% 869K 0s
    5050K .......... .......... .......... .......... .......... 94% 928K 0s
    5100K .......... .......... .......... .......... .......... 95% 971K 0s
    5150K .......... .......... .......... .......... .......... 96% 1.05M 0s
    5200K .......... .......... .......... .......... .......... 97% 850K 0s
    5250K .......... .......... .......... .......... .......... 98% 1.05M 0s
    5300K .......... .......... .......... .......... .......... 99% 1.17M 0s
    5350K .......... .......... .......... ... 100% 1.17M=6.0s

    2011-07-11 00:03:17 (897 KB/s) - ?drops/jdk6-jaxws2_1_6-2011_06_08.zip? saved [5512710/5512710]

    drops/jdk6-jaxws2_1_6-2011_06_08.zip: OK
    mkdir -p stamps
    touch stamps/download-jaxws-drop.stamp
    mkdir -p drops
    ln -sf /notnfs/nighttester/drops/jaf6.zip drops/jdk6-jaf-b20.zip
    if ! echo "78c7b5c9d6271e88ee46abadd018a61f1e9645f8936cc8df1617e5f4f5074012 drops/jdk6-jaf-b20.zip" \
    /usr/bin/sha256sum --check ; \
    then \
    if [ -f drops/jdk6-jaf-b20.zip ] ; \
    then \
    mv drops/jdk6-jaf-b20.zip drops/jdk6-jaf-b20.zip.old ; \
    fi ; \
    /usr/bin/wget http://icedtea.classpath.org/download/drops/jdk6-jaf-b20.zip -O drops/jdk6-jaf-b20.zip; \
    if ! echo "78c7b5c9d6271e88ee46abadd018a61f1e9645f8936cc8df1617e5f4f5074012 drops/jdk6-jaf-b20.zip" \
    /usr/bin/sha256sum --check ; \
    then echo "ERROR: Bad download of jaf drop zip"; false; \
    fi; \
    fi ;
    drops/jdk6-jaf-b20.zip: OK
    mkdir -p stamps
    touch stamps/download-jaf-drop.stamp
    mkdir -p stamps
    touch stamps/download-drops.stamp
    touch stamps/download.stamp
    set -e ; \
    if ! test -d openjdk ; \
    then \
    mkdir openjdk ; \
    /bin/tar xf openjdk-6-src-b23-05_jul_2011.tar.gz -C openjdk; \
    chmod -R ug+w openjdk ; \
    sh /notnfs/nighttester/icedtea6-target-testing/fsg.sh ; \
    fi
    /bin/tar: openjdk-6-src-b23-05_jul_2011.tar.gz: Cannot open: No such file or directory
    /bin/tar: Error is not recoverable: exiting now
    make: *** [stamps/extract-openjdk.stamp] Error 2
    + exit 1
  • Hudson Admin at Jul 11, 2011 at 3:39 pm
    See <http://toadeater:8080/job/IcedTea6TargetTesting/727/>

    ------------------------------------------
    [...truncated 163 lines...]
    adding manifests
    adding file changes
    added 5 changesets with 11 changes to 4 files
    (run 'hg update' to get a working copy)
    + hg update
    4 files updated, 0 files merged, 6 files removed, 0 files unresolved
    + ./autogen.sh
    + ./configure --with-parallel-jobs=3 --with-openjdk-src-zip=/notnfs/nighttester/drops/openjdk-6-src-b23-05_jul_2011.tar.gz --with-cacao-src-zip=/notnfs/nighttester/drops/cacao-dd4532afd08a.tar.bz2 --with-hotspot-src-zip=/notnfs/nighttester/drops/hs20.tar.gz --with-jaxp-drop-zip=/notnfs/nighttester/drops/jaxp6.zip --with-jaf-drop-zip=/notnfs/nighttester/drops/jaf6.zip --with-jaxws-drop-zip=/notnfs/nighttester/drops/jaxws6.zip --enable-systemtap
    checking for a BSD-compatible install... /usr/bin/install -c
    checking whether build environment is sane... yes
    checking for a thread-safe mkdir -p... /bin/mkdir -p
    checking for gawk... gawk
    checking whether make sets $(MAKE)... yes
    checking how to create a pax tar archive... gnutar
    checking build system type... x86_64-unknown-linux-gnu
    checking host system type... x86_64-unknown-linux-gnu
    checking for gcc... gcc
    checking whether the C compiler works... yes
    checking for C compiler default output file name... a.out
    checking for suffix of executables...
    checking whether we are cross compiling... no
    checking for suffix of object files... o
    checking whether we are using the GNU C compiler... yes
    checking whether gcc accepts -g... yes
    checking for gcc option to accept ISO C89... none needed
    checking for style of include used by make... GNU
    checking dependency style of gcc... none
    checking for g++... g++
    checking whether we are using the GNU C++ compiler... yes
    checking whether g++ accepts -g... yes
    checking dependency style of g++... none
    checking for make... /usr/bin/make
    checking for gzip... /bin/gzip
    checking for ant... /usr/bin/ant
    checking for find... /bin/find
    checking for patch... /usr/bin/patch
    checking for tar... /bin/tar
    checking for chmod... /bin/chmod
    checking for sha256sum... /usr/bin/sha256sum
    checking for wget... /usr/bin/wget
    checking for zip... /usr/bin/zip
    checking for unzip... /usr/bin/unzip
    checking for cpio... /bin/cpio
    checking for file... /usr/bin/file
    checking for fastjar... fastjar
    checking for ldd... ldd
    checking for gawk... /bin/gawk
    checking for hg... /usr/bin/hg
    checking for an OpenJDK source directory... /notnfs/nighttester/icedtea6-target-testing/openjdk
    checking for IcedTea Mercurial revision ID... r802bc279de76+
    checking for JDK Mercurial revision ID... none
    checking for HotSpot Mercurial revision ID... none
    checking for lsb_release... /usr/bin/lsb_release
    checking whether to compile ecj natively... no
    checking which HotSpot build to use... original
    checking for linux32... /usr/bin/linux32
    checking version of GCC... 4.5.1 (major version 4, minor version 5)
    checking for getconf... /usr/bin/getconf
    checking the number of online processors... 2
    checking how many parallel build jobs to execute... 3
    checking if cp supports --reflink... yes
    checking if we can hard link rather than copy from /notnfs/nighttester/icedtea6-target-testing... yes
    checking if a PaX-enabled kernel is running... no
    checking for system library directory...
    checking for pkg-config... /usr/bin/pkg-config
    checking pkg-config is at least version 0.9.0... yes
    checking for NSS... yes
    checking for xvfb-run... xvfb-run -a -e xvfb-errors
    checking for an Ant home directory... /usr/share/ant
    checking whether to include PulseAudio support... no
    checking whether to build documentation... yes
    checking whether to enable experimental OpenJDK cross-compilation support... no
    checking whether to include the XRender pipeline... yes
    checking whether to include NIO2 support... no
    checking whether to include SystemTap tracing support... yes
    checking whether to include the NSS-based security provider... disabled by default (edit java.security to enable)
    checking for distribution package version... none
    checking build identification... Built on Fedora release 14 (Laughlin) (Mon Jul 11 18:39:09 EDT 2011)
    checking whether to build a bootstrap version first... yes
    checking for a JDK home directory... /usr/lib/jvm/java-gcj
    checking if a java binary was specified... no
    checking if /usr/lib/jvm/java-gcj/bin/java is a valid executable file... yes
    checking for javac... /usr/bin/javac
    checking if a javah binary was specified... no
    checking if /usr/lib/jvm/java-gcj/bin/javah is a valid executable file... yes
    checking if a jar binary was specified... no
    checking if /usr/lib/jvm/java-gcj/bin/jar is a valid executable file... yes
    checking whether jar supports @<file> argument... yes
    checking whether jar supports stdin file arguments... yes
    checking whether jar supports -J options at the end... yes
    checking if a rmic binary was specified... no
    checking if /usr/lib/jvm/java-gcj/bin/rmic is a valid executable file... yes
    checking if a native2ascii binary was specified... no
    checking if /usr/lib/jvm/java-gcj/bin/native2ascii is a valid executable file... no
    checking for native2ascii... /usr/bin/native2ascii
    checking for an ecj JAR file... /usr/share/java/eclipse-ecj.jar
    checking for a xalan2 jar... /usr/share/java/xalan-j2.jar
    checking for a xalan2 serializer jar... /usr/share/java/xalan-j2-serializer.jar
    checking for a xerces2 jar... /usr/share/java/xerces-j2.jar
    checking if org.apache.xerces.dom.DeferredDocumentImpl is instantiable... yes
    checking whether to include Javascript support via Rhino... /usr/share/java/rhino.jar
    checking for an OpenJDK source zip... /notnfs/nighttester/drops/openjdk-6-src-b23-05_jul_2011.tar.gz
    checking for a HotSpot source zip... /notnfs/nighttester/drops/hs20.tar.gz
    checking for an alternate jar command... not specified
    checking for a JAXP drop zip... /notnfs/nighttester/drops/jaxp6.zip
    checking for a JAF drop zip... /notnfs/nighttester/drops/jaf6.zip
    checking for a JAXWS drop zip... /notnfs/nighttester/drops/jaxws6.zip
    checking whether to use CACAO as VM... no
    checking for a CACAO home directory... $(abs_top_builddir)/cacao/install
    checking for a CACAO source zip... /notnfs/nighttester/drops/cacao-dd4532afd08a.tar.bz2
    checking for a CACAO source directory... not specified
    checking whether to use JamVM as VM... no
    checking for a JamVM source zip... not specified
    checking whether to disable optimizations and build with -O0 -g... no
    checking whether to use the Shark JIT... no
    checking how to run the C preprocessor... gcc -E
    checking for grep that handles long lines and -e... /bin/grep
    checking for egrep... /bin/grep -E
    checking for ANSI C header files... yes
    checking for sys/types.h... yes
    checking for sys/stat.h... yes
    checking for stdlib.h... yes
    checking for string.h... yes
    checking for memory.h... yes
    checking for strings.h... yes
    checking for inttypes.h... yes
    checking for stdint.h... yes
    checking for unistd.h... yes
    checking whether to use the zero-assembler port... no
    checking whether byte ordering is bigendian... no
    checking for additional virtual machines to build... none
    checking whether to retrieve the source code from Mercurial... no
    checking which Mercurial revision to use... tip
    checking which Java timezone data directory to use... /usr/share/javazi
    checking if javax.xml.stream.events.Attribute.getDTDType() wrongly returns a QName... no
    checking if /usr/lib/jvm/java-gcj/bin/javah exhibits Classpath bug 39408... yes
    checking if /usr/lib/jvm/java-gcj/bin/javah exhibits Classpath bug 40188... yes
    checking cups/cups.h usability... yes
    checking cups/cups.h presence... yes
    checking for cups/cups.h... yes
    checking cups/ppd.h usability... yes
    checking cups/ppd.h presence... yes
    checking for cups/ppd.h... yes
    checking X11/X.h usability... yes
    checking X11/X.h presence... yes
    checking for X11/X.h... yes
    checking for main in -ljpeg... yes
    checking for main in -lgif... yes
    checking for main in -lz... yes
    checking for XPROTO... yes
    checking for XT... yes
    checking for XP... yes
    checking for X11... yes
    checking for XINERAMA... yes
    checking for XRENDER... yes
    checking sys/sdt.h usability... yes
    checking sys/sdt.h presence... yes
    checking for sys/sdt.h... yes
    checking working sys/sdt.h and g++ support... yes
    checking for absolute java home install dir... /notnfs/nighttester/icedtea6-target-testing/openjdk.build/j2sdk-image
    checking for LIBPNG... yes
    checking for XTST... yes
    checking for FREETYPE2... yes
    checking for ALSA... yes
    configure: creating ./config.status
    config.status: creating Makefile
    config.status: creating nss.cfg
    config.status: creating javac
    config.status: creating javap
    config.status: creating jvm.cfg
    config.status: creating ergo.c
    config.status: creating tz.properties
    config.status: creating tapset/hotspot.stp
    config.status: creating tapset/hotspot_jni.stp
    config.status: creating tapset/jstack.stp
    config.status: executing depfiles commands
    + make env-ecj
    unset JAVA_HOME
    export ALT_JDK_IMPORT_PATH="/notnfs/nighttester/icedtea6-target-testing/bootstrap/jdk1.6.0" ANT="/usr/bin/ant" BUILD_NUMBER="b23" JDK_UPDATE_VERSION="23" JRE_RELEASE_VERSION="1.6.0_23-b23" MILESTONE="fcs" LANG="C" PATH="/notnfs/nighttester/icedtea6-target-testing/bootstrap/jdk1.6.0/bin::$PATH" ALT_BOOTDIR="/notnfs/nighttester/icedtea6-target-testing/bootstrap/jdk1.6.0" BUILD_ARCH_DIR="amd64" ICEDTEA_CLS_DIR="/notnfs/nighttester/icedtea6-target-testing/openjdk.build/classes" CLASSPATH="" LD_LIBRARY_PATH="" ZERO_BUILD="" SHARK_BUILD="" ZERO_LIBARCH="amd64" ARCH_DATA_MODEL="64" ZERO_ENDIANNESS="little" ZERO_ARCHDEF="AMD64" ZERO_ARCHFLAG="-m64" LIBFFI_CFLAGS="" LIBFFI_LIBS="" LLVM_CFLAGS="" LLVM_LDFLAGS="" LLVM_LIBS="" FREETYPE2_HEADERS="-I/usr/include/freetype2 " FT2_LIB="-lfreetype " ALT_PARALLEL_COMPILE_JOBS="3" HOTSPOT_BUILD_JOBS="3" JAVAC="" JAVA_HOME="" JDK_HOME="" DISTRIBUTION_ID="Built on Fedora release 14 (Laughlin) (Mon Jul 11 18:39:09 EDT 2011)" DERIVATIVE_ID="IcedTea6 1.11pre+r802bc279de76+" DEBUG_CLASSFILES="true" DEBUG_BINARIES="true" ALT_DROPS_DIR="/notnfs/nighttester/icedtea6-target-testing/drops" VERBOSE="" ALT_OUTPUTDIR="/notnfs/nighttester/icedtea6-target-testing/openjdk.build" RHINO_JAR="/notnfs/nighttester/icedtea6-target-testing/rhino/rhino.jar" ALT_OUTPUTDIR="/notnfs/nighttester/icedtea6-target-testing/openjdk.build-ecj" JAVA_TOOLS_DIR="/notnfs/nighttester/icedtea6-target-testing/bootstrap/jdk1.6.0/bin" ICEDTEA_RT="/notnfs/nighttester/icedtea6-target-testing/bootstrap/jdk1.6.0/jre/lib/rt.jar" ICEDTEA_CLS_DIR="/notnfs/nighttester/icedtea6-target-testing/openjdk.build-ecj/classes" BOOTCLASSPATH_CLS_RT="-bootclasspath /notnfs/nighttester/icedtea6-target-testing/openjdk.build-ecj/classes:/notnfs/nighttester/icedtea6-target-testing/bootstrap/jdk1.6.0/jre/lib/rt.jar" BOOTCLASSPATH_CLS="-bootclasspath /notnfs/nighttester/icedtea6-target-testing/openjdk.build-ecj/classes" BOOTCLASSPATH_RT_LIBGCJ="-bootclasspath /notnfs/nighttester/icedtea6-target-testing/bootstrap/jdk1.6.0/jre/lib/rt.jar" CLASSPATH="" ICEDTEA_ENDORSED_DIR="/notnfs/nighttester/icedtea6-target-testing/bootstrap/jdk1.6.0/lib/endorsed" ENDORSED="-Djava.endorsed.dirs=/notnfs/nighttester/icedtea6-target-testing/bootstrap/jdk1.6.0/lib/endorsed" LD_LIBRARY_PATH="" GENSRCDIR="/notnfs/nighttester/icedtea6-target-testing/generated" JAR_KNOWS_ATFILE="1" JAR_KNOWS_J_OPTIONS="1" JAR_ACCEPTS_STDIN_LIST="1" DISABLE_NIMBUS="true" NO_DOCS="true"
    + make extract-ecj
    mkdir -p drops
    ln -sf /notnfs/nighttester/drops/jaxp6.zip drops/jaxp144_03.zip
    if ! echo "c1a5348e17b330a7e4b18431e61a40efd2ba99a7da71102cf2c604478ef96012 drops/jaxp144_03.zip" \
    /usr/bin/sha256sum --check ; \
    then \
    if [ -f drops/jaxp144_03.zip ] ; \
    then \
    mv drops/jaxp144_03.zip drops/jaxp144_03.zip.old ; \
    fi ; \
    /usr/bin/wget http://icedtea.classpath.org/download/drops/jaxp144_03.zip -O drops/jaxp144_03.zip; \
    if ! echo "c1a5348e17b330a7e4b18431e61a40efd2ba99a7da71102cf2c604478ef96012 drops/jaxp144_03.zip" \
    /usr/bin/sha256sum --check ; \
    then echo "ERROR: Bad download of jaxp drop zip"; false; \
    fi; \
    fi ;
    drops/jaxp144_03.zip: OK
    mkdir -p stamps
    touch stamps/download-jaxp-drop.stamp
    mkdir -p drops
    ln -sf /notnfs/nighttester/drops/jaxws6.zip drops/jdk6-jaxws2_1_6-2011_06_08.zip
    if ! echo "be95ff0ae05b474d0bbb3ad8bdb2a23f20cb8c48b1a21f16aa079e43a50c057f drops/jdk6-jaxws2_1_6-2011_06_08.zip" \
    /usr/bin/sha256sum --check ; \
    then \
    if [ -f drops/jdk6-jaxws2_1_6-2011_06_08.zip ] ; \
    then \
    mv drops/jdk6-jaxws2_1_6-2011_06_08.zip drops/jdk6-jaxws2_1_6-2011_06_08.zip.old ; \
    fi ; \
    /usr/bin/wget http://icedtea.classpath.org/download/drops/jdk6-jaxws2_1_6-2011_06_08.zip -O drops/jdk6-jaxws2_1_6-2011_06_08.zip; \
    if ! echo "be95ff0ae05b474d0bbb3ad8bdb2a23f20cb8c48b1a21f16aa079e43a50c057f drops/jdk6-jaxws2_1_6-2011_06_08.zip" \
    /usr/bin/sha256sum --check ; \
    then echo "ERROR: Bad download of jaxws drop zip"; false; \
    fi; \
    fi ;
    drops/jdk6-jaxws2_1_6-2011_06_08.zip: OK
    mkdir -p stamps
    touch stamps/download-jaxws-drop.stamp
    mkdir -p drops
    ln -sf /notnfs/nighttester/drops/jaf6.zip drops/jdk6-jaf-b20.zip
    if ! echo "78c7b5c9d6271e88ee46abadd018a61f1e9645f8936cc8df1617e5f4f5074012 drops/jdk6-jaf-b20.zip" \
    /usr/bin/sha256sum --check ; \
    then \
    if [ -f drops/jdk6-jaf-b20.zip ] ; \
    then \
    mv drops/jdk6-jaf-b20.zip drops/jdk6-jaf-b20.zip.old ; \
    fi ; \
    /usr/bin/wget http://icedtea.classpath.org/download/drops/jdk6-jaf-b20.zip -O drops/jdk6-jaf-b20.zip; \
    if ! echo "78c7b5c9d6271e88ee46abadd018a61f1e9645f8936cc8df1617e5f4f5074012 drops/jdk6-jaf-b20.zip" \
    /usr/bin/sha256sum --check ; \
    then echo "ERROR: Bad download of jaf drop zip"; false; \
    fi; \
    fi ;
    drops/jdk6-jaf-b20.zip: OK
    mkdir -p stamps
    touch stamps/download-jaf-drop.stamp
    mkdir -p stamps
    touch stamps/download-drops.stamp
    touch stamps/download.stamp
    set -e ; \
    if ! test -d openjdk ; \
    then \
    mkdir openjdk ; \
    /bin/tar xf openjdk-6-src-b23-05_jul_2011.tar.gz -C openjdk; \
    chmod -R ug+w openjdk ; \
    sh /notnfs/nighttester/icedtea6-target-testing/fsg.sh ; \
    fi
    /bin/tar: openjdk-6-src-b23-05_jul_2011.tar.gz: Cannot open: No such file or directory
    /bin/tar: Error is not recoverable: exiting now
    make: *** [stamps/extract-openjdk.stamp] Error 2
    + exit 1
  • Hudson Admin at Jul 11, 2011 at 4:04 pm
    See <http://toadeater:8080/job/IcedTea6TargetTesting/728/>

    ------------------------------------------
    [...truncated 47554 lines...]
    Hunk #4 succeeded at 647 (offset 3 lines).
    Hunk #5 succeeded at 657 (offset 3 lines).
    patching file openjdk/jdk/test/java/awt/Color/OpacityChange/OpacityChange.java
    Checking patches/openjdk/6785424-SecurityException_locating_physical_fonts.patch
    Applying patches/openjdk/6785424-SecurityException_locating_physical_fonts.patch
    patching file openjdk/jdk/src/share/classes/sun/font/FontManager.java
    Hunk #1 succeeded at 1583 (offset -18 lines).
    patching file openjdk/jdk/test/java/awt/FontClass/FontAccess.java
    Checking patches/openjdk/7047069-Array_can_dynamically_change_size.patch
    Applying patches/openjdk/7047069-Array_can_dynamically_change_size.patch
    patching file openjdk/hotspot/src/share/vm/opto/library_call.cpp
    Hunk #1 succeeded at 5136 (offset -89 lines).
    patching file openjdk/hotspot/test/compiler/7047069/Test7047069.java
    Checking patches/openjdk/6796786-invalid_FP_identity_transform.patch
    Applying patches/openjdk/6796786-invalid_FP_identity_transform.patch
    patching file openjdk/hotspot/src/share/vm/opto/subnode.cpp
    Hunk #1 succeeded at 1224 (offset 1 line).
    patching file openjdk/hotspot/src/share/vm/opto/subnode.hpp
    patching file openjdk/hotspot/test/compiler/6796786/Test6796786.java
    Checking patches/openjdk/7042070-Typo_in_Test6796786.patch
    Applying patches/openjdk/7042070-Typo_in_Test6796786.patch
    patching file openjdk/hotspot/test/compiler/6796786/Test6796786.java
    Checking patches/openjdk/6679308-Poor_text_rendering_on_translucent_image.patch
    Applying patches/openjdk/6679308-Poor_text_rendering_on_translucent_image.patch
    patching file openjdk/jdk/src/share/native/sun/java2d/loops/AlphaMacros.h
    patching file openjdk/jdk/src/share/native/sun/java2d/loops/ByteGray.h
    patching file openjdk/jdk/src/share/native/sun/java2d/loops/FourByteAbgr.h
    patching file openjdk/jdk/src/share/native/sun/java2d/loops/FourByteAbgrPre.h
    patching file openjdk/jdk/src/share/native/sun/java2d/loops/Index12Gray.h
    patching file openjdk/jdk/src/share/native/sun/java2d/loops/Index8Gray.h
    patching file openjdk/jdk/src/share/native/sun/java2d/loops/IntArgb.h
    patching file openjdk/jdk/src/share/native/sun/java2d/loops/IntArgbBm.h
    patching file openjdk/jdk/src/share/native/sun/java2d/loops/IntArgbPre.h
    patching file openjdk/jdk/src/share/native/sun/java2d/loops/IntBgr.h
    patching file openjdk/jdk/src/share/native/sun/java2d/loops/IntRgb.h
    patching file openjdk/jdk/src/share/native/sun/java2d/loops/IntRgbx.h
    patching file openjdk/jdk/src/share/native/sun/java2d/loops/LoopMacros.h
    Hunk #1 succeeded at 1683 (offset 73 lines).
    Hunk #2 succeeded at 1870 (offset 73 lines).
    patching file openjdk/jdk/src/share/native/sun/java2d/loops/ThreeByteBgr.h
    patching file openjdk/jdk/src/share/native/sun/java2d/loops/Ushort4444Argb.h
    patching file openjdk/jdk/src/share/native/sun/java2d/loops/Ushort555Rgb.h
    patching file openjdk/jdk/src/share/native/sun/java2d/loops/Ushort555Rgbx.h
    patching file openjdk/jdk/src/share/native/sun/java2d/loops/Ushort565Rgb.h
    patching file openjdk/jdk/src/share/native/sun/java2d/loops/UshortGray.h
    patching file openjdk/jdk/src/solaris/native/sun/java2d/loops/vis_FourByteAbgr.c
    patching file openjdk/jdk/src/solaris/native/sun/java2d/loops/vis_FourByteAbgrPre.c
    patching file openjdk/jdk/src/solaris/native/sun/java2d/loops/vis_IntArgb.c
    patching file openjdk/jdk/src/solaris/native/sun/java2d/loops/vis_IntArgbPre.c
    patching file openjdk/jdk/test/java/awt/Graphics2D/DrawString/AlphaSurfaceText.java
    Checking patches/openjdk/6842838-64-bit_failure_in_handling_invalid_manifest.patch
    Applying patches/openjdk/6842838-64-bit_failure_in_handling_invalid_manifest.patch
    patching file openjdk/jdk/src/share/bin/parse_manifest.c
    Hunk #1 succeeded at 77 (offset 18 lines).
    patching file openjdk/jdk/test/tools/launcher/6842838/CreateBadJar.java
    patching file openjdk/jdk/test/tools/launcher/6842838/Test6842838.sh
    Checking patches/openjdk/6882768-test_for_6842838_is_broken.patch
    Applying patches/openjdk/6882768-test_for_6842838_is_broken.patch
    patching file openjdk/jdk/test/tools/launcher/6842838/Test6842838.sh
    Checking patches/pr639-broken_shark_build.patch
    Applying patches/pr639-broken_shark_build.patch
    patching file openjdk/hotspot/src/share/vm/ci/ciTypeFlow.cpp
    patching file openjdk/hotspot/make/linux/makefiles/vm.make
    Hunk #1 succeeded at 143 (offset 4 lines).
    patching file openjdk/hotspot/make/linux/makefiles/launcher.make
    Checking patches/powerpc-stacksize.patch
    Applying patches/powerpc-stacksize.patch
    patching file openjdk/hotspot/src/os_cpu/linux_zero/vm/globals_linux_zero.hpp
    patching file openjdk/corba/make/common/shared/Defs-java.gmk
    patching file openjdk/jdk/make/common/shared/Defs-java.gmk
    Checking patches/jtreg-remove-test-6987555.patch
    Applying patches/jtreg-remove-test-6987555.patch
    patching file openjdk/hotspot/test/compiler/6987555/Test6987555.java
    Checking patches/jtreg-remove-test-6991596.patch
    Applying patches/jtreg-remove-test-6991596.patch
    patching file openjdk/hotspot/test/compiler/6991596/Test6991596.java
    Checking patches/openjdk/7036220-shark_llvm_29_headers.patch
    Applying patches/openjdk/7036220-shark_llvm_29_headers.patch
    patching file openjdk/hotspot/src/share/vm/shark/llvmHeaders.hpp
    Checking patches/openjdk/7029152-String_intrinsics_miss_optimization.patch
    Applying patches/openjdk/7029152-String_intrinsics_miss_optimization.patch
    patching file openjdk/hotspot/src/share/vm/opto/loopTransform.cpp
    Hunk #1 succeeded at 388 (offset -8 lines).
    Hunk #2 succeeded at 420 (offset -8 lines).
    Hunk #3 succeeded at 458 (offset -8 lines).
    Hunk #4 succeeded at 495 (offset -8 lines).
    Hunk #5 succeeded at 521 (offset -8 lines).
    patching file openjdk/hotspot/src/share/vm/opto/memnode.cpp
    Hunk #1 succeeded at 2614 (offset -3 lines).
    patching file openjdk/hotspot/src/share/vm/opto/memnode.hpp
    patching file openjdk/hotspot/test/compiler/7029152/Test.java
    Checking patches/openjdk/6711682-JCheckBox_in_JTable_does_not_respond_to_click.patch
    Applying patches/openjdk/6711682-JCheckBox_in_JTable_does_not_respond_to_click.patch
    patching file openjdk/jdk/src/share/classes/javax/swing/plaf/basic/BasicButtonListener.java
    patching file openjdk/jdk/test/javax/swing/AbstractButton/6711682/bug6711682.java
    Checking patches/jtreg-7020373-add-ignore-tag.patch
    Applying patches/jtreg-7020373-add-ignore-tag.patch
    patching file openjdk/hotspot/test/runtime/7020373/Test7020373.sh
    Checking patches/rhino.patch
    Applying patches/rhino.patch
    patching file openjdk/jdk/make/com/sun/script/Makefile
    patching file openjdk/jdk/make/com/sun/Makefile
    patching file openjdk/jdk/make/common/Release.gmk
    patching file openjdk/jdk/src/share/classes/com/sun/script/javascript/RhinoTopLevel.java
    patching file openjdk/jdk/src/share/classes/com/sun/script/javascript/RhinoScriptEngineFactory.java
    patching file openjdk/jdk/src/share/classes/com/sun/script/javascript/ExternalScriptable.java
    patching file openjdk/jdk/src/share/classes/com/sun/script/javascript/RhinoScriptEngine.java
    patching file openjdk/jdk/src/share/classes/com/sun/script/javascript/RhinoClassShutter.java
    patching file openjdk/jdk/src/share/classes/com/sun/script/javascript/JavaAdapter.java
    patching file openjdk/jdk/src/share/classes/com/sun/script/javascript/JSAdapter.java
    patching file openjdk/jdk/src/share/classes/com/sun/script/javascript/RhinoWrapFactory.java
    patching file openjdk/jdk/src/share/classes/com/sun/script/javascript/RhinoCompiledScript.java
    Checking patches/openjdk/6307603-xrender-01.patch
    Applying patches/openjdk/6307603-xrender-01.patch
    patching file openjdk/jdk/make/sun/awt/mapfile-mawt-vers
    patching file openjdk/jdk/make/sun/awt/mapfile-vers-linux
    Hunk #1 succeeded at 428 (offset 2 lines).
    patching file openjdk/jdk/make/sun/headless/mapfile-vers
    patching file openjdk/jdk/make/sun/jawt/Makefile
    patching file openjdk/jdk/make/sun/xawt/FILES_c_unix.gmk
    patching file openjdk/jdk/make/sun/xawt/Makefile
    patching file openjdk/jdk/make/sun/xawt/mapfile-vers
    patching file openjdk/jdk/src/share/classes/sun/font/GlyphDisposedListener.java
    patching file openjdk/jdk/src/share/classes/sun/font/StrikeCache.java
    patching file openjdk/jdk/src/share/classes/sun/java2d/pipe/BufferedPaints.java
    patching file openjdk/jdk/src/share/classes/sun/java2d/pipe/RenderBuffer.java
    patching file openjdk/jdk/src/share/classes/sun/java2d/pisces/META-INF/services/sun.java2d.pipe.RenderingEngine
    patching file openjdk/jdk/src/share/native/sun/font/AccelGlyphCache.c
    patching file openjdk/jdk/src/share/native/sun/font/fontscalerdefs.h
    patching file openjdk/jdk/src/share/native/sun/font/freetypeScaler.c
    patching file openjdk/jdk/src/share/native/sun/font/sunFont.c
    patching file openjdk/jdk/src/share/native/sun/java2d/opengl/OGLTextRenderer.c
    patching file openjdk/jdk/src/solaris/classes/sun/awt/X11GraphicsDevice.java
    patching file openjdk/jdk/src/solaris/classes/sun/awt/X11GraphicsEnvironment.java
    patching file openjdk/jdk/src/solaris/classes/sun/font/XRGlyphCacheEntry.java
    patching file openjdk/jdk/src/solaris/classes/sun/font/XRGlyphCache.java
    patching file openjdk/jdk/src/solaris/classes/sun/font/XRTextRenderer.java
    patching file openjdk/jdk/src/solaris/classes/sun/java2d/jules/IdleTileCache.java
    patching file openjdk/jdk/src/solaris/classes/sun/java2d/jules/JulesAATileGenerator.java
    patching file openjdk/jdk/src/solaris/classes/sun/java2d/jules/JulesPathBuf.java
    patching file openjdk/jdk/src/solaris/classes/sun/java2d/jules/JulesRenderingEngine.java
    patching file openjdk/jdk/src/solaris/classes/sun/java2d/jules/JulesShapePipe.java
    patching file openjdk/jdk/src/solaris/classes/sun/java2d/jules/JulesTile.java
    patching file openjdk/jdk/src/solaris/classes/sun/java2d/jules/TileWorker.java
    patching file openjdk/jdk/src/solaris/classes/sun/java2d/jules/TrapezoidList.java
    patching file openjdk/jdk/src/solaris/classes/sun/java2d/SurfaceManagerFactory.java
    patching file openjdk/jdk/src/solaris/classes/sun/java2d/x11/X11SurfaceData.java
    Hunk #2 succeeded at 65 (offset 1 line).
    Hunk #3 succeeded at 75 (offset 1 line).
    Hunk #4 succeeded at 199 (offset 1 line).
    Hunk #5 succeeded at 233 (offset 1 line).
    Hunk #6 succeeded at 420 (offset 15 lines).
    Hunk #7 succeeded at 583 (offset 15 lines).
    Hunk #8 succeeded at 596 (offset 15 lines).
    patching file openjdk/jdk/src/solaris/classes/sun/java2d/x11/XSurfaceData.java
    patching file openjdk/jdk/src/solaris/classes/sun/java2d/xr/DirtyRegion.java
    patching file openjdk/jdk/src/solaris/classes/sun/java2d/xr/GrowableByteArray.java
    patching file openjdk/jdk/src/solaris/classes/sun/java2d/xr/GrowableEltArray.java
    patching file openjdk/jdk/src/solaris/classes/sun/java2d/xr/GrowableIntArray.java
    patching file openjdk/jdk/src/solaris/classes/sun/java2d/xr/GrowablePointArray.java
    patching file openjdk/jdk/src/solaris/classes/sun/java2d/xr/GrowableRectArray.java
    patching file openjdk/jdk/src/solaris/classes/sun/java2d/xr/MaskTile.java
    patching file openjdk/jdk/src/solaris/classes/sun/java2d/xr/MaskTileManager.java
    patching file openjdk/jdk/src/solaris/classes/sun/java2d/xr/MutableInteger.java
    patching file openjdk/jdk/src/solaris/classes/sun/java2d/xr/XcbRequestCounter.java
    patching file openjdk/jdk/src/solaris/classes/sun/java2d/xr/XIDGenerator.java
    patching file openjdk/jdk/src/solaris/classes/sun/java2d/xr/XRBackend.java
    patching file openjdk/jdk/src/solaris/classes/sun/java2d/xr/XRBackendNative.java
    patching file openjdk/jdk/src/solaris/classes/sun/java2d/xr/XRColor.java
    patching file openjdk/jdk/src/solaris/classes/sun/java2d/xr/XRCompositeManager.java
    patching file openjdk/jdk/src/solaris/classes/sun/java2d/xr/XRDrawImage.java
    patching file openjdk/jdk/src/solaris/classes/sun/java2d/xr/XRGraphicsConfig.java
    patching file openjdk/jdk/src/solaris/classes/sun/java2d/xr/XRMaskBlit.java
    patching file openjdk/jdk/src/solaris/classes/sun/java2d/xr/XRMaskFill.java
    patching file openjdk/jdk/src/solaris/classes/sun/java2d/xr/XRMaskImage.java
    patching file openjdk/jdk/src/solaris/classes/sun/java2d/xr/XRPaints.java
    patching file openjdk/jdk/src/solaris/classes/sun/java2d/xr/XRPMBlitLoops.java
    patching file openjdk/jdk/src/solaris/classes/sun/java2d/xr/XRRenderer.java
    patching file openjdk/jdk/src/solaris/classes/sun/java2d/xr/XRSurfaceData.java
    patching file openjdk/jdk/src/solaris/classes/sun/java2d/xr/XRSurfaceDataProxy.java
    patching file openjdk/jdk/src/solaris/classes/sun/java2d/xr/XRUtils.java
    patching file openjdk/jdk/src/solaris/classes/sun/java2d/xr/XRVolatileSurfaceManager.java
    patching file openjdk/jdk/src/solaris/native/sun/java2d/x11/X11SurfaceData.c
    Hunk #6 succeeded at 249 (offset 17 lines).
    Hunk #7 succeeded at 321 (offset 17 lines).
    Hunk #8 succeeded at 332 (offset 17 lines).
    Hunk #9 succeeded at 403 (offset 17 lines).
    Hunk #10 succeeded at 417 (offset 17 lines).
    Hunk #11 succeeded at 428 (offset 17 lines).
    Hunk #12 succeeded at 457 (offset 17 lines).
    Hunk #13 succeeded at 477 (offset 17 lines).
    Hunk #14 succeeded at 756 (offset 17 lines).
    Hunk #15 succeeded at 1605 (offset 17 lines).
    Hunk #16 succeeded at 1635 (offset 17 lines).
    Hunk #17 succeeded at 1650 (offset 17 lines).
    Hunk #18 succeeded at 1725 (offset 17 lines).
    patching file openjdk/jdk/src/solaris/native/sun/java2d/x11/X11SurfaceData.h
    patching file openjdk/jdk/src/solaris/native/sun/java2d/x11/XRBackendNative.c
    patching file openjdk/jdk/src/solaris/native/sun/java2d/x11/XRSurfaceData.c
    Checking patches/openjdk/6961633-xrender-02.patch
    Applying patches/openjdk/6961633-xrender-02.patch
    patching file openjdk/jdk/make/sun/pisces/Makefile
    Hunk #1 succeeded at 53 (offset 1 line).
    patching file openjdk/jdk/src/share/classes/sun/java2d/pisces/META-INF/services/sun.java2d.pipe.RenderingEngine
    patching file openjdk/jdk/src/solaris/classes/sun/java2d/pisces/META-INF/services/sun.java2d.pipe.RenderingEngine
    Checking patches/openjdk/7018387-xrender_gc_leak.patch
    Applying patches/openjdk/7018387-xrender_gc_leak.patch
    patching file openjdk/jdk/src/solaris/classes/sun/java2d/xr/XRSurfaceData.java
    Checking patches/systemtap.patch
    Applying patches/systemtap.patch
    patching file openjdk/hotspot/make/linux/makefiles/dtrace.make
    patching file openjdk/hotspot/src/share/vm/prims/jni.cpp
    Hunk #1 succeeded at 1817 (offset 64 lines).
    Hunk #2 succeeded at 1991 (offset 64 lines).
    patching file openjdk/hotspot/src/share/vm/runtime/arguments.cpp
    Hunk #1 succeeded at 2582 (offset 122 lines).
    patching file openjdk/hotspot/src/share/vm/utilities/dtrace.hpp
    Checking patches/systemtap-gcc-4.5.patch
    Applying patches/systemtap-gcc-4.5.patch
    patching file openjdk/hotspot/src/share/vm/prims/jni.cpp
    Hunk #1 succeeded at 2786 (offset 63 lines).
    Checking patches/systemtap-alloc-size-workaround.patch
    Applying patches/systemtap-alloc-size-workaround.patch
    patching file openjdk/hotspot/src/share/vm/runtime/sharedRuntime.cpp
    Hunk #1 succeeded at 882 (offset 171 lines).
    Checking patches/nss-not-enabled-config.patch
    Applying patches/nss-not-enabled-config.patch
    patching file openjdk/jdk/src/share/lib/security/java.security
    icedtea_version="1.11pre+r802bc279de76+" ; \
    if test "xno" = "xyes" || \
    test "xno" = "xyes"; then \
    echo "JDK_DERIVATIVE_NAME=${icedtea_version}" \
    openjdk/jdk/make/common/shared/Defs.gmk ; \
    echo "PRODUCT_NAME=IcedTea6" \
    openjdk/jdk/make/common/shared/Defs.gmk ; \
    else \
    echo "JDK_DERIVATIVE_NAME=IcedTea6 ${icedtea_version}" \
    openjdk/jdk/make/common/shared/Defs.gmk ; \
    fi ;
    echo "DISTRO_NAME=Fedora" >>openjdk/jdk/make/common/shared/Defs.gmk ;
    + make patch-fsg
    + exit 1
    + make overlay
    cp -r /notnfs/nighttester/icedtea6-target-testing/overlays/openjdk/* openjdk/
    cp -r /notnfs/nighttester/icedtea6-target-testing/overlays/jpeg/openjdk/* openjdk/
    touch stamps/overlay.stamp
    + make hotspot-ports
    make: *** No rule to make target `hotspot-ports'. Stop.
    + exit 1
  • Hudson Admin at Jul 11, 2011 at 9:16 pm
    See <http://toadeater:8080/job/IcedTea6TargetTesting/729/>

    ------------------------------------------
    [...truncated 45203 lines...]
    Hunk #4 succeeded at 647 (offset 3 lines).
    Hunk #5 succeeded at 657 (offset 3 lines).
    patching file openjdk/jdk/test/java/awt/Color/OpacityChange/OpacityChange.java
    Checking patches/openjdk/6785424-SecurityException_locating_physical_fonts.patch
    Applying patches/openjdk/6785424-SecurityException_locating_physical_fonts.patch
    patching file openjdk/jdk/src/share/classes/sun/font/FontManager.java
    Hunk #1 succeeded at 1583 (offset -18 lines).
    patching file openjdk/jdk/test/java/awt/FontClass/FontAccess.java
    Checking patches/openjdk/7047069-Array_can_dynamically_change_size.patch
    Applying patches/openjdk/7047069-Array_can_dynamically_change_size.patch
    patching file openjdk/hotspot/src/share/vm/opto/library_call.cpp
    Hunk #1 succeeded at 5136 (offset -89 lines).
    patching file openjdk/hotspot/test/compiler/7047069/Test7047069.java
    Checking patches/openjdk/6796786-invalid_FP_identity_transform.patch
    Applying patches/openjdk/6796786-invalid_FP_identity_transform.patch
    patching file openjdk/hotspot/src/share/vm/opto/subnode.cpp
    Hunk #1 succeeded at 1224 (offset 1 line).
    patching file openjdk/hotspot/src/share/vm/opto/subnode.hpp
    patching file openjdk/hotspot/test/compiler/6796786/Test6796786.java
    Checking patches/openjdk/7042070-Typo_in_Test6796786.patch
    Applying patches/openjdk/7042070-Typo_in_Test6796786.patch
    patching file openjdk/hotspot/test/compiler/6796786/Test6796786.java
    Checking patches/openjdk/6679308-Poor_text_rendering_on_translucent_image.patch
    Applying patches/openjdk/6679308-Poor_text_rendering_on_translucent_image.patch
    patching file openjdk/jdk/src/share/native/sun/java2d/loops/AlphaMacros.h
    patching file openjdk/jdk/src/share/native/sun/java2d/loops/ByteGray.h
    patching file openjdk/jdk/src/share/native/sun/java2d/loops/FourByteAbgr.h
    patching file openjdk/jdk/src/share/native/sun/java2d/loops/FourByteAbgrPre.h
    patching file openjdk/jdk/src/share/native/sun/java2d/loops/Index12Gray.h
    patching file openjdk/jdk/src/share/native/sun/java2d/loops/Index8Gray.h
    patching file openjdk/jdk/src/share/native/sun/java2d/loops/IntArgb.h
    patching file openjdk/jdk/src/share/native/sun/java2d/loops/IntArgbBm.h
    patching file openjdk/jdk/src/share/native/sun/java2d/loops/IntArgbPre.h
    patching file openjdk/jdk/src/share/native/sun/java2d/loops/IntBgr.h
    patching file openjdk/jdk/src/share/native/sun/java2d/loops/IntRgb.h
    patching file openjdk/jdk/src/share/native/sun/java2d/loops/IntRgbx.h
    patching file openjdk/jdk/src/share/native/sun/java2d/loops/LoopMacros.h
    Hunk #1 succeeded at 1683 (offset 73 lines).
    Hunk #2 succeeded at 1870 (offset 73 lines).
    patching file openjdk/jdk/src/share/native/sun/java2d/loops/ThreeByteBgr.h
    patching file openjdk/jdk/src/share/native/sun/java2d/loops/Ushort4444Argb.h
    patching file openjdk/jdk/src/share/native/sun/java2d/loops/Ushort555Rgb.h
    patching file openjdk/jdk/src/share/native/sun/java2d/loops/Ushort555Rgbx.h
    patching file openjdk/jdk/src/share/native/sun/java2d/loops/Ushort565Rgb.h
    patching file openjdk/jdk/src/share/native/sun/java2d/loops/UshortGray.h
    patching file openjdk/jdk/src/solaris/native/sun/java2d/loops/vis_FourByteAbgr.c
    patching file openjdk/jdk/src/solaris/native/sun/java2d/loops/vis_FourByteAbgrPre.c
    patching file openjdk/jdk/src/solaris/native/sun/java2d/loops/vis_IntArgb.c
    patching file openjdk/jdk/src/solaris/native/sun/java2d/loops/vis_IntArgbPre.c
    patching file openjdk/jdk/test/java/awt/Graphics2D/DrawString/AlphaSurfaceText.java
    Checking patches/openjdk/6842838-64-bit_failure_in_handling_invalid_manifest.patch
    Applying patches/openjdk/6842838-64-bit_failure_in_handling_invalid_manifest.patch
    patching file openjdk/jdk/src/share/bin/parse_manifest.c
    Hunk #1 succeeded at 77 (offset 18 lines).
    patching file openjdk/jdk/test/tools/launcher/6842838/CreateBadJar.java
    patching file openjdk/jdk/test/tools/launcher/6842838/Test6842838.sh
    Checking patches/openjdk/6882768-test_for_6842838_is_broken.patch
    Applying patches/openjdk/6882768-test_for_6842838_is_broken.patch
    patching file openjdk/jdk/test/tools/launcher/6842838/Test6842838.sh
    Checking patches/pr639-broken_shark_build.patch
    Applying patches/pr639-broken_shark_build.patch
    patching file openjdk/hotspot/src/share/vm/ci/ciTypeFlow.cpp
    patching file openjdk/hotspot/make/linux/makefiles/vm.make
    Hunk #1 succeeded at 143 (offset 4 lines).
    patching file openjdk/hotspot/make/linux/makefiles/launcher.make
    Checking patches/powerpc-stacksize.patch
    Applying patches/powerpc-stacksize.patch
    patching file openjdk/hotspot/src/os_cpu/linux_zero/vm/globals_linux_zero.hpp
    patching file openjdk/corba/make/common/shared/Defs-java.gmk
    patching file openjdk/jdk/make/common/shared/Defs-java.gmk
    Checking patches/jtreg-remove-test-6987555.patch
    Applying patches/jtreg-remove-test-6987555.patch
    patching file openjdk/hotspot/test/compiler/6987555/Test6987555.java
    Checking patches/jtreg-remove-test-6991596.patch
    Applying patches/jtreg-remove-test-6991596.patch
    patching file openjdk/hotspot/test/compiler/6991596/Test6991596.java
    Checking patches/openjdk/7036220-shark_llvm_29_headers.patch
    Applying patches/openjdk/7036220-shark_llvm_29_headers.patch
    patching file openjdk/hotspot/src/share/vm/shark/llvmHeaders.hpp
    Checking patches/openjdk/7029152-String_intrinsics_miss_optimization.patch
    Applying patches/openjdk/7029152-String_intrinsics_miss_optimization.patch
    patching file openjdk/hotspot/src/share/vm/opto/loopTransform.cpp
    Hunk #1 succeeded at 388 (offset -8 lines).
    Hunk #2 succeeded at 420 (offset -8 lines).
    Hunk #3 succeeded at 458 (offset -8 lines).
    Hunk #4 succeeded at 495 (offset -8 lines).
    Hunk #5 succeeded at 521 (offset -8 lines).
    patching file openjdk/hotspot/src/share/vm/opto/memnode.cpp
    Hunk #1 succeeded at 2614 (offset -3 lines).
    patching file openjdk/hotspot/src/share/vm/opto/memnode.hpp
    patching file openjdk/hotspot/test/compiler/7029152/Test.java
    Checking patches/openjdk/6711682-JCheckBox_in_JTable_does_not_respond_to_click.patch
    Applying patches/openjdk/6711682-JCheckBox_in_JTable_does_not_respond_to_click.patch
    patching file openjdk/jdk/src/share/classes/javax/swing/plaf/basic/BasicButtonListener.java
    patching file openjdk/jdk/test/javax/swing/AbstractButton/6711682/bug6711682.java
    Checking patches/jtreg-7020373-add-ignore-tag.patch
    Applying patches/jtreg-7020373-add-ignore-tag.patch
    patching file openjdk/hotspot/test/runtime/7020373/Test7020373.sh
    Checking patches/rhino.patch
    Applying patches/rhino.patch
    patching file openjdk/jdk/make/com/sun/script/Makefile
    patching file openjdk/jdk/make/com/sun/Makefile
    patching file openjdk/jdk/make/common/Release.gmk
    patching file openjdk/jdk/src/share/classes/com/sun/script/javascript/RhinoTopLevel.java
    patching file openjdk/jdk/src/share/classes/com/sun/script/javascript/RhinoScriptEngineFactory.java
    patching file openjdk/jdk/src/share/classes/com/sun/script/javascript/ExternalScriptable.java
    patching file openjdk/jdk/src/share/classes/com/sun/script/javascript/RhinoScriptEngine.java
    patching file openjdk/jdk/src/share/classes/com/sun/script/javascript/RhinoClassShutter.java
    patching file openjdk/jdk/src/share/classes/com/sun/script/javascript/JavaAdapter.java
    patching file openjdk/jdk/src/share/classes/com/sun/script/javascript/JSAdapter.java
    patching file openjdk/jdk/src/share/classes/com/sun/script/javascript/RhinoWrapFactory.java
    patching file openjdk/jdk/src/share/classes/com/sun/script/javascript/RhinoCompiledScript.java
    Checking patches/openjdk/6307603-xrender-01.patch
    Applying patches/openjdk/6307603-xrender-01.patch
    patching file openjdk/jdk/make/sun/awt/mapfile-mawt-vers
    patching file openjdk/jdk/make/sun/awt/mapfile-vers-linux
    Hunk #1 succeeded at 428 (offset 2 lines).
    patching file openjdk/jdk/make/sun/headless/mapfile-vers
    patching file openjdk/jdk/make/sun/jawt/Makefile
    patching file openjdk/jdk/make/sun/xawt/FILES_c_unix.gmk
    patching file openjdk/jdk/make/sun/xawt/Makefile
    patching file openjdk/jdk/make/sun/xawt/mapfile-vers
    patching file openjdk/jdk/src/share/classes/sun/font/GlyphDisposedListener.java
    patching file openjdk/jdk/src/share/classes/sun/font/StrikeCache.java
    patching file openjdk/jdk/src/share/classes/sun/java2d/pipe/BufferedPaints.java
    patching file openjdk/jdk/src/share/classes/sun/java2d/pipe/RenderBuffer.java
    patching file openjdk/jdk/src/share/classes/sun/java2d/pisces/META-INF/services/sun.java2d.pipe.RenderingEngine
    patching file openjdk/jdk/src/share/native/sun/font/AccelGlyphCache.c
    patching file openjdk/jdk/src/share/native/sun/font/fontscalerdefs.h
    patching file openjdk/jdk/src/share/native/sun/font/freetypeScaler.c
    patching file openjdk/jdk/src/share/native/sun/font/sunFont.c
    patching file openjdk/jdk/src/share/native/sun/java2d/opengl/OGLTextRenderer.c
    patching file openjdk/jdk/src/solaris/classes/sun/awt/X11GraphicsDevice.java
    patching file openjdk/jdk/src/solaris/classes/sun/awt/X11GraphicsEnvironment.java
    patching file openjdk/jdk/src/solaris/classes/sun/font/XRGlyphCacheEntry.java
    patching file openjdk/jdk/src/solaris/classes/sun/font/XRGlyphCache.java
    patching file openjdk/jdk/src/solaris/classes/sun/font/XRTextRenderer.java
    patching file openjdk/jdk/src/solaris/classes/sun/java2d/jules/IdleTileCache.java
    patching file openjdk/jdk/src/solaris/classes/sun/java2d/jules/JulesAATileGenerator.java
    patching file openjdk/jdk/src/solaris/classes/sun/java2d/jules/JulesPathBuf.java
    patching file openjdk/jdk/src/solaris/classes/sun/java2d/jules/JulesRenderingEngine.java
    patching file openjdk/jdk/src/solaris/classes/sun/java2d/jules/JulesShapePipe.java
    patching file openjdk/jdk/src/solaris/classes/sun/java2d/jules/JulesTile.java
    patching file openjdk/jdk/src/solaris/classes/sun/java2d/jules/TileWorker.java
    patching file openjdk/jdk/src/solaris/classes/sun/java2d/jules/TrapezoidList.java
    patching file openjdk/jdk/src/solaris/classes/sun/java2d/SurfaceManagerFactory.java
    patching file openjdk/jdk/src/solaris/classes/sun/java2d/x11/X11SurfaceData.java
    Hunk #2 succeeded at 65 (offset 1 line).
    Hunk #3 succeeded at 75 (offset 1 line).
    Hunk #4 succeeded at 199 (offset 1 line).
    Hunk #5 succeeded at 233 (offset 1 line).
    Hunk #6 succeeded at 420 (offset 15 lines).
    Hunk #7 succeeded at 583 (offset 15 lines).
    Hunk #8 succeeded at 596 (offset 15 lines).
    patching file openjdk/jdk/src/solaris/classes/sun/java2d/x11/XSurfaceData.java
    patching file openjdk/jdk/src/solaris/classes/sun/java2d/xr/DirtyRegion.java
    patching file openjdk/jdk/src/solaris/classes/sun/java2d/xr/GrowableByteArray.java
    patching file openjdk/jdk/src/solaris/classes/sun/java2d/xr/GrowableEltArray.java
    patching file openjdk/jdk/src/solaris/classes/sun/java2d/xr/GrowableIntArray.java
    patching file openjdk/jdk/src/solaris/classes/sun/java2d/xr/GrowablePointArray.java
    patching file openjdk/jdk/src/solaris/classes/sun/java2d/xr/GrowableRectArray.java
    patching file openjdk/jdk/src/solaris/classes/sun/java2d/xr/MaskTile.java
    patching file openjdk/jdk/src/solaris/classes/sun/java2d/xr/MaskTileManager.java
    patching file openjdk/jdk/src/solaris/classes/sun/java2d/xr/MutableInteger.java
    patching file openjdk/jdk/src/solaris/classes/sun/java2d/xr/XcbRequestCounter.java
    patching file openjdk/jdk/src/solaris/classes/sun/java2d/xr/XIDGenerator.java
    patching file openjdk/jdk/src/solaris/classes/sun/java2d/xr/XRBackend.java
    patching file openjdk/jdk/src/solaris/classes/sun/java2d/xr/XRBackendNative.java
    patching file openjdk/jdk/src/solaris/classes/sun/java2d/xr/XRColor.java
    patching file openjdk/jdk/src/solaris/classes/sun/java2d/xr/XRCompositeManager.java
    patching file openjdk/jdk/src/solaris/classes/sun/java2d/xr/XRDrawImage.java
    patching file openjdk/jdk/src/solaris/classes/sun/java2d/xr/XRGraphicsConfig.java
    patching file openjdk/jdk/src/solaris/classes/sun/java2d/xr/XRMaskBlit.java
    patching file openjdk/jdk/src/solaris/classes/sun/java2d/xr/XRMaskFill.java
    patching file openjdk/jdk/src/solaris/classes/sun/java2d/xr/XRMaskImage.java
    patching file openjdk/jdk/src/solaris/classes/sun/java2d/xr/XRPaints.java
    patching file openjdk/jdk/src/solaris/classes/sun/java2d/xr/XRPMBlitLoops.java
    patching file openjdk/jdk/src/solaris/classes/sun/java2d/xr/XRRenderer.java
    patching file openjdk/jdk/src/solaris/classes/sun/java2d/xr/XRSurfaceData.java
    patching file openjdk/jdk/src/solaris/classes/sun/java2d/xr/XRSurfaceDataProxy.java
    patching file openjdk/jdk/src/solaris/classes/sun/java2d/xr/XRUtils.java
    patching file openjdk/jdk/src/solaris/classes/sun/java2d/xr/XRVolatileSurfaceManager.java
    patching file openjdk/jdk/src/solaris/native/sun/java2d/x11/X11SurfaceData.c
    Hunk #6 succeeded at 249 (offset 17 lines).
    Hunk #7 succeeded at 321 (offset 17 lines).
    Hunk #8 succeeded at 332 (offset 17 lines).
    Hunk #9 succeeded at 403 (offset 17 lines).
    Hunk #10 succeeded at 417 (offset 17 lines).
    Hunk #11 succeeded at 428 (offset 17 lines).
    Hunk #12 succeeded at 457 (offset 17 lines).
    Hunk #13 succeeded at 477 (offset 17 lines).
    Hunk #14 succeeded at 756 (offset 17 lines).
    Hunk #15 succeeded at 1605 (offset 17 lines).
    Hunk #16 succeeded at 1635 (offset 17 lines).
    Hunk #17 succeeded at 1650 (offset 17 lines).
    Hunk #18 succeeded at 1725 (offset 17 lines).
    patching file openjdk/jdk/src/solaris/native/sun/java2d/x11/X11SurfaceData.h
    patching file openjdk/jdk/src/solaris/native/sun/java2d/x11/XRBackendNative.c
    patching file openjdk/jdk/src/solaris/native/sun/java2d/x11/XRSurfaceData.c
    Checking patches/openjdk/6961633-xrender-02.patch
    Applying patches/openjdk/6961633-xrender-02.patch
    patching file openjdk/jdk/make/sun/pisces/Makefile
    Hunk #1 succeeded at 53 (offset 1 line).
    patching file openjdk/jdk/src/share/classes/sun/java2d/pisces/META-INF/services/sun.java2d.pipe.RenderingEngine
    patching file openjdk/jdk/src/solaris/classes/sun/java2d/pisces/META-INF/services/sun.java2d.pipe.RenderingEngine
    Checking patches/openjdk/7018387-xrender_gc_leak.patch
    Applying patches/openjdk/7018387-xrender_gc_leak.patch
    patching file openjdk/jdk/src/solaris/classes/sun/java2d/xr/XRSurfaceData.java
    Checking patches/systemtap.patch
    Applying patches/systemtap.patch
    patching file openjdk/hotspot/make/linux/makefiles/dtrace.make
    patching file openjdk/hotspot/src/share/vm/prims/jni.cpp
    Hunk #1 succeeded at 1817 (offset 64 lines).
    Hunk #2 succeeded at 1991 (offset 64 lines).
    patching file openjdk/hotspot/src/share/vm/runtime/arguments.cpp
    Hunk #1 succeeded at 2582 (offset 122 lines).
    patching file openjdk/hotspot/src/share/vm/utilities/dtrace.hpp
    Checking patches/systemtap-gcc-4.5.patch
    Applying patches/systemtap-gcc-4.5.patch
    patching file openjdk/hotspot/src/share/vm/prims/jni.cpp
    Hunk #1 succeeded at 2786 (offset 63 lines).
    Checking patches/systemtap-alloc-size-workaround.patch
    Applying patches/systemtap-alloc-size-workaround.patch
    patching file openjdk/hotspot/src/share/vm/runtime/sharedRuntime.cpp
    Hunk #1 succeeded at 882 (offset 171 lines).
    Checking patches/nss-not-enabled-config.patch
    Applying patches/nss-not-enabled-config.patch
    patching file openjdk/jdk/src/share/lib/security/java.security
    icedtea_version="1.11pre+r32fa8c401cee+" ; \
    if test "xno" = "xyes" || \
    test "xno" = "xyes"; then \
    echo "JDK_DERIVATIVE_NAME=${icedtea_version}" \
    openjdk/jdk/make/common/shared/Defs.gmk ; \
    echo "PRODUCT_NAME=IcedTea6" \
    openjdk/jdk/make/common/shared/Defs.gmk ; \
    else \
    echo "JDK_DERIVATIVE_NAME=IcedTea6 ${icedtea_version}" \
    openjdk/jdk/make/common/shared/Defs.gmk ; \
    fi ;
    echo "DISTRO_NAME=Fedora" >>openjdk/jdk/make/common/shared/Defs.gmk ;
    + make patch-fsg
    + exit 1
    + make overlay
    cp -r /notnfs/nighttester/icedtea6-target-testing/overlays/openjdk/* openjdk/
    cp -r /notnfs/nighttester/icedtea6-target-testing/overlays/jpeg/openjdk/* openjdk/
    touch stamps/overlay.stamp
    + make hotspot-ports
    make: *** No rule to make target `hotspot-ports'. Stop.
    + exit 1
  • Hudson Admin at Jul 12, 2011 at 4:00 am

Related Discussions

Discussion Navigation
viewthread | post
Discussion Overview
groupicedtea-test @
categoriesopenjdk
postedJul 7, '11 at 9:03p
activeJul 12, '11 at 4:00a
posts8
users1
websiteopenjdk.java.net

1 user in discussion

Hudson Admin: 8 posts

People

Translate

site design / logo © 2018 Grokbase