FAQ
See <http://toadeater:8080/job/IcedTea6TargetTesting/655/>

------------------------------------------
[...truncated 125201 lines...]
Generating beaninfo for javax.swing.JTree...
Generating beaninfo for javax.swing.JWindow...
Generating beaninfo for javax.swing.text.JTextComponent...
Deleting classes.list...
if [ -s /notnfs/nighttester/icedtea6-target-testing/openjdk.build/tmp/.classes.list ] ; then \
/notnfs/nighttester/icedtea6-target-testing/bootstrap/jdk1.6.0/bin/java -Xmx896m -Xms128m -XX:PermSize2m -XX:MaxPermSize0m "-Xbootclasspath/p:/notnfs/nighttester/icedtea6-target-testing/openjdk.build/langtools/dist/bootstrap/lib/javac.jar" -jar /notnfs/nighttester/icedtea6-target-testing/openjdk.build/langtools/dist/bootstrap/lib/javac.jar -g -source 1.5 -target 5 -encoding ascii "-Xbootclasspath:/notnfs/nighttester/icedtea6-target-testing/openjdk.build/classes" -classpath "/notnfs/nighttester/icedtea6-target-testing/openjdk.build/classes:/notnfs/nighttester/icedtea6-target-testing/openjdk.build/tmp/1.2classes:." -d /notnfs/nighttester/icedtea6-target-testing/openjdk.build/tmp/1.2classes \
/notnfs/nighttester/icedtea6-target-testing/openjdk.build/tmp/1.2src/AbstractButtonBeanInfo.java /notnfs/nighttester/icedtea6-target-testing/openjdk.build/tmp/1.2src/BoxBeanInfo.java /notnfs/nighttester/icedtea6-target-testing/openjdk.build/tmp/1.2src/JComponentBeanInfo.java /notnfs/nighttester/icedtea6-target-testing/openjdk.build/tmp/1.2src/JAppletBeanInfo.java /notnfs/nighttester/icedtea6-target-testing/openjdk.build/tmp/1.2src/JButtonBeanInfo.java /notnfs/nighttester/icedtea6-target-testing/openjdk.build/tmp/1.2src/JCheckBoxBeanInfo.java /notnfs/nighttester/icedtea6-target-testing/openjdk.build/tmp/1.2src/JCheckBoxMenuItemBeanInfo.java /notnfs/nighttester/icedtea6-target-testing/openjdk.build/tmp/1.2src/JComboBoxBeanInfo.java /notnfs/nighttester/icedtea6-target-testing/openjdk.build/tmp/1.2src/JColorChooserBeanInfo.java /notnfs/nighttester/icedtea6-target-testing/openjdk.build/tmp/1.2src/JDesktopPaneBeanInfo.java /notnfs/nighttester/icedtea6-target-testing/openjdk.build/tmp/1.2src/JDialogBeanInfo.java /notnfs/nighttester/icedtea6-target-testing/openjdk.build/tmp/1.2src/JEditorPaneBeanInfo.java /notnfs/nighttester/icedtea6-target-testing/openjdk.build/tmp/1.2src/JFileChooserBeanInfo.java /notnfs/nighttester/icedtea6-target-testing/openjdk.build/tmp/1.2src/JFrameBeanInfo.java /notnfs/nighttester/icedtea6-target-testing/openjdk.build/tmp/1.2src/JFormattedTextFieldBeanInfo.java /notnfs/nighttester/icedtea6-target-testing/openjdk.build/tmp/1.2src/JInternalFrameBeanInfo.java /notnfs/nighttester/icedtea6-target-testing/openjdk.build/tmp/1.2src/JLabelBeanInfo.java /notnfs/nighttester/icedtea6-target-testing/openjdk.build/tmp/1.2src/JLayeredPaneBeanInfo.java /notnfs/nighttester/icedtea6-target-testing/openjdk.build/tmp/1.2src/JListBeanInfo.java /notnfs/nighttester/icedtea6-target-testing/openjdk.build/tmp/1.2src/JMenuBeanInfo.java /notnfs/nighttester/icedtea6-target-testing/openjdk.build/tmp/1.2src/JMenuBarBeanInfo.java /notnfs/nighttester/icedtea6-target-testing/openjdk.build/tmp/1.2src/JMenuItemBeanInfo.java /notnfs/nighttester/icedtea6-target-testing/openjdk.build/tmp/1.2src/JOptionPaneBeanInfo.java /notnfs/nighttester/icedtea6-target-testing/openjdk.build/tmp/1.2src/JPanelBeanInfo.java /notnfs/nighttester/icedtea6-target-testing/openjdk.build/tmp/1.2src/JPasswordFieldBeanInfo.java /notnfs/nighttester/icedtea6-target-testing/openjdk.build/tmp/1.2src/JPopupMenuBeanInfo.java /notnfs/nighttester/icedtea6-target-testing/openjdk.build/tmp/1.2src/JProgressBarBeanInfo.java /notnfs/nighttester/icedtea6-target-testing/openjdk.build/tmp/1.2src/JRadioButtonBeanInfo.java /notnfs/nighttester/icedtea6-target-testing/openjdk.build/tmp/1.2src/JRadioButtonMenuItemBeanInfo.java /notnfs/nighttester/icedtea6-target-testing/openjdk.build/tmp/1.2src/JScrollBarBeanInfo.java /notnfs/nighttester/icedtea6-target-testing/openjdk.build/tmp/1.2src/JScrollPaneBeanInfo.java /notnfs/nighttester/icedtea6-target-testing/openjdk.build/tmp/1.2src/JSeparatorBeanInfo.java /notnfs/nighttester/icedtea6-target-testing/openjdk.build/tmp/1.2src/JSliderBeanInfo.java /notnfs/nighttester/icedtea6-target-testing/openjdk.build/tmp/1.2src/JSplitPaneBeanInfo.java /notnfs/nighttester/icedtea6-target-testing/openjdk.build/tmp/1.2src/JSpinnerBeanInfo.java /notnfs/nighttester/icedtea6-target-testing/openjdk.build/tmp/1.2src/JTabbedPaneBeanInfo.java /notnfs/nighttester/icedtea6-target-testing/openjdk.build/tmp/1.2src/JTableBeanInfo.java /notnfs/nighttester/icedtea6-target-testing/openjdk.build/tmp/1.2src/JTextAreaBeanInfo.java /notnfs/nighttester/icedtea6-target-testing/openjdk.build/tmp/1.2src/JTextFieldBeanInfo.java /notnfs/nighttester/icedtea6-target-testing/openjdk.build/tmp/1.2src/JTextPaneBeanInfo.java /notnfs/nighttester/icedtea6-target-testing/openjdk.build/tmp/1.2src/JToggleButtonBeanInfo.java /notnfs/nighttester/icedtea6-target-testing/openjdk.build/tmp/1.2src/JToolBarBeanInfo.java /notnfs/nighttester/icedtea6-target-testing/openjdk.build/tmp/1.2src/JTreeBeanInfo.java /notnfs/nighttester/icedtea6-target-testing/openjdk.build/tmp/1.2src/JWindowBeanInfo.java /notnfs/nighttester/icedtea6-target-testing/openjdk.build/tmp/1.2src/JTextComponentBeanInfo.java /notnfs/nighttester/icedtea6-target-testing/openjdk.build/tmp/1.2src/SwingBeanInfoBase.java /notnfs/nighttester/icedtea6-target-testing/openjdk.build/tmp/1.2src/BeanInfoUtils.java ; \
fi
Note: /notnfs/nighttester/icedtea6-target-testing/openjdk.build/tmp/1.2src/BeanInfoUtils.java uses unchecked or unsafe operations.
Note: Recompile with -Xlint:unchecked for details.
rm -f -r /notnfs/nighttester/icedtea6-target-testing/openjdk.build/tmp/1.2classes/javax/swing/beaninfo/images
/bin/mkdir -p /notnfs/nighttester/icedtea6-target-testing/openjdk.build/tmp/1.2classes/javax/swing/beaninfo/images
/bin/cp ../../../tools/swing-beans/beaninfo/images/*.gif /notnfs/nighttester/icedtea6-target-testing/openjdk.build/tmp/1.2classes/javax/swing/beaninfo/images
/notnfs/nighttester/icedtea6-target-testing/bootstrap/jdk1.6.0/bin/jar cf /notnfs/nighttester/icedtea6-target-testing/openjdk.build/tmp/tmp.jar \
-C /notnfs/nighttester/icedtea6-target-testing/openjdk.build/tmp/1.2classes javax \
-C /notnfs/nighttester/icedtea6-target-testing/openjdk.build/tmp/1.2classes sun \
-J-Xmx896m -J-Xms128m -J-XX:PermSize2m -J-XX:MaxPermSize0m
/bin/mv /notnfs/nighttester/icedtea6-target-testing/openjdk.build/tmp/tmp.jar /notnfs/nighttester/icedtea6-target-testing/openjdk.build/j2sdk-image/lib/dt.jar
make[5]: Leaving directory `/notnfs/nighttester/icedtea6-target-testing/openjdk/jdk/make/javax/swing/beaninfo'
make[4]: Leaving directory `/notnfs/nighttester/icedtea6-target-testing/openjdk/jdk/make/javax/swing/beaninfo'
/bin/mkdir -p /notnfs/nighttester/icedtea6-target-testing/openjdk.build/j2sdk-image/man/man1
for manbase in /notnfs/nighttester/icedtea6-target-testing/openjdk/jdk/src/linux/doc/man /notnfs/nighttester/icedtea6-target-testing/openjdk.build/impdoc/man ; do for manpage in java.1 keytool.1 orbd.1 pack200.1 policytool.1 rmid.1 rmiregistry.1 servertool.1 tnameserv.1 unpack200.1 appletviewer.1 apt.1 extcheck.1 idlj.1 jar.1 jarsigner.1 javac.1 javadoc.1 javah.1 javap.1 jconsole.1 jdb.1 jhat.1 jinfo.1 jmap.1 jps.1 jrunscript.1 jsadebugd.1 jstack.1 jstat.1 jstatd.1 native2ascii.1 rmic.1 schemagen.1 serialver.1 wsgen.1 wsimport.1 xjc.1; do if [ -f ${manbase}/${manpage} ] ; then /bin/cp ${manbase}/${manpage} /notnfs/nighttester/icedtea6-target-testing/openjdk.build/j2sdk-image/man/man1 ; for ja_encoding in eucJP; do ja_dir="ja"; if [ "${ja_encoding}" != "eucJP" ]; then ja_dir="ja_JP.${ja_encoding}"; fi; /bin/mkdir -p /notnfs/nighttester/icedtea6-target-testing/openjdk.build/j2sdk-image/man/${ja_dir}/man1; /bin/cat ${manbase}/ja/${manpage} | /notnfs/nighttester/icedtea6-target-testing/bootstrap/jdk1.6.0/bin/native2ascii -J-Xmx896m -J-Xms128m -J-XX:PermSize2m -J-XX:MaxPermSize0m -encoding eucJP | /bin/sed 's/@@VERSION@@/1.6.0/g' | /notnfs/nighttester/icedtea6-target-testing/bootstrap/jdk1.6.0/bin/native2ascii -J-Xmx896m -J-Xms128m -J-XX:PermSize2m -J-XX:MaxPermSize0m -reverse -encoding ${ja_encoding} > /notnfs/nighttester/icedtea6-target-testing/openjdk.build/j2sdk-image/man/${ja_dir}/man1/${manpage}; done; fi; done; done
if [ -w hotspot.log ] ; then rm -f hotspot.log; fi
if [ "ja_JP.eucJP" != "" ] ; then /bin/mv /notnfs/nighttester/icedtea6-target-testing/openjdk.build/j2sdk-image/man/ja /notnfs/nighttester/icedtea6-target-testing/openjdk.build/j2sdk-image/man/ja_JP.eucJP; cd /notnfs/nighttester/icedtea6-target-testing/openjdk.build/j2sdk-image/man && /bin/ln -s ja_JP.eucJP ja; fi
Making trim-image-jre @ Wed Mar 9 00:43:56 EST 2011 ...
for l in libsaproc.so libattach.so ; do \
rm -f /notnfs/nighttester/icedtea6-target-testing/openjdk.build/j2re-image/lib/amd64/$l ; \
done ;
Making trim-image-jdk @ Wed Mar 9 00:43:56 EST 2011 ...
for t in java_vm; do \
rm -f /notnfs/nighttester/icedtea6-target-testing/openjdk.build/j2sdk-image/bin/${t} \
/notnfs/nighttester/icedtea6-target-testing/openjdk.build/j2sdk-image/bin/*/native_threads/${t}; \
done
Making process-image-jre @ Wed Mar 9 00:43:56 EST 2011 ...
rm -f /notnfs/nighttester/icedtea6-target-testing/openjdk.build/tmp/jre-elf-files.list
/usr/bin/find /notnfs/nighttester/icedtea6-target-testing/openjdk.build/j2re-image/lib -type f -name \*.so >> /notnfs/nighttester/icedtea6-target-testing/openjdk.build/tmp/jre-elf-files.list
/usr/bin/file `/usr/bin/find /notnfs/nighttester/icedtea6-target-testing/openjdk.build/j2re-image/bin -type f -name \*` \
/bin/egrep 'ELF' | /usr/bin/cut -d':' -f1 >> /notnfs/nighttester/icedtea6-target-testing/openjdk.build/tmp/jre-elf-files.list
rm -f /notnfs/nighttester/icedtea6-target-testing/openjdk.build/tmp/jre-elf-files.list
Making process-image-jdk @ Wed Mar 9 00:43:56 EST 2011 ...
rm -f /notnfs/nighttester/icedtea6-target-testing/openjdk.build/tmp/jdk-elf-files.list
/usr/bin/find /notnfs/nighttester/icedtea6-target-testing/openjdk.build/j2sdk-image/jre/lib -type f -name \*.so >> /notnfs/nighttester/icedtea6-target-testing/openjdk.build/tmp/jdk-elf-files.list
/usr/bin/file `/usr/bin/find /notnfs/nighttester/icedtea6-target-testing/openjdk.build/j2sdk-image/jre/bin -type f -name \*` \
/bin/egrep 'ELF' | /usr/bin/cut -d':' -f1 >> /notnfs/nighttester/icedtea6-target-testing/openjdk.build/tmp/jdk-elf-files.list
file `/usr/bin/find /notnfs/nighttester/icedtea6-target-testing/openjdk.build/j2sdk-image/bin -type f -name \*` \
/bin/egrep 'ELF' | /usr/bin/cut -d':' -f1 >> /notnfs/nighttester/icedtea6-target-testing/openjdk.build/tmp/jdk-elf-files.list
rm -f /notnfs/nighttester/icedtea6-target-testing/openjdk.build/tmp/jdk-elf-files.list
Making sec-files @ Wed Mar 9 00:43:56 EST 2011 ...
/bin/mkdir -p .
rm -f sec-files
rm -f /notnfs/nighttester/icedtea6-target-testing/openjdk.build/tmp/sec-bin.zip
cd /notnfs/nighttester/icedtea6-target-testing/openjdk.build && \
/usr/bin/zip -rq9 /notnfs/nighttester/icedtea6-target-testing/openjdk.build/tmp/sec-bin.zip classes/javax/net classes/javax/security/cert classes/com/sun/net/ssl classes/com/sun/security/cert classes/sun/net/www/protocol/https classes/sun/security/pkcs12 classes/sun/security/ssl classes/sun/security/krb5/*.class classes/sun/security/krb5/internal/*.class classes/sun/security/krb5/internal/ccache classes/sun/security/krb5/internal/crypto classes/sun/security/krb5/internal/ktab classes/sun/security/krb5/internal/rcache classes/sun/security/krb5/internal/util classes/sun/security/jgss/spi/GSSContextSpi.class
Making sec-files-win @ Wed Mar 9 00:43:56 EST 2011 ...
Making jgss-files @ Wed Mar 9 00:43:56 EST 2011 ...
Finished making images @ Wed Mar 9 00:43:56 EST 2011 ...
make[3]: Leaving directory `/notnfs/nighttester/icedtea6-target-testing/openjdk/jdk/make'
make[2]: Leaving directory `/notnfs/nighttester/icedtea6-target-testing/openjdk'
Control linux amd64 1.6.0_22 build_product_image build finished: 11-03-09 00:43
Control linux amd64 1.6.0_22 all_product_build build finished: 11-03-09 00:43
Control linux amd64 1.6.0_22 all build finished: 11-03-09 00:43
make[1]: Leaving directory `/notnfs/nighttester/icedtea6-target-testing/openjdk'
mkdir -p /notnfs/nighttester/icedtea6-target-testing/openjdk.build/j2sdk-image/jre/lib/amd64
mkdir -p /notnfs/nighttester/icedtea6-target-testing/openjdk.build/j2re-image/lib/amd64
mkdir -p /notnfs/nighttester/icedtea6-target-testing/openjdk.build/j2sdk-image/jre/lib/ext
mkdir -p /notnfs/nighttester/icedtea6-target-testing/openjdk.build/j2re-image/lib/ext
IcedTea is served: /notnfs/nighttester/icedtea6-target-testing/openjdk.build
mkdir -p stamps
touch stamps/icedtea.stamp
+ make icedtea-against-icedtea
printf -- '-jamvm ERROR\n' >> /notnfs/nighttester/icedtea6-target-testing/openjdk.build/j2sdk-image/jre/lib/amd64/jvm.cfg
touch stamps/add-jamvm.stamp
printf -- '-cacao ERROR\n' >> /notnfs/nighttester/icedtea6-target-testing/openjdk.build/j2sdk-image/jre/lib/amd64/jvm.cfg
touch stamps/add-cacao.stamp
printf -- '-zero ERROR\n' >> /notnfs/nighttester/icedtea6-target-testing/openjdk.build/j2sdk-image/jre/lib/amd64/jvm.cfg
printf -- '-shark ERROR\n' >> /notnfs/nighttester/icedtea6-target-testing/openjdk.build/j2sdk-image/jre/lib/amd64/jvm.cfg
touch stamps/add-zero.stamp
mkdir -p /notnfs/nighttester/icedtea6-target-testing/openjdk.build/j2sdk-image/tapset
grep "client IGNORE" /notnfs/nighttester/icedtea6-target-testing/openjdk.build/j2sdk-image/jre/lib/amd64/jvm.cfg; \
if test $? -eq 0; then \
sed -e '/\/client\/libjvm.so/d' \
< /notnfs/nighttester/icedtea6-target-testing/tapset/hotspot.stp \
/notnfs/nighttester/icedtea6-target-testing/openjdk.build/j2sdk-image/tapset/hotspot.stp; \
sed -e '/\/client\/libjvm.so/d' \
< /notnfs/nighttester/icedtea6-target-testing/tapset/hotspot_jni.stp \
/notnfs/nighttester/icedtea6-target-testing/openjdk.build/j2sdk-image/tapset/hotspot_jni.stp; \
else \
cp /notnfs/nighttester/icedtea6-target-testing/tapset/hotspot.stp \
/notnfs/nighttester/icedtea6-target-testing/openjdk.build/j2sdk-image/tapset/hotspot.stp; \
cp /notnfs/nighttester/icedtea6-target-testing/tapset/hotspot_jni.stp \
/notnfs/nighttester/icedtea6-target-testing/openjdk.build/j2sdk-image/tapset/hotspot_jni.stp; \
fi
-client IGNORE
cp /notnfs/nighttester/icedtea6-target-testing/tapset/jstack.stp \
/notnfs/nighttester/icedtea6-target-testing/openjdk.build/j2sdk-image/tapset/jstack.stp
touch stamps/add-systemtap.stamp
touch stamps/add-pulseaudio.stamp
cp /notnfs/nighttester/icedtea6-target-testing/nss.cfg \
/notnfs/nighttester/icedtea6-target-testing/openjdk.build/j2sdk-image/jre/lib/security
touch stamps/add-nss.stamp
cp /notnfs/nighttester/icedtea6-target-testing/tz.properties \
/notnfs/nighttester/icedtea6-target-testing/openjdk.build/j2sdk-image/jre/lib
touch stamps/add-tzdata-support.stamp
mkdir -p stamps
touch stamps/icedtea-against-icedtea.stamp
+ make
make: Nothing to be done for `all'.
+ make check-hotspot
rm -rf test/jtreg/classes
mkdir -p test/jtreg/classes
/notnfs/nighttester/icedtea6-target-testing/bootstrap/jdk1.6.0/bin/javac -g -encoding utf-8 -source 6 -target 6 -d test/jtreg/classes \
-encoding iso-8859-1 `find /notnfs/nighttester/icedtea6-target-testing/test/jtreg/com -name '*.java'`
Note: Some input files use or override a deprecated API.
Note: Recompile with -Xlint:deprecation for details.
Note: Some input files use unchecked or unsafe operations.
Note: Recompile with -Xlint:unchecked for details.
(cd /notnfs/nighttester/icedtea6-target-testing/test/jtreg; \
/notnfs/nighttester/icedtea6-target-testing/bootstrap/jdk1.6.0/bin/jar cfm /notnfs/nighttester/icedtea6-target-testing/test/jtreg.jar \
META-INF/MANIFEST.MF \
legal README JavaTest.cmdMgrs.lst JavaTest.toolMgrs.lst \
`find com -type f -a -not -name '*.java'` \
-C /notnfs/nighttester/icedtea6-target-testing/test/jtreg/classes com)
mkdir -p stamps
touch stamps/jtreg.stamp
mkdir -p test/hotspot/JTwork test/hotspot/JTreport
/notnfs/nighttester/icedtea6-target-testing/bootstrap/jdk1.6.0/bin/java -jar test/jtreg.jar -v1 -a -ignore:quiet \
-w:test/hotspot/JTwork -r:test/hotspot/JTreport \
-jdk:/notnfs/nighttester/icedtea6-target-testing/openjdk.build/j2sdk-image \
\
`pwd`/openjdk/hotspot/test \
tee test/check-hotspot.log
Directory "test/hotspot/JTwork/scratch" not found: creating
Passed: compiler/5057225/Test5057225.java
Passed: compiler/6378821/Test6378821.java
Passed: compiler/6431242/Test.java
Passed: compiler/6539464/Test.java
Passed: compiler/6579789/Test6579789.java
Passed: compiler/6589834/Test_ia32.java
Passed: compiler/6603011/Test.java
Passed: compiler/6636138/Test1.java
Passed: compiler/6636138/Test2.java
Passed: compiler/6646019/Test.java
Passed: compiler/6646020/Tester.java
Passed: compiler/6659207/Test.java
Passed: compiler/6661247/Test.java
Passed: compiler/6663621/IVTest.java
Passed: compiler/6663848/Tester.java
Passed: compiler/6663854/Test6663854.java
Passed: compiler/6689060/Test.java
Passed: compiler/6695810/Test.java
Passed: compiler/6700047/Test6700047.java
Passed: compiler/6707044/LuceneCrash.java
Passed: compiler/6711100/Test.java
Passed: compiler/6711117/Test.java
Passed: compiler/6712835/Test6712835.java
Passed: compiler/6714694/Tester.java
Passed: compiler/6716441/Tester.java
Passed: compiler/6724218/Test.java
Passed: compiler/6726999/Test.java
Passed: compiler/6741738/Tester.java
Passed: compiler/6756768/Test6756768_2.java
Passed: compiler/6756768/Test6756768.java
Passed: compiler/6757316/Test6757316.java
Passed: compiler/6758234/Test6758234.java
Passed: compiler/6769124/TestArrayCopy6769124.java
Passed: compiler/6769124/TestDeoptInt6769124.java
Passed: compiler/6769124/TestUnalignedLoad6769124.java
Passed: compiler/6772683/InterruptedTest.java
Passed: compiler/6775880/Test.java
Passed: compiler/6778657/Test.java
Passed: compiler/6792161/Test6792161.java
Passed: compiler/6795161/Test.java
Passed: compiler/6795362/Test6795362.java
Passed: compiler/6795465/Test6795465.java
Passed: compiler/6797305/Test6797305.java
Passed: compiler/6799693/Test.java
Passed: compiler/6800154/Test6800154.java
Passed: compiler/6805724/Test6805724.java
Passed: compiler/6814842/Test6814842.java
Passed: compiler/6823354/Test6823354.java
Passed: compiler/6823453/Test.java
Passed: compiler/6826736/Test.java
Passed: compiler/6832293/Test.java
Passed: compiler/6833129/Test.java
Passed: compiler/6837011/Test6837011.java
Passed: compiler/6837094/Test.java
Passed: compiler/6843752/Test.java
Passed: compiler/6849574/Test.java
Passed: compiler/6851282/Test.java
Passed: compiler/6852078/Test6852078.java
Passed: compiler/6855164/Test.java
Passed: compiler/6855215/Test6855215.java
Passed: compiler/6857159/Test6857159.java
Passed: compiler/6859338/Test6859338.java
Passed: compiler/6860469/Test.java
Passed: compiler/6863155/Test6863155.java
FAILED: compiler/6863420/Test.java
Passed: compiler/6865031/Test.java
Passed: compiler/6866651/Test.java
Passed: compiler/6875866/Test.java
Passed: compiler/6877254/Test.java
Passed: compiler/6879902/Test6879902.java
Passed: compiler/6880034/Test6880034.java
Passed: compiler/6885584/Test6885584.java
Passed: compiler/6891750/Test6891750.java
Passed: compiler/6892265/Test.java
Passed: compiler/6894807/IsInstanceTest.java
Passed: compiler/6895383/Test.java
Passed: compiler/6896727/Test.java
Passed: compiler/6901572/Test.java
Passed: compiler/6909839/Test6909839.java
Passed: compiler/6910484/Test.java
Passed: compiler/6910605/Test.java
Passed: compiler/6910618/Test.java
Passed: compiler/6912517/Test.java
Passed: compiler/6916644/Test6916644.java
Passed: compiler/6921969/TestMultiplyLongHiZero.java
Passed: compiler/6930043/Test6930043.java
Passed: compiler/6932496/Test6932496.java
Passed: compiler/6935535/Test.java
Passed: compiler/6946040/TestCharShortByteSwap.java
Passed: compiler/6958485/Test.java
Passed: compiler/6968348/Test6968348.java
Passed: compiler/6973329/Test.java
Passed: compiler/6982370/Test6982370.java
Passed: compiler/7002666/Test7002666.java
Passed: compiler/7009231/Test7009231.java
Passed: compiler/7009359/Test7009359.java
Passed: compiler/7017746/Test.java
Passed: gc/6581734/Test6581734.java
Passed: gc/6845368/bigobj.java
FAILED: runtime/6196102/LoopTest.java
Passed: runtime/6626217/Test6626217.sh
Passed: runtime/6819213/TestBootNativeLibraryPath.java
Passed: runtime/6888954/vmerrors.sh
Passed: runtime/6925573/SortMethodsTest.java
Passed: runtime/6929067/Test6929067.sh
Passed: runtime/6981737/Test6981737.java
Test results: passed: 104; failed: 2
Report written to test/hotspot/JTreport/html/report.html
Results written to /notnfs/nighttester/icedtea6-target-testing/test/hotspot/JTwork
Error: Some tests failed or other problems occurred.
test -z `grep "^Error:\|^FAILED:" test/check-hotspot.log`
/bin/sh: line 0: test: too many arguments
make: *** [check-hotspot] Error 2
+ exit 1

Search Discussions

Related Discussions

Discussion Navigation
viewthread | post
Discussion Overview
groupicedtea-test @
categoriesopenjdk
postedMar 8, '11 at 9:48p
activeMar 16, '11 at 11:31p
posts2
users1
websiteopenjdk.java.net

1 user in discussion

Hudson Admin: 2 posts

People

Translate

site design / logo © 2018 Grokbase