FAQ
See <http://toadeater:8080/job/IcedTea6TargetTesting/607/>

------------------------------------------
Started by timer
[workspace] $ /bin/sh -xe /tmp/hudson9173167649205588391.sh
+ cd /notnfs/nighttester/icedtea6-target-testing/
+ bash -x /notnfs/nighttester/nightly-tester-scripts/icedtea6-target-testing
+ OPENJDK6_TARBALL=/notnfs/nighttester/drops/openjdk-6-src-b20-21_jun_2010.tar.gz
+ HS19_TARBALL=/notnfs/nighttester/drops/hs19.tar.gz
+ CACAO_TARBALL=/notnfs/nighttester/drops/cacao-dd4532afd08a.tar.bz2
+ JAXP6_TARBALL=/notnfs/nighttester/drops/jaxp6.zip
+ JAF6_TARBALL=/notnfs/nighttester/drops/jaf6.zip
+ JAXWS6_TARBALL=/notnfs/nighttester/drops/jaxws6.zip
+ PARALLEL=--with-parallel-jobs=3
+ TARBALLS='--with-openjdk-src-zip=/notnfs/nighttester/drops/openjdk-6-src-b20-21_jun_2010.tar.gz --with-cacao-src-zip=/notnfs/nighttester/drops/cacao-dd4532afd08a.tar.bz2 --with-hotspot-src-zip=/notnfs/nighttester/drops/hs19.tar.gz --with-jaxp-drop-zip=/notnfs/nighttester/drops/jaxp6.zip --with-jaf-drop-zip=/notnfs/nighttester/drops/jaf6.zip --with-jaxws-drop-zip=/notnfs/nighttester/drops/jaxws6.zip'
+ SYSTEMTAP=--enable-systemtap
+ COMMON_CONFIG_OPTS='--with-parallel-jobs=3 --with-openjdk-src-zip=/notnfs/nighttester/drops/openjdk-6-src-b20-21_jun_2010.tar.gz --with-cacao-src-zip=/notnfs/nighttester/drops/cacao-dd4532afd08a.tar.bz2 --with-hotspot-src-zip=/notnfs/nighttester/drops/hs19.tar.gz --with-jaxp-drop-zip=/notnfs/nighttester/drops/jaxp6.zip --with-jaf-drop-zip=/notnfs/nighttester/drops/jaf6.zip --with-jaxws-drop-zip=/notnfs/nighttester/drops/jaxws6.zip --enable-systemtap'
+ make distclean
rm -rf test/jtreg/classes
rm -f test/jtreg.jar
rm -f stamps/jtreg.stamp
rm -rf test/hotspot test/langtools test/jdk
rm -f test/check-*.log test/jtreg-summary.log
rm -rf /notnfs/nighttester/icedtea6-target-testing/pulseaudio.build/native
rm -rf /notnfs/nighttester/icedtea6-target-testing/pulseaudio.build/classes
rm -f /notnfs/nighttester/icedtea6-target-testing/pulseaudio.build/pulse-java.jar
rmdir /notnfs/nighttester/icedtea6-target-testing/pulseaudio.build
rmdir: failed to remove `/notnfs/nighttester/icedtea6-target-testing/pulseaudio.build': No such file or directory
make: *** [clean-pulse-java] Error 1
+ hg pull
pulling from http://icedtea.classpath.org/hg/icedtea6
searching for changes
adding changesets
adding manifests
adding file changes
added 33 changesets with 82 changes to 15 files
(run 'hg update' to get a working copy)
+ hg update
14 files updated, 0 files merged, 104 files removed, 0 files unresolved
+ ./autogen.sh
+ ./configure --with-parallel-jobs=3 --with-openjdk-src-zip=/notnfs/nighttester/drops/openjdk-6-src-b20-21_jun_2010.tar.gz --with-cacao-src-zip=/notnfs/nighttester/drops/cacao-dd4532afd08a.tar.bz2 --with-hotspot-src-zip=/notnfs/nighttester/drops/hs19.tar.gz --with-jaxp-drop-zip=/notnfs/nighttester/drops/jaxp6.zip --with-jaf-drop-zip=/notnfs/nighttester/drops/jaf6.zip --with-jaxws-drop-zip=/notnfs/nighttester/drops/jaxws6.zip --enable-systemtap
checking for a BSD-compatible install... /usr/bin/install -c
checking whether build environment is sane... yes
checking for a thread-safe mkdir -p... /bin/mkdir -p
checking for gawk... gawk
checking whether make sets $(MAKE)... yes
checking how to create a pax tar archive... gnutar
checking build system type... x86_64-unknown-linux-gnu
checking host system type... x86_64-unknown-linux-gnu
checking for gcc... gcc
checking for C compiler default output file name... a.out
checking whether the C compiler works... yes
checking whether we are cross compiling... no
checking for suffix of executables...
checking for suffix of object files... o
checking whether we are using the GNU C compiler... yes
checking whether gcc accepts -g... yes
checking for gcc option to accept ISO C89... none needed
checking for style of include used by make... GNU
checking dependency style of gcc... none
checking for g++... g++
checking whether we are using the GNU C++ compiler... yes
checking whether g++ accepts -g... yes
checking dependency style of g++... none
checking for make... /usr/bin/make
checking for gzip... /bin/gzip
checking for ant... /usr/bin/ant
checking for find... /bin/find
checking for patch... /usr/bin/patch
checking for tar... /bin/tar
checking for chmod... /bin/chmod
checking for md5sum... /usr/bin/md5sum
checking for sha256sum... /usr/bin/sha256sum
checking for wget... /usr/bin/wget
checking for zip... /usr/bin/zip
checking for unzip... /usr/bin/unzip
checking for cpio... /bin/cpio
checking for file... /usr/bin/file
checking for fastjar... fastjar
checking for ldd... ldd
checking for gawk... /bin/gawk
checking for hg... /usr/bin/hg
checking for an OpenJDK source directory... /notnfs/nighttester/icedtea6-target-testing/openjdk
checking for IcedTea Mercurial revision ID... r743a3ac9f201
checking for JDK Mercurial revision ID... none
checking for HotSpot Mercurial revision ID... none
checking for lsb_release... /usr/bin/lsb_release
checking whether to compile ecj natively... no
checking which HotSpot build to use... original
checking for linux32... /usr/bin/linux32
checking version of GCC... 4.4.3 (major version 4, minor version 4)
checking for getconf... /usr/bin/getconf
checking the number of online processors... 2
checking how many parallel build jobs to execute... 3
checking if cp supports --reflink... yes
checking if we can hard link rather than copy from /notnfs/nighttester/icedtea6-target-testing... yes
checking if a PaX-enabled kernel is running... no
checking for an Ant home directory... /usr/share/ant
checking whether to include PulseAudio support... no
checking whether to build documentation... yes
checking whether to enable experimental OpenJDK cross-compilation support... no
checking whether to include the XRender pipeline... yes
checking whether to include NIO2 support... no
checking whether to include SystemTap tracing support... yes
checking for system library directory...
checking for pkg-config... /usr/bin/pkg-config
checking pkg-config is at least version 0.9.0... yes
checking for NSS... yes
checking whether to include the NSS-based security provider... disabled by default (edit java.security to enable)
checking for distribution package version... none
checking build identification... Built on Fedora release 12 (Constantine) (Sat Jan 22 00:02:11 EST 2011)
checking whether to build a bootstrap version first... yes
checking for a JDK home directory... /usr/lib/jvm/java-gcj
checking for java... /usr/lib/jvm/java-gcj/bin/java
checking for javac... /usr/lib/jvm/java-gcj/bin/javac
checking for ecj... /usr/bin/ecj
checking for javah... /usr/lib/jvm/java-gcj/bin/javah
checking for jar... /usr/lib/jvm/java-gcj/bin/jar
checking whether jar supports @<file> argument... yes
checking whether jar supports stdin file arguments... yes
checking whether jar supports -J options at the end... yes
checking for rmic... /usr/lib/jvm/java-gcj/bin/rmic
checking for an ecj JAR file... /usr/share/java/eclipse-ecj.jar
checking for a xalan2 jar... /usr/share/java/xalan-j2.jar
checking for a xalan2 serializer jar... /usr/share/java/xalan-j2-serializer.jar
checking for a xerces2 jar... /usr/share/java/xerces-j2.jar
checking whether to include Javascript support via Rhino... /usr/share/java/rhino.jar
checking for an OpenJDK source zip... /notnfs/nighttester/drops/openjdk-6-src-b20-21_jun_2010.tar.gz
checking for a HotSpot source zip... /notnfs/nighttester/drops/hs19.tar.gz
checking for an alternate jar command... not specified
checking for a JAXP drop zip... /notnfs/nighttester/drops/jaxp6.zip
checking for a JAF drop zip... /notnfs/nighttester/drops/jaf6.zip
checking for a JAXWS drop zip... /notnfs/nighttester/drops/jaxws6.zip
checking whether to use CACAO as VM... no
checking for a CACAO home directory... $(abs_top_builddir)/cacao/install
checking for a CACAO source zip... /notnfs/nighttester/drops/cacao-dd4532afd08a.tar.bz2
checking for a CACAO source directory... not specified
checking whether to disable optimizations and build with -O0 -g... no
checking whether to use the Shark JIT... no
checking how to run the C preprocessor... gcc -E
checking for grep that handles long lines and -e... /bin/grep
checking for egrep... /bin/grep -E
checking for ANSI C header files... yes
checking for sys/types.h... yes
checking for sys/stat.h... yes
checking for stdlib.h... yes
checking for string.h... yes
checking for memory.h... yes
checking for strings.h... yes
checking for inttypes.h... yes
checking for stdint.h... yes
checking for unistd.h... yes
checking whether to use the zero-assembler port... no
checking whether byte ordering is bigendian... no
checking for additional virtual machines to build... none
checking whether to retrieve the source code from Mercurial... no
checking which Mercurial revision to use... tip
checking which Java timezone data directory to use... /usr/share/javazi
checking if javax.xml.stream.events.Attribute.getDTDType() wrongly returns a QName... no
checking if /usr/lib/jvm/java-gcj/bin/javah exhibits Classpath bug 39408... yes
checking if /usr/lib/jvm/java-gcj/bin/javah exhibits Classpath bug 40188... yes
checking cups/cups.h usability... yes
checking cups/cups.h presence... yes
checking for cups/cups.h... yes
checking cups/ppd.h usability... yes
checking cups/ppd.h presence... yes
checking for cups/ppd.h... yes
checking X11/X.h usability... yes
checking X11/X.h presence... yes
checking for X11/X.h... yes
checking for main in -ljpeg... yes
checking for main in -lgif... yes
checking for main in -lz... yes
checking for XPROTO... yes
checking for XT... yes
checking for XP... yes
checking for X11... yes
checking for XINERAMA... yes
checking for XRENDER... yes
checking sys/sdt.h usability... yes
checking sys/sdt.h presence... yes
checking for sys/sdt.h... yes
checking working sys/sdt.h and g++ support... yes
checking for absolute java home install dir... /notnfs/nighttester/icedtea6-target-testing/openjdk.build/j2sdk-image
checking for LIBPNG... yes
checking for XTST... yes
checking for FREETYPE2... yes
checking for ALSA... yes
configure: creating ./config.status
config.status: creating Makefile
config.status: creating nss.cfg
config.status: creating javac
config.status: creating javap
config.status: creating jvm.cfg
config.status: creating ergo.c
config.status: creating tz.properties
config.status: creating tapset/hotspot.stp
config.status: creating tapset/hotspot_jni.stp
config.status: creating tapset/jstack.stp
config.status: executing depfiles commands
+ make env-ecj
Makefile:1057: warning: overriding commands for target `.PHONY'
Makefile:1012: warning: ignoring old commands for target `.PHONY'
unset JAVA_HOME
export ALT_JDK_IMPORT_PATH="/notnfs/nighttester/icedtea6-target-testing/bootstrap/jdk1.6.0" ANT="/usr/bin/ant" BUILD_NUMBER="b21" JDK_UPDATE_VERSION="21" JRE_RELEASE_VERSION="1.6.0_21-b21" MILESTONE="fcs" LANG="C" PATH="/notnfs/nighttester/icedtea6-target-testing/bootstrap/jdk1.6.0/bin::$PATH" ALT_BOOTDIR="/notnfs/nighttester/icedtea6-target-testing/bootstrap/jdk1.6.0" BUILD_ARCH_DIR="amd64" ICEDTEA_CLS_DIR="/notnfs/nighttester/icedtea6-target-testing/openjdk.build/classes" ICEDTEA_ENDORSED_DIR="/notnfs/nighttester/icedtea6-target-testing/bootstrap/jdk1.6.0/lib/endorsed" ENDORSED="-Djava.endorsed.dirs=/notnfs/nighttester/icedtea6-target-testing/bootstrap/jdk1.6.0/lib/endorsed" CLASSPATH="" LD_LIBRARY_PATH="" ZERO_BUILD="" SHARK_BUILD="" ZERO_LIBARCH="amd64" ARCH_DATA_MODEL="64" ZERO_ENDIANNESS="little" ZERO_ARCHDEF="AMD64" ZERO_ARCHFLAG="-m64" LIBFFI_CFLAGS="" LIBFFI_LIBS="" LLVM_CFLAGS="" LLVM_LDFLAGS="" LLVM_LIBS="" FREETYPE2_HEADERS="-I/usr/include/freetype2 " FT2_LIB="-lfreetype " ALT_PARALLEL_COMPILE_JOBS="3" HOTSPOT_BUILD_JOBS="3" JAVAC="" JAVA_HOME="" JDK_HOME="" DISTRIBUTION_ID="Built on Fedora release 12 (Constantine) (Sat Jan 22 00:02:11 EST 2011)" DERIVATIVE_ID="IcedTea6 1.10pre+r743a3ac9f201" DEBUG_CLASSFILES="true" DEBUG_BINARIES="true" ALT_DROPS_DIR="/notnfs/nighttester/icedtea6-target-testing/drops" VERBOSE="" ALT_OUTPUTDIR="/notnfs/nighttester/icedtea6-target-testing/openjdk.build" RHINO_JAR="/notnfs/nighttester/icedtea6-target-testing/rhino/rhino.jar" ALT_OUTPUTDIR="/notnfs/nighttester/icedtea6-target-testing/openjdk.build-ecj" JAVA_TOOLS_DIR="/notnfs/nighttester/icedtea6-target-testing/bootstrap/jdk1.6.0/bin" ICEDTEA_RT="/notnfs/nighttester/icedtea6-target-testing/bootstrap/jdk1.6.0/jre/lib/rt.jar" ICEDTEA_CLS_DIR="/notnfs/nighttester/icedtea6-target-testing/openjdk.build-ecj/classes" BOOTCLASSPATH_CLS_RT="-bootclasspath /notnfs/nighttester/icedtea6-target-testing/openjdk.build-ecj/classes:/notnfs/nighttester/icedtea6-target-testing/bootstrap/jdk1.6.0/jre/lib/rt.jar" BOOTCLASSPATH_CLS="-bootclasspath /notnfs/nighttester/icedtea6-target-testing/openjdk.build-ecj/classes" BOOTCLASSPATH_RT_LIBGCJ="-bootclasspath /notnfs/nighttester/icedtea6-target-testing/bootstrap/jdk1.6.0/jre/lib/rt.jar" CLASSPATH="" LD_LIBRARY_PATH="" GENSRCDIR="/notnfs/nighttester/icedtea6-target-testing/generated" JAR_KNOWS_ATFILE="1" JAR_KNOWS_J_OPTIONS="1" JAR_ACCEPTS_STDIN_LIST="1" DISABLE_NIMBUS="true" NO_DOCS="true"
+ make extract-ecj
Makefile:1057: warning: overriding commands for target `.PHONY'
Makefile:1012: warning: ignoring old commands for target `.PHONY'
set -e ; \
if ! test -d openjdk ; \
then \
mkdir openjdk ; \
/bin/tar xf openjdk-6-src-b21-20_jan_2011.tar.gz -C openjdk; \
chmod -R ug+w openjdk ; \
sh /notnfs/nighttester/icedtea6-target-testing/fsg.sh ; \
fi
/bin/tar: openjdk-6-src-b21-20_jan_2011.tar.gz: Cannot open: No such file or directory
/bin/tar: Error is not recoverable: exiting now
make: *** [stamps/extract-openjdk.stamp] Error 2
+ exit 1

Search Discussions

  • Hudson Admin at Jan 22, 2011 at 9:02 pm
    See <http://toadeater:8080/job/IcedTea6TargetTesting/608/>

    ------------------------------------------
    [...truncated 277 lines...]
    checking whether byte ordering is bigendian... no
    checking for additional virtual machines to build... none
    checking whether to retrieve the source code from Mercurial... no
    checking which Mercurial revision to use... tip
    checking which Java timezone data directory to use... /usr/share/javazi
    checking if javax.xml.stream.events.Attribute.getDTDType() wrongly returns a QName... no
    checking if /usr/lib/jvm/java-gcj/bin/javah exhibits Classpath bug 39408... yes
    checking if /usr/lib/jvm/java-gcj/bin/javah exhibits Classpath bug 40188... yes
    checking cups/cups.h usability... yes
    checking cups/cups.h presence... yes
    checking for cups/cups.h... yes
    checking cups/ppd.h usability... yes
    checking cups/ppd.h presence... yes
    checking for cups/ppd.h... yes
    checking X11/X.h usability... yes
    checking X11/X.h presence... yes
    checking for X11/X.h... yes
    checking for main in -ljpeg... yes
    checking for main in -lgif... yes
    checking for main in -lz... yes
    checking for XPROTO... yes
    checking for XT... yes
    checking for XP... yes
    checking for X11... yes
    checking for XINERAMA... yes
    checking for XRENDER... yes
    checking sys/sdt.h usability... yes
    checking sys/sdt.h presence... yes
    checking for sys/sdt.h... yes
    checking working sys/sdt.h and g++ support... yes
    checking for absolute java home install dir... /notnfs/nighttester/icedtea6-target-testing/openjdk.build/j2sdk-image
    checking for LIBPNG... yes
    checking for XTST... yes
    checking for FREETYPE2... yes
    checking for ALSA... yes
    configure: creating ./config.status
    config.status: creating Makefile
    config.status: creating nss.cfg
    config.status: creating javac
    config.status: creating javap
    config.status: creating jvm.cfg
    config.status: creating ergo.c
    config.status: creating tz.properties
    config.status: creating tapset/hotspot.stp
    config.status: creating tapset/hotspot_jni.stp
    config.status: creating tapset/jstack.stp
    config.status: executing depfiles commands
    + make env-ecj
    unset JAVA_HOME
    export ALT_JDK_IMPORT_PATH="/notnfs/nighttester/icedtea6-target-testing/bootstrap/jdk1.6.0" ANT="/usr/bin/ant" BUILD_NUMBER="b21" JDK_UPDATE_VERSION="21" JRE_RELEASE_VERSION="1.6.0_21-b21" MILESTONE="fcs" LANG="C" PATH="/notnfs/nighttester/icedtea6-target-testing/bootstrap/jdk1.6.0/bin::$PATH" ALT_BOOTDIR="/notnfs/nighttester/icedtea6-target-testing/bootstrap/jdk1.6.0" BUILD_ARCH_DIR="amd64" ICEDTEA_CLS_DIR="/notnfs/nighttester/icedtea6-target-testing/openjdk.build/classes" ICEDTEA_ENDORSED_DIR="/notnfs/nighttester/icedtea6-target-testing/bootstrap/jdk1.6.0/lib/endorsed" ENDORSED="-Djava.endorsed.dirs=/notnfs/nighttester/icedtea6-target-testing/bootstrap/jdk1.6.0/lib/endorsed" CLASSPATH="" LD_LIBRARY_PATH="" ZERO_BUILD="" SHARK_BUILD="" ZERO_LIBARCH="amd64" ARCH_DATA_MODEL="64" ZERO_ENDIANNESS="little" ZERO_ARCHDEF="AMD64" ZERO_ARCHFLAG="-m64" LIBFFI_CFLAGS="" LIBFFI_LIBS="" LLVM_CFLAGS="" LLVM_LDFLAGS="" LLVM_LIBS="" FREETYPE2_HEADERS="-I/usr/include/freetype2 " FT2_LIB="-lfreetype " ALT_PARALLEL_COMPILE_JOBS="3" HOTSPOT_BUILD_JOBS="3" JAVAC="" JAVA_HOME="" JDK_HOME="" DISTRIBUTION_ID="Built on Fedora release 12 (Constantine) (Sun Jan 23 00:02:02 EST 2011)" DERIVATIVE_ID="IcedTea6 1.10pre+r6633b7a3a5db" DEBUG_CLASSFILES="true" DEBUG_BINARIES="true" ALT_DROPS_DIR="/notnfs/nighttester/icedtea6-target-testing/drops" VERBOSE="" ALT_OUTPUTDIR="/notnfs/nighttester/icedtea6-target-testing/openjdk.build" RHINO_JAR="/notnfs/nighttester/icedtea6-target-testing/rhino/rhino.jar" ALT_OUTPUTDIR="/notnfs/nighttester/icedtea6-target-testing/openjdk.build-ecj" JAVA_TOOLS_DIR="/notnfs/nighttester/icedtea6-target-testing/bootstrap/jdk1.6.0/bin" ICEDTEA_RT="/notnfs/nighttester/icedtea6-target-testing/bootstrap/jdk1.6.0/jre/lib/rt.jar" ICEDTEA_CLS_DIR="/notnfs/nighttester/icedtea6-target-testing/openjdk.build-ecj/classes" BOOTCLASSPATH_CLS_RT="-bootclasspath /notnfs/nighttester/icedtea6-target-testing/openjdk.build-ecj/classes:/notnfs/nighttester/icedtea6-target-testing/bootstrap/jdk1.6.0/jre/lib/rt.jar" BOOTCLASSPATH_CLS="-bootclasspath /notnfs/nighttester/icedtea6-target-testing/openjdk.build-ecj/classes" BOOTCLASSPATH_RT_LIBGCJ="-bootclasspath /notnfs/nighttester/icedtea6-target-testing/bootstrap/jdk1.6.0/jre/lib/rt.jar" CLASSPATH="" LD_LIBRARY_PATH="" GENSRCDIR="/notnfs/nighttester/icedtea6-target-testing/generated" JAR_KNOWS_ATFILE="1" JAR_KNOWS_J_OPTIONS="1" JAR_ACCEPTS_STDIN_LIST="1" DISABLE_NIMBUS="true" NO_DOCS="true"
    + make extract-ecj
    mkdir -p drops
    ln -sf /notnfs/nighttester/drops/jaxp6.zip drops/jaxp-1_4_4.zip
    if ! echo "10b203bec5b7d3dd8f515a9e098f80abc316faf977bcc220b56efe3dc6e9e5e9 drops/jaxp-1_4_4.zip" \
    /usr/bin/sha256sum --check ; \
    then \
    if [ -f drops/jaxp-1_4_4.zip ] ; \
    then \
    mv drops/jaxp-1_4_4.zip drops/jaxp-1_4_4.zip.old ; \
    fi ; \
    /usr/bin/wget http://icedtea.classpath.org/download/drops/jaxp-1_4_4.zip -O drops/jaxp-1_4_4.zip; \
    if ! echo "10b203bec5b7d3dd8f515a9e098f80abc316faf977bcc220b56efe3dc6e9e5e9 drops/jaxp-1_4_4.zip" \
    /usr/bin/sha256sum --check ; \
    then echo "ERROR: Bad download of jaxp drop zip"; false; \
    fi; \
    fi ;
    drops/jaxp-1_4_4.zip: FAILED
    /usr/bin/sha256sum: WARNING: 1 of 1 computed checksum did NOT match
    --2011-01-23 00:02:04-- http://icedtea.classpath.org/download/drops/jaxp-1_4_4.zip
    Resolving icedtea.classpath.org... 208.78.240.231
    Connecting to icedtea.classpath.org|208.78.240.231|:80... connected.
    HTTP request sent, awaiting response... 200 OK
    Length: 5972577 (5.7M) [application/zip]
    Saving to: ?drops/jaxp-1_4_4.zip?

    0K .......... .......... .......... .......... .......... 0% 130K 44s
    50K .......... .......... .......... .......... .......... 1% 365K 30s
    100K .......... .......... .......... .......... .......... 2% 406K 24s
    150K .......... .......... .......... .......... .......... 3% 485K 21s
    200K .......... .......... .......... .......... .......... 4% 467K 19s
    250K .......... .......... .......... .......... .......... 5% 913K 17s
    300K .......... .......... .......... .......... .......... 6% 445K 16s
    350K .......... .......... .......... .......... .......... 6% 511K 15s
    400K .......... .......... .......... .......... .......... 7% 445K 15s
    450K .......... .......... .......... .......... .......... 8% 770K 14s
    500K .......... .......... .......... .......... .......... 9% 398K 14s
    550K .......... .......... .......... .......... .......... 10% 522K 13s
    600K .......... .......... .......... .......... .......... 11% 431K 13s
    650K .......... .......... .......... .......... .......... 12% 729K 12s
    700K .......... .......... .......... .......... .......... 12% 435K 12s
    750K .......... .......... .......... .......... .......... 13% 529K 12s
    800K .......... .......... .......... .......... .......... 14% 419K 12s
    850K .......... .......... .......... .......... .......... 15% 784K 11s
    900K .......... .......... .......... .......... .......... 16% 427K 11s
    950K .......... .......... .......... .......... .......... 17% 504K 11s
    1000K .......... .......... .......... .......... .......... 18% 438K 11s
    1050K .......... .......... .......... .......... .......... 18% 757K 11s
    1100K .......... .......... .......... .......... .......... 19% 445K 11s
    1150K .......... .......... .......... .......... .......... 20% 570K 10s
    1200K .......... .......... .......... .......... .......... 21% 444K 10s
    1250K .......... .......... .......... .......... .......... 22% 744K 10s
    1300K .......... .......... .......... .......... .......... 23% 577K 10s
    1350K .......... .......... .......... .......... .......... 24% 444K 10s
    1400K .......... .......... .......... .......... .......... 24% 732K 9s
    1450K .......... .......... .......... .......... .......... 25% 445K 9s
    1500K .......... .......... .......... .......... .......... 26% 586K 9s
    1550K .......... .......... .......... .......... .......... 27% 414K 9s
    1600K .......... .......... .......... .......... .......... 28% 807K 9s
    1650K .......... .......... .......... .......... .......... 29% 387K 9s
    1700K .......... .......... .......... .......... .......... 30% 533K 9s
    1750K .......... .......... .......... .......... .......... 30% 435K 9s
    1800K .......... .......... .......... .......... .......... 31% 705K 8s
    1850K .......... .......... .......... .......... .......... 32% 454K 8s
    1900K .......... .......... .......... .......... .......... 33% 586K 8s
    1950K .......... .......... .......... .......... .......... 34% 451K 8s
    2000K .......... .......... .......... .......... .......... 35% 705K 8s
    2050K .......... .......... .......... .......... .......... 36% 445K 8s
    2100K .......... .......... .......... .......... .......... 36% 595K 8s
    2150K .......... .......... .......... .......... .......... 37% 443K 8s
    2200K .......... .......... .......... .......... .......... 38% 712K 7s
    2250K .......... .......... .......... .......... .......... 39% 445K 7s
    2300K .......... .......... .......... .......... .......... 40% 597K 7s
    2350K .......... .......... .......... .......... .......... 41% 703K 7s
    2400K .......... .......... .......... .......... .......... 42% 446K 7s
    2450K .......... .......... .......... .......... .......... 42% 602K 7s
    2500K .......... .......... .......... .......... .......... 43% 447K 7s
    2550K .......... .......... .......... .......... .......... 44% 688K 7s
    2600K .......... .......... .......... .......... .......... 45% 441K 7s
    2650K .......... .......... .......... .......... .......... 46% 464K 6s
    2700K .......... .......... .......... .......... .......... 47% 434K 6s
    2750K .......... .......... .......... .......... .......... 48% 756K 6s
    2800K .......... .......... .......... .......... .......... 48% 436K 6s
    2850K .......... .......... .......... .......... .......... 49% 504K 6s
    2900K .......... .......... .......... .......... .......... 50% 458K 6s
    2950K .......... .......... .......... .......... .......... 51% 766K 6s
    3000K .......... .......... .......... .......... .......... 52% 444K 6s
    3050K .......... .......... .......... .......... .......... 53% 563K 6s
    3100K .......... .......... .......... .......... .......... 54% 446K 5s
    3150K .......... .......... .......... .......... .......... 54% 522K 5s
    3200K .......... .......... .......... .......... .......... 55% 602K 5s
    3250K .......... .......... .......... .......... .......... 56% 570K 5s
    3300K .......... .......... .......... .......... .......... 57% 747K 5s
    3350K .......... .......... .......... .......... .......... 58% 445K 5s
    3400K .......... .......... .......... .......... .......... 59% 573K 5s
    3450K .......... .......... .......... .......... .......... 60% 446K 5s
    3500K .......... .......... .......... .......... .......... 60% 743K 5s
    3550K .......... .......... .......... .......... .......... 61% 444K 5s
    3600K .......... .......... .......... .......... .......... 62% 588K 4s
    3650K .......... .......... .......... .......... .......... 63% 444K 4s
    3700K .......... .......... .......... .......... .......... 64% 714K 4s
    3750K .......... .......... .......... .......... .......... 65% 445K 4s
    3800K .......... .......... .......... .......... .......... 66% 584K 4s
    3850K .......... .......... .......... .......... .......... 66% 420K 4s
    3900K .......... .......... .......... .......... .......... 67% 691K 4s
    3950K .......... .......... .......... .......... .......... 68% 420K 4s
    4000K .......... .......... .......... .......... .......... 69% 557K 4s
    4050K .......... .......... .......... .......... .......... 70% 431K 3s
    4100K .......... .......... .......... .......... .......... 71% 769K 3s
    4150K .......... .......... .......... .......... .......... 72% 443K 3s
    4200K .......... .......... .......... .......... .......... 72% 566K 3s
    4250K .......... .......... .......... .......... .......... 73% 749K 3s
    4300K .......... .......... .......... .......... .......... 74% 445K 3s
    4350K .......... .......... .......... .......... .......... 75% 567K 3s
    4400K .......... .......... .......... .......... .......... 76% 448K 3s
    4450K .......... .......... .......... .......... .......... 77% 736K 3s
    4500K .......... .......... .......... .......... .......... 78% 443K 3s
    4550K .......... .......... .......... .......... .......... 78% 585K 2s
    4600K .......... .......... .......... .......... .......... 79% 443K 2s
    4650K .......... .......... .......... .......... .......... 80% 725K 2s
    4700K .......... .......... .......... .......... .......... 81% 443K 2s
    4750K .......... .......... .......... .......... .......... 82% 592K 2s
    4800K .......... .......... .......... .......... .......... 83% 448K 2s
    4850K .......... .......... .......... .......... .......... 84% 696K 2s
    4900K .......... .......... .......... .......... .......... 84% 444K 2s
    4950K .......... .......... .......... .......... .......... 85% 588K 2s
    5000K .......... .......... .......... .......... .......... 86% 445K 2s
    5050K .......... .......... .......... .......... .......... 87% 716K 1s
    5100K .......... .......... .......... .......... .......... 88% 446K 1s
    5150K .......... .......... .......... .......... .......... 89% 600K 1s
    5200K .......... .......... .......... .......... .......... 90% 440K 1s
    5250K .......... .......... .......... .......... .......... 90% 656K 1s
    5300K .......... .......... .......... .......... .......... 91% 442K 1s
    5350K .......... .......... .......... .......... .......... 92% 648K 1s
    5400K .......... .......... .......... .......... .......... 93% 645K 1s
    5450K .......... .......... .......... .......... .......... 94% 434K 1s
    5500K .......... .......... .......... .......... .......... 95% 665K 1s
    5550K .......... .......... .......... .......... .......... 96% 442K 0s
    5600K .......... .......... .......... .......... .......... 96% 625K 0s
    5650K .......... .......... .......... .......... .......... 97% 443K 0s
    5700K .......... .......... .......... .......... .......... 98% 634K 0s
    5750K .......... .......... .......... .......... .......... 99% 443K 0s
    5800K .......... .......... .......... .. 100% 290Ks

    2011-01-23 00:02:16 (505 KB/s) - ?drops/jaxp-1_4_4.zip? saved [5972577/5972577]

    drops/jaxp-1_4_4.zip: OK
    mkdir -p stamps
    touch stamps/download-jaxp-drop.stamp
    mkdir -p drops
    ln -sf /notnfs/nighttester/drops/jaxws6.zip drops/jdk6-jaxws-b20.zip
    if ! echo "0c460583898b968a58bf88eb53f90a0e34369e2562d65fb3a143512dfcaeb3eb drops/jdk6-jaxws-b20.zip" \
    /usr/bin/sha256sum --check ; \
    then \
    if [ -f drops/jdk6-jaxws-b20.zip ] ; \
    then \
    mv drops/jdk6-jaxws-b20.zip drops/jdk6-jaxws-b20.zip.old ; \
    fi ; \
    /usr/bin/wget http://icedtea.classpath.org/download/drops/jdk6-jaxws-b20.zip -O drops/jdk6-jaxws-b20.zip; \
    if ! echo "0c460583898b968a58bf88eb53f90a0e34369e2562d65fb3a143512dfcaeb3eb drops/jdk6-jaxws-b20.zip" \
    /usr/bin/sha256sum --check ; \
    then echo "ERROR: Bad download of jaxws drop zip"; false; \
    fi; \
    fi ;
    drops/jdk6-jaxws-b20.zip: OK
    mkdir -p stamps
    touch stamps/download-jaxws-drop.stamp
    mkdir -p drops
    ln -sf /notnfs/nighttester/drops/jaf6.zip drops/jdk6-jaf-b20.zip
    if ! echo "78c7b5c9d6271e88ee46abadd018a61f1e9645f8936cc8df1617e5f4f5074012 drops/jdk6-jaf-b20.zip" \
    /usr/bin/sha256sum --check ; \
    then \
    if [ -f drops/jdk6-jaf-b20.zip ] ; \
    then \
    mv drops/jdk6-jaf-b20.zip drops/jdk6-jaf-b20.zip.old ; \
    fi ; \
    /usr/bin/wget http://icedtea.classpath.org/download/drops/jdk6-jaf-b20.zip -O drops/jdk6-jaf-b20.zip; \
    if ! echo "78c7b5c9d6271e88ee46abadd018a61f1e9645f8936cc8df1617e5f4f5074012 drops/jdk6-jaf-b20.zip" \
    /usr/bin/sha256sum --check ; \
    then echo "ERROR: Bad download of jaf drop zip"; false; \
    fi; \
    fi ;
    drops/jdk6-jaf-b20.zip: OK
    mkdir -p stamps
    touch stamps/download-jaf-drop.stamp
    mkdir -p stamps
    touch stamps/download-drops.stamp
    touch stamps/download.stamp
    set -e ; \
    if ! test -d openjdk ; \
    then \
    mkdir openjdk ; \
    /bin/tar xf openjdk-6-src-b21-20_jan_2011.tar.gz -C openjdk; \
    chmod -R ug+w openjdk ; \
    sh /notnfs/nighttester/icedtea6-target-testing/fsg.sh ; \
    fi
    /bin/tar: openjdk-6-src-b21-20_jan_2011.tar.gz: Cannot open: No such file or directory
    /bin/tar: Error is not recoverable: exiting now
    make: *** [stamps/extract-openjdk.stamp] Error 2
    + exit 1
  • Hudson Admin at Jan 23, 2011 at 9:02 pm
    See <http://toadeater:8080/job/IcedTea6TargetTesting/609/>

    ------------------------------------------
    [...truncated 271 lines...]
    checking whether byte ordering is bigendian... no
    checking for additional virtual machines to build... none
    checking whether to retrieve the source code from Mercurial... no
    checking which Mercurial revision to use... tip
    checking which Java timezone data directory to use... /usr/share/javazi
    checking if javax.xml.stream.events.Attribute.getDTDType() wrongly returns a QName... no
    checking if /usr/lib/jvm/java-gcj/bin/javah exhibits Classpath bug 39408... yes
    checking if /usr/lib/jvm/java-gcj/bin/javah exhibits Classpath bug 40188... yes
    checking cups/cups.h usability... yes
    checking cups/cups.h presence... yes
    checking for cups/cups.h... yes
    checking cups/ppd.h usability... yes
    checking cups/ppd.h presence... yes
    checking for cups/ppd.h... yes
    checking X11/X.h usability... yes
    checking X11/X.h presence... yes
    checking for X11/X.h... yes
    checking for main in -ljpeg... yes
    checking for main in -lgif... yes
    checking for main in -lz... yes
    checking for XPROTO... yes
    checking for XT... yes
    checking for XP... yes
    checking for X11... yes
    checking for XINERAMA... yes
    checking for XRENDER... yes
    checking sys/sdt.h usability... yes
    checking sys/sdt.h presence... yes
    checking for sys/sdt.h... yes
    checking working sys/sdt.h and g++ support... yes
    checking for absolute java home install dir... /notnfs/nighttester/icedtea6-target-testing/openjdk.build/j2sdk-image
    checking for LIBPNG... yes
    checking for XTST... yes
    checking for FREETYPE2... yes
    checking for ALSA... yes
    configure: creating ./config.status
    config.status: creating Makefile
    config.status: creating nss.cfg
    config.status: creating javac
    config.status: creating javap
    config.status: creating jvm.cfg
    config.status: creating ergo.c
    config.status: creating tz.properties
    config.status: creating tapset/hotspot.stp
    config.status: creating tapset/hotspot_jni.stp
    config.status: creating tapset/jstack.stp
    config.status: executing depfiles commands
    + make env-ecj
    unset JAVA_HOME
    export ALT_JDK_IMPORT_PATH="/notnfs/nighttester/icedtea6-target-testing/bootstrap/jdk1.6.0" ANT="/usr/bin/ant" BUILD_NUMBER="b21" JDK_UPDATE_VERSION="21" JRE_RELEASE_VERSION="1.6.0_21-b21" MILESTONE="fcs" LANG="C" PATH="/notnfs/nighttester/icedtea6-target-testing/bootstrap/jdk1.6.0/bin::$PATH" ALT_BOOTDIR="/notnfs/nighttester/icedtea6-target-testing/bootstrap/jdk1.6.0" BUILD_ARCH_DIR="amd64" ICEDTEA_CLS_DIR="/notnfs/nighttester/icedtea6-target-testing/openjdk.build/classes" ICEDTEA_ENDORSED_DIR="/notnfs/nighttester/icedtea6-target-testing/bootstrap/jdk1.6.0/lib/endorsed" ENDORSED="-Djava.endorsed.dirs=/notnfs/nighttester/icedtea6-target-testing/bootstrap/jdk1.6.0/lib/endorsed" CLASSPATH="" LD_LIBRARY_PATH="" ZERO_BUILD="" SHARK_BUILD="" ZERO_LIBARCH="amd64" ARCH_DATA_MODEL="64" ZERO_ENDIANNESS="little" ZERO_ARCHDEF="AMD64" ZERO_ARCHFLAG="-m64" LIBFFI_CFLAGS="" LIBFFI_LIBS="" LLVM_CFLAGS="" LLVM_LDFLAGS="" LLVM_LIBS="" FREETYPE2_HEADERS="-I/usr/include/freetype2 " FT2_LIB="-lfreetype " ALT_PARALLEL_COMPILE_JOBS="3" HOTSPOT_BUILD_JOBS="3" JAVAC="" JAVA_HOME="" JDK_HOME="" DISTRIBUTION_ID="Built on Fedora release 12 (Constantine) (Mon Jan 24 00:01:58 EST 2011)" DERIVATIVE_ID="IcedTea6 1.10pre+r6633b7a3a5db" DEBUG_CLASSFILES="true" DEBUG_BINARIES="true" ALT_DROPS_DIR="/notnfs/nighttester/icedtea6-target-testing/drops" VERBOSE="" ALT_OUTPUTDIR="/notnfs/nighttester/icedtea6-target-testing/openjdk.build" RHINO_JAR="/notnfs/nighttester/icedtea6-target-testing/rhino/rhino.jar" ALT_OUTPUTDIR="/notnfs/nighttester/icedtea6-target-testing/openjdk.build-ecj" JAVA_TOOLS_DIR="/notnfs/nighttester/icedtea6-target-testing/bootstrap/jdk1.6.0/bin" ICEDTEA_RT="/notnfs/nighttester/icedtea6-target-testing/bootstrap/jdk1.6.0/jre/lib/rt.jar" ICEDTEA_CLS_DIR="/notnfs/nighttester/icedtea6-target-testing/openjdk.build-ecj/classes" BOOTCLASSPATH_CLS_RT="-bootclasspath /notnfs/nighttester/icedtea6-target-testing/openjdk.build-ecj/classes:/notnfs/nighttester/icedtea6-target-testing/bootstrap/jdk1.6.0/jre/lib/rt.jar" BOOTCLASSPATH_CLS="-bootclasspath /notnfs/nighttester/icedtea6-target-testing/openjdk.build-ecj/classes" BOOTCLASSPATH_RT_LIBGCJ="-bootclasspath /notnfs/nighttester/icedtea6-target-testing/bootstrap/jdk1.6.0/jre/lib/rt.jar" CLASSPATH="" LD_LIBRARY_PATH="" GENSRCDIR="/notnfs/nighttester/icedtea6-target-testing/generated" JAR_KNOWS_ATFILE="1" JAR_KNOWS_J_OPTIONS="1" JAR_ACCEPTS_STDIN_LIST="1" DISABLE_NIMBUS="true" NO_DOCS="true"
    + make extract-ecj
    mkdir -p drops
    ln -sf /notnfs/nighttester/drops/jaxp6.zip drops/jaxp-1_4_4.zip
    if ! echo "10b203bec5b7d3dd8f515a9e098f80abc316faf977bcc220b56efe3dc6e9e5e9 drops/jaxp-1_4_4.zip" \
    /usr/bin/sha256sum --check ; \
    then \
    if [ -f drops/jaxp-1_4_4.zip ] ; \
    then \
    mv drops/jaxp-1_4_4.zip drops/jaxp-1_4_4.zip.old ; \
    fi ; \
    /usr/bin/wget http://icedtea.classpath.org/download/drops/jaxp-1_4_4.zip -O drops/jaxp-1_4_4.zip; \
    if ! echo "10b203bec5b7d3dd8f515a9e098f80abc316faf977bcc220b56efe3dc6e9e5e9 drops/jaxp-1_4_4.zip" \
    /usr/bin/sha256sum --check ; \
    then echo "ERROR: Bad download of jaxp drop zip"; false; \
    fi; \
    fi ;
    drops/jaxp-1_4_4.zip: FAILED
    /usr/bin/sha256sum: WARNING: 1 of 1 computed checksum did NOT match
    --2011-01-24 00:02:01-- http://icedtea.classpath.org/download/drops/jaxp-1_4_4.zip
    Resolving icedtea.classpath.org... 208.78.240.231
    Connecting to icedtea.classpath.org|208.78.240.231|:80... connected.
    HTTP request sent, awaiting response... 200 OK
    Length: 5972577 (5.7M) [application/zip]
    Saving to: ?drops/jaxp-1_4_4.zip?

    0K .......... .......... .......... .......... .......... 0% 131K 44s
    50K .......... .......... .......... .......... .......... 1% 362K 30s
    100K .......... .......... .......... .......... .......... 2% 403K 24s
    150K .......... .......... .......... .......... .......... 3% 444K 21s
    200K .......... .......... .......... .......... .......... 4% 429K 20s
    250K .......... .......... .......... .......... .......... 5% 1.15M 17s
    300K .......... .......... .......... .......... .......... 6% 438K 16s
    350K .......... .......... .......... .......... .......... 6% 451K 16s
    400K .......... .......... .......... .......... .......... 7% 451K 15s
    450K .......... .......... .......... .......... .......... 8% 1.04M 14s
    500K .......... .......... .......... .......... .......... 9% 443K 14s
    550K .......... .......... .......... .......... .......... 10% 449K 13s
    600K .......... .......... .......... .......... .......... 11% 445K 13s
    650K .......... .......... .......... .......... .......... 12% 963K 12s
    700K .......... .......... .......... .......... .......... 12% 448K 12s
    750K .......... .......... .......... .......... .......... 13% 497K 12s
    800K .......... .......... .......... .......... .......... 14% 450K 12s
    850K .......... .......... .......... .......... .......... 15% 897K 11s
    900K .......... .......... .......... .......... .......... 16% 447K 11s
    950K .......... .......... .......... .......... .......... 17% 511K 11s
    1000K .......... .......... .......... .......... .......... 18% 446K 11s
    1050K .......... .......... .......... .......... .......... 18% 880K 11s
    1100K .......... .......... .......... .......... .......... 19% 517K 10s
    1150K .......... .......... .......... .......... .......... 20% 445K 10s
    1200K .......... .......... .......... .......... .......... 21% 851K 10s
    1250K .......... .......... .......... .......... .......... 22% 445K 10s
    1300K .......... .......... .......... .......... .......... 23% 528K 10s
    1350K .......... .......... .......... .......... .......... 24% 445K 10s
    1400K .......... .......... .......... .......... .......... 24% 820K 9s
    1450K .......... .......... .......... .......... .......... 25% 447K 9s
    1500K .......... .......... .......... .......... .......... 26% 532K 9s
    1550K .......... .......... .......... .......... .......... 27% 427K 9s
    1600K .......... .......... .......... .......... .......... 28% 753K 9s
    1650K .......... .......... .......... .......... .......... 29% 405K 9s
    1700K .......... .......... .......... .......... .......... 30% 363K 9s
    1750K .......... .......... .......... .......... .......... 30% 993K 9s
    1800K .......... .......... .......... .......... .......... 31% 522K 8s
    1850K .......... .......... .......... .......... .......... 32% 756K 8s
    1900K .......... .......... .......... .......... .......... 33% 458K 8s
    1950K .......... .......... .......... .......... .......... 34% 551K 8s
    2000K .......... .......... .......... .......... .......... 35% 448K 8s
    2050K .......... .......... .......... .......... .......... 36% 774K 8s
    2100K .......... .......... .......... .......... .......... 36% 446K 8s
    2150K .......... .......... .......... .......... .......... 37% 559K 7s
    2200K .......... .......... .......... .......... .......... 38% 446K 7s
    2250K .......... .......... .......... .......... .......... 39% 764K 7s
    2300K .......... .......... .......... .......... .......... 40% 446K 7s
    2350K .......... .......... .......... .......... .......... 41% 566K 7s
    2400K .......... .......... .......... .......... .......... 42% 450K 7s
    2450K .......... .......... .......... .......... .......... 42% 733K 7s
    2500K .......... .......... .......... .......... .......... 43% 446K 7s
    2550K .......... .......... .......... .......... .......... 44% 582K 7s
    2600K .......... .......... .......... .......... .......... 45% 446K 6s
    2650K .......... .......... .......... .......... .......... 46% 722K 6s
    2700K .......... .......... .......... .......... .......... 47% 445K 6s
    2750K .......... .......... .......... .......... .......... 48% 593K 6s
    2800K .......... .......... .......... .......... .......... 48% 709K 6s
    2850K .......... .......... .......... .......... .......... 49% 445K 6s
    2900K .......... .......... .......... .......... .......... 50% 599K 6s
    2950K .......... .......... .......... .......... .......... 51% 450K 6s
    3000K .......... .......... .......... .......... .......... 52% 681K 6s
    3050K .......... .......... .......... .......... .......... 53% 445K 5s
    3100K .......... .......... .......... .......... .......... 54% 623K 5s
    3150K .......... .......... .......... .......... .......... 54% 444K 5s
    3200K .......... .......... .......... .......... .......... 55% 677K 5s
    3250K .......... .......... .......... .......... .......... 56% 444K 5s
    3300K .......... .......... .......... .......... .......... 57% 627K 5s
    3350K .......... .......... .......... .......... .......... 58% 429K 5s
    3400K .......... .......... .......... .......... .......... 59% 689K 5s
    3450K .......... .......... .......... .......... .......... 60% 416K 5s
    3500K .......... .......... .......... .......... .......... 60% 648K 5s
    3550K .......... .......... .......... .......... .......... 61% 422K 4s
    3600K .......... .......... .......... .......... .......... 62% 589K 4s
    3650K .......... .......... .......... .......... .......... 63% 431K 4s
    3700K .......... .......... .......... .......... .......... 64% 639K 4s
    3750K .......... .......... .......... .......... .......... 65% 596K 4s
    3800K .......... .......... .......... .......... .......... 66% 423K 4s
    3850K .......... .......... .......... .......... .......... 66% 642K 4s
    3900K .......... .......... .......... .......... .......... 67% 427K 4s
    3950K .......... .......... .......... .......... .......... 68% 579K 4s
    4000K .......... .......... .......... .......... .......... 69% 431K 4s
    4050K .......... .......... .......... .......... .......... 70% 621K 3s
    4100K .......... .......... .......... .......... .......... 71% 455K 3s
    4150K .......... .......... .......... .......... .......... 72% 653K 3s
    4200K .......... .......... .......... .......... .......... 72% 446K 3s
    4250K .......... .......... .......... .......... .......... 73% 639K 3s
    4300K .......... .......... .......... .......... .......... 74% 445K 3s
    4350K .......... .......... .......... .......... .......... 75% 642K 3s
    4400K .......... .......... .......... .......... .......... 76% 653K 3s
    4450K .......... .......... .......... .......... .......... 77% 446K 3s
    4500K .......... .......... .......... .......... .......... 78% 642K 3s
    4550K .......... .......... .......... .......... .......... 78% 445K 2s
    4600K .......... .......... .......... .......... .......... 79% 648K 2s
    4650K .......... .......... .......... .......... .......... 80% 443K 2s
    4700K .......... .......... .......... .......... .......... 81% 647K 2s
    4750K .......... .......... .......... .......... .......... 82% 447K 2s
    4800K .......... .......... .......... .......... .......... 83% 640K 2s
    4850K .......... .......... .......... .......... .......... 84% 443K 2s
    4900K .......... .......... .......... .......... .......... 84% 645K 2s
    4950K .......... .......... .......... .......... .......... 85% 444K 2s
    5000K .......... .......... .......... .......... .......... 86% 648K 2s
    5050K .......... .......... .......... .......... .......... 87% 647K 1s
    5100K .......... .......... .......... .......... .......... 88% 445K 1s
    5150K .......... .......... .......... .......... .......... 89% 639K 1s
    5200K .......... .......... .......... .......... .......... 90% 445K 1s
    5250K .......... .......... .......... .......... .......... 90% 650K 1s
    5300K .......... .......... .......... .......... .......... 91% 446K 1s
    5350K .......... .......... .......... .......... .......... 92% 627K 1s
    5400K .......... .......... .......... .......... .......... 93% 424K 1s
    5450K .......... .......... .......... .......... .......... 94% 722K 1s
    5500K .......... .......... .......... .......... .......... 95% 412K 1s
    5550K .......... .......... .......... .......... .......... 96% 543K 0s
    5600K .......... .......... .......... .......... .......... 96% 429K 0s
    5650K .......... .......... .......... .......... .......... 97% 711K 0s
    5700K .......... .......... .......... .......... .......... 98% 425K 0s
    5750K .......... .......... .......... .......... .......... 99% 601K 0s
    5800K .......... .......... .......... .. 100% 559Ks

    2011-01-24 00:02:13 (510 KB/s) - ?drops/jaxp-1_4_4.zip? saved [5972577/5972577]

    drops/jaxp-1_4_4.zip: OK
    mkdir -p stamps
    touch stamps/download-jaxp-drop.stamp
    mkdir -p drops
    ln -sf /notnfs/nighttester/drops/jaxws6.zip drops/jdk6-jaxws-b20.zip
    if ! echo "0c460583898b968a58bf88eb53f90a0e34369e2562d65fb3a143512dfcaeb3eb drops/jdk6-jaxws-b20.zip" \
    /usr/bin/sha256sum --check ; \
    then \
    if [ -f drops/jdk6-jaxws-b20.zip ] ; \
    then \
    mv drops/jdk6-jaxws-b20.zip drops/jdk6-jaxws-b20.zip.old ; \
    fi ; \
    /usr/bin/wget http://icedtea.classpath.org/download/drops/jdk6-jaxws-b20.zip -O drops/jdk6-jaxws-b20.zip; \
    if ! echo "0c460583898b968a58bf88eb53f90a0e34369e2562d65fb3a143512dfcaeb3eb drops/jdk6-jaxws-b20.zip" \
    /usr/bin/sha256sum --check ; \
    then echo "ERROR: Bad download of jaxws drop zip"; false; \
    fi; \
    fi ;
    drops/jdk6-jaxws-b20.zip: OK
    mkdir -p stamps
    touch stamps/download-jaxws-drop.stamp
    mkdir -p drops
    ln -sf /notnfs/nighttester/drops/jaf6.zip drops/jdk6-jaf-b20.zip
    if ! echo "78c7b5c9d6271e88ee46abadd018a61f1e9645f8936cc8df1617e5f4f5074012 drops/jdk6-jaf-b20.zip" \
    /usr/bin/sha256sum --check ; \
    then \
    if [ -f drops/jdk6-jaf-b20.zip ] ; \
    then \
    mv drops/jdk6-jaf-b20.zip drops/jdk6-jaf-b20.zip.old ; \
    fi ; \
    /usr/bin/wget http://icedtea.classpath.org/download/drops/jdk6-jaf-b20.zip -O drops/jdk6-jaf-b20.zip; \
    if ! echo "78c7b5c9d6271e88ee46abadd018a61f1e9645f8936cc8df1617e5f4f5074012 drops/jdk6-jaf-b20.zip" \
    /usr/bin/sha256sum --check ; \
    then echo "ERROR: Bad download of jaf drop zip"; false; \
    fi; \
    fi ;
    drops/jdk6-jaf-b20.zip: OK
    mkdir -p stamps
    touch stamps/download-jaf-drop.stamp
    mkdir -p stamps
    touch stamps/download-drops.stamp
    touch stamps/download.stamp
    set -e ; \
    if ! test -d openjdk ; \
    then \
    mkdir openjdk ; \
    /bin/tar xf openjdk-6-src-b21-20_jan_2011.tar.gz -C openjdk; \
    chmod -R ug+w openjdk ; \
    sh /notnfs/nighttester/icedtea6-target-testing/fsg.sh ; \
    fi
    /bin/tar: openjdk-6-src-b21-20_jan_2011.tar.gz: Cannot open: No such file or directory
    /bin/tar: Error is not recoverable: exiting now
    make: *** [stamps/extract-openjdk.stamp] Error 2
    + exit 1
  • Hudson Admin at Jan 24, 2011 at 11:40 am
    See <http://toadeater:8080/job/IcedTea6TargetTesting/610/>

    ------------------------------------------
    [...truncated 221629 lines...]
    checking host system type... x86_64-unknown-linux-gnu
    checking for gcc... gcc
    checking for C compiler default output file name... a.out
    checking whether the C compiler works... yes
    checking whether we are cross compiling... no
    checking for suffix of executables...
    checking for suffix of object files... o
    checking whether we are using the GNU C compiler... yes
    checking whether gcc accepts -g... yes
    checking for gcc option to accept ISO C89... none needed
    checking for style of include used by make... GNU
    checking dependency style of gcc... none
    checking for g++... g++
    checking whether we are using the GNU C++ compiler... yes
    checking whether g++ accepts -g... yes
    checking dependency style of g++... none
    checking for make... /usr/bin/make
    checking for gzip... /bin/gzip
    checking for ant... /usr/bin/ant
    checking for find... /bin/find
    checking for patch... /usr/bin/patch
    checking for tar... /bin/tar
    checking for chmod... /bin/chmod
    checking for md5sum... /usr/bin/md5sum
    checking for sha256sum... /usr/bin/sha256sum
    checking for wget... /usr/bin/wget
    checking for zip... /usr/bin/zip
    checking for unzip... /usr/bin/unzip
    checking for cpio... /bin/cpio
    checking for file... /usr/bin/file
    checking for fastjar... fastjar
    checking for ldd... ldd
    checking for gawk... /bin/gawk
    checking for hg... /usr/bin/hg
    checking for an OpenJDK source directory... /notnfs/nighttester/icedtea6-target-testing/openjdk
    checking for IcedTea Mercurial revision ID... r6633b7a3a5db
    checking for JDK Mercurial revision ID... none
    checking for HotSpot Mercurial revision ID... none
    checking for lsb_release... /usr/bin/lsb_release
    checking whether to compile ecj natively... no
    checking which HotSpot build to use... hs19
    checking for linux32... /usr/bin/linux32
    checking version of GCC... 4.4.3 (major version 4, minor version 4)
    checking for getconf... /usr/bin/getconf
    checking the number of online processors... 2
    checking how many parallel build jobs to execute... 3
    checking if cp supports --reflink... yes
    checking if we can hard link rather than copy from /notnfs/nighttester/icedtea6-target-testing... yes
    checking if a PaX-enabled kernel is running... no
    checking for xvfb-run... xvfb-run -a -e xvfb-errors
    checking for an Ant home directory... /usr/share/ant
    checking whether to include PulseAudio support... no
    checking whether to build documentation... yes
    checking whether to enable experimental OpenJDK cross-compilation support... no
    checking whether to include the XRender pipeline... yes
    checking whether to include NIO2 support... no
    checking whether to include SystemTap tracing support... yes
    checking for system library directory...
    checking for pkg-config... /usr/bin/pkg-config
    checking pkg-config is at least version 0.9.0... yes
    checking for NSS... yes
    checking whether to include the NSS-based security provider... disabled by default (edit java.security to enable)
    checking for distribution package version... none
    checking build identification... Built on Fedora release 12 (Constantine) (Mon Jan 24 14:40:23 EST 2011)
    checking whether to build a bootstrap version first... yes
    checking for a JDK home directory... /usr/lib/jvm/java-gcj
    checking for java... /usr/lib/jvm/java-gcj/bin/java
    checking for javac... /usr/lib/jvm/java-gcj/bin/javac
    checking for ecj... /usr/bin/ecj
    checking for javah... /usr/lib/jvm/java-gcj/bin/javah
    checking for jar... /usr/lib/jvm/java-gcj/bin/jar
    checking whether jar supports @<file> argument... yes
    checking whether jar supports stdin file arguments... yes
    checking whether jar supports -J options at the end... yes
    checking for rmic... /usr/lib/jvm/java-gcj/bin/rmic
    checking for an ecj JAR file... /usr/share/java/eclipse-ecj.jar
    checking for a xalan2 jar... /usr/share/java/xalan-j2.jar
    checking for a xalan2 serializer jar... /usr/share/java/xalan-j2-serializer.jar
    checking for a xerces2 jar... /usr/share/java/xerces-j2.jar
    checking whether to include Javascript support via Rhino... /usr/share/java/rhino.jar
    checking for an OpenJDK source zip... /notnfs/nighttester/drops/openjdk-6-src-b21-20_jan_2011.tar.gz
    checking for a HotSpot source zip... /notnfs/nighttester/drops/hs19.tar.gz
    checking for an alternate jar command... not specified
    checking for a JAXP drop zip... /notnfs/nighttester/drops/jaxp6.zip
    checking for a JAF drop zip... /notnfs/nighttester/drops/jaf6.zip
    checking for a JAXWS drop zip... /notnfs/nighttester/drops/jaxws6.zip
    checking whether to use CACAO as VM... no
    checking for a CACAO home directory... $(abs_top_builddir)/cacao/install
    checking for a CACAO source zip... /notnfs/nighttester/drops/cacao-dd4532afd08a.tar.bz2
    checking for a CACAO source directory... not specified
    checking whether to disable optimizations and build with -O0 -g... no
    checking whether to use the Shark JIT... no
    checking how to run the C preprocessor... gcc -E
    checking for grep that handles long lines and -e... /bin/grep
    checking for egrep... /bin/grep -E
    checking for ANSI C header files... yes
    checking for sys/types.h... yes
    checking for sys/stat.h... yes
    checking for stdlib.h... yes
    checking for string.h... yes
    checking for memory.h... yes
    checking for strings.h... yes
    checking for inttypes.h... yes
    checking for stdint.h... yes
    checking for unistd.h... yes
    checking whether to use the zero-assembler port... no
    checking whether byte ordering is bigendian... no
    checking for additional virtual machines to build... none
    checking whether to retrieve the source code from Mercurial... no
    checking which Mercurial revision to use... tip
    checking which Java timezone data directory to use... /usr/share/javazi
    checking if javax.xml.stream.events.Attribute.getDTDType() wrongly returns a QName... no
    checking if /usr/lib/jvm/java-gcj/bin/javah exhibits Classpath bug 39408... yes
    checking if /usr/lib/jvm/java-gcj/bin/javah exhibits Classpath bug 40188... yes
    checking cups/cups.h usability... yes
    checking cups/cups.h presence... yes
    checking for cups/cups.h... yes
    checking cups/ppd.h usability... yes
    checking cups/ppd.h presence... yes
    checking for cups/ppd.h... yes
    checking X11/X.h usability... yes
    checking X11/X.h presence... yes
    checking for X11/X.h... yes
    checking for main in -ljpeg... yes
    checking for main in -lgif... yes
    checking for main in -lz... yes
    checking for XPROTO... yes
    checking for XT... yes
    checking for XP... yes
    checking for X11... yes
    checking for XINERAMA... yes
    checking for XRENDER... yes
    checking sys/sdt.h usability... yes
    checking sys/sdt.h presence... yes
    checking for sys/sdt.h... yes
    checking working sys/sdt.h and g++ support... yes
    checking for absolute java home install dir... /notnfs/nighttester/icedtea6-target-testing/openjdk.build/j2sdk-image
    checking for LIBPNG... yes
    checking for XTST... yes
    checking for FREETYPE2... yes
    checking for ALSA... yes
    configure: creating ./config.status
    config.status: creating Makefile
    config.status: creating nss.cfg
    config.status: creating javac
    config.status: creating javap
    config.status: creating jvm.cfg
    config.status: creating ergo.c
    config.status: creating tz.properties
    config.status: creating tapset/hotspot.stp
    config.status: creating tapset/hotspot_jni.stp
    config.status: creating tapset/jstack.stp
    config.status: executing depfiles commands
    + make replace-hotspot
    mkdir -p drops
    ln -sf /notnfs/nighttester/drops/jaxp6.zip drops/jaxp-1_4_4.zip
    if ! echo "10b203bec5b7d3dd8f515a9e098f80abc316faf977bcc220b56efe3dc6e9e5e9 drops/jaxp-1_4_4.zip" \
    /usr/bin/sha256sum --check ; \
    then \
    if [ -f drops/jaxp-1_4_4.zip ] ; \
    then \
    mv drops/jaxp-1_4_4.zip drops/jaxp-1_4_4.zip.old ; \
    fi ; \
    /usr/bin/wget http://icedtea.classpath.org/download/drops/jaxp-1_4_4.zip -O drops/jaxp-1_4_4.zip; \
    if ! echo "10b203bec5b7d3dd8f515a9e098f80abc316faf977bcc220b56efe3dc6e9e5e9 drops/jaxp-1_4_4.zip" \
    /usr/bin/sha256sum --check ; \
    then echo "ERROR: Bad download of jaxp drop zip"; false; \
    fi; \
    fi ;
    drops/jaxp-1_4_4.zip: OK
    mkdir -p stamps
    touch stamps/download-jaxp-drop.stamp
    mkdir -p drops
    ln -sf /notnfs/nighttester/drops/jaxws6.zip drops/jdk6-jaxws-b20.zip
    if ! echo "0c460583898b968a58bf88eb53f90a0e34369e2562d65fb3a143512dfcaeb3eb drops/jdk6-jaxws-b20.zip" \
    /usr/bin/sha256sum --check ; \
    then \
    if [ -f drops/jdk6-jaxws-b20.zip ] ; \
    then \
    mv drops/jdk6-jaxws-b20.zip drops/jdk6-jaxws-b20.zip.old ; \
    fi ; \
    /usr/bin/wget http://icedtea.classpath.org/download/drops/jdk6-jaxws-b20.zip -O drops/jdk6-jaxws-b20.zip; \
    if ! echo "0c460583898b968a58bf88eb53f90a0e34369e2562d65fb3a143512dfcaeb3eb drops/jdk6-jaxws-b20.zip" \
    /usr/bin/sha256sum --check ; \
    then echo "ERROR: Bad download of jaxws drop zip"; false; \
    fi; \
    fi ;
    drops/jdk6-jaxws-b20.zip: OK
    mkdir -p stamps
    touch stamps/download-jaxws-drop.stamp
    mkdir -p drops
    ln -sf /notnfs/nighttester/drops/jaf6.zip drops/jdk6-jaf-b20.zip
    if ! echo "78c7b5c9d6271e88ee46abadd018a61f1e9645f8936cc8df1617e5f4f5074012 drops/jdk6-jaf-b20.zip" \
    /usr/bin/sha256sum --check ; \
    then \
    if [ -f drops/jdk6-jaf-b20.zip ] ; \
    then \
    mv drops/jdk6-jaf-b20.zip drops/jdk6-jaf-b20.zip.old ; \
    fi ; \
    /usr/bin/wget http://icedtea.classpath.org/download/drops/jdk6-jaf-b20.zip -O drops/jdk6-jaf-b20.zip; \
    if ! echo "78c7b5c9d6271e88ee46abadd018a61f1e9645f8936cc8df1617e5f4f5074012 drops/jdk6-jaf-b20.zip" \
    /usr/bin/sha256sum --check ; \
    then echo "ERROR: Bad download of jaf drop zip"; false; \
    fi; \
    fi ;
    drops/jdk6-jaf-b20.zip: OK
    mkdir -p stamps
    touch stamps/download-jaf-drop.stamp
    mkdir -p stamps
    touch stamps/download-drops.stamp
    mkdir -p stamps
    touch stamps/download-cacao.stamp
    mkdir -p stamps
    touch stamps/hgforest.stamp
    ln -sf /notnfs/nighttester/drops/openjdk-6-src-b21-20_jan_2011.tar.gz openjdk-6-src-b21-20_jan_2011.tar.gz
    ln -sf /notnfs/nighttester/drops/hs19.tar.gz hotspot.tar.gz
    mkdir -p stamps
    touch stamps/download-openjdk.stamp
    touch stamps/download.stamp
    set -e ; \
    if ! test -d openjdk ; \
    then \
    mkdir openjdk ; \
    /bin/tar xf openjdk-6-src-b21-20_jan_2011.tar.gz -C openjdk; \
    chmod -R ug+w openjdk ; \
    sh /notnfs/nighttester/icedtea6-target-testing/fsg.sh ; \
    fi
    Further liberating OpenJDK...
    mkdir -p stamps
    touch stamps/extract-openjdk.stamp
    mkdir -p stamps
    touch stamps/extract-cacao.stamp
    mkdir -p stamps
    touch stamps/extract.stamp
    if test "xhs19" != "xoriginal"; then \
    rm -rf openjdk/hotspot ; \
    if test -e hotspot.tar.gz ; \
    then \
    /bin/tar xf hotspot.tar.gz ; \
    dir=$(gawk 'version==$1 {print gensub(/.*\/([^/]*)$/,"\\1","g",$2)}' version=hs19 /notnfs/nighttester/icedtea6-target-testing/hotspot.map) ; \
    chmod -R ug+w $dir-* ; \
    mv $dir-$(gawk 'version==$1 {print $3}' version=hs19 /notnfs/nighttester/icedtea6-target-testing/hotspot.map) openjdk/hotspot ; \
    fi ; \
    fi ;
    chmod: invalid option -- '*'
    Try `chmod --help' for more information.
    mv: cannot stat `-': No such file or directory
    make: *** [stamps/replace-hotspot.stamp] Error 1
    + exit 1
  • Hudson Admin at Jan 24, 2011 at 1:41 pm

Related Discussions

Discussion Navigation
viewthread | post
Discussion Overview
groupicedtea-test @
categoriesopenjdk
postedJan 21, '11 at 9:02p
activeJan 24, '11 at 1:41p
posts5
users1
websiteopenjdk.java.net

1 user in discussion

Hudson Admin: 5 posts

People

Translate

site design / logo © 2018 Grokbase