FAQ
Build: https://hudson.apache.org/hudson/job/Lucene-Solr-tests-only-trunk/1632/

3 tests failed.
REGRESSION: org.apache.solr.cloud.BasicDistributedZkTest.testDistribSearch

Error Message:
Error executing query

Stack Trace:
org.apache.solr.client.solrj.SolrServerException: Error executing query
at org.apache.solr.client.solrj.request.QueryRequest.process(QueryRequest.java:95)
at org.apache.solr.client.solrj.SolrServer.query(SolrServer.java:119)
at org.apache.solr.cloud.BasicDistributedZkTest.queryServer(BasicDistributedZkTest.java:273)
at org.apache.solr.BaseDistributedSearchTestCase.query(BaseDistributedSearchTestCase.java:305)
at org.apache.solr.cloud.BasicDistributedZkTest.doTest(BasicDistributedZkTest.java:128)
at org.apache.solr.BaseDistributedSearchTestCase.testDistribSearch(BaseDistributedSearchTestCase.java:562)
at org.apache.lucene.util.LuceneTestCase$LuceneTestCaseRunner.runChild(LuceneTestCase.java:921)
at org.apache.lucene.util.LuceneTestCase$LuceneTestCaseRunner.runChild(LuceneTestCase.java:859)
Caused by: org.apache.solr.common.cloud.ZooKeeperException:
at org.apache.solr.client.solrj.impl.CloudSolrServer.connect(CloudSolrServer.java:93)
at org.apache.solr.client.solrj.impl.CloudSolrServer.request(CloudSolrServer.java:101)
at org.apache.solr.client.solrj.request.QueryRequest.process(QueryRequest.java:89)
Caused by: java.util.concurrent.TimeoutException: Could not connect to ZooKeeper 127.0.0.1:21697/solr within 10000 ms
at org.apache.solr.common.cloud.ConnectionManager.waitForConnected(ConnectionManager.java:124)
at org.apache.solr.common.cloud.SolrZkClient.(SolrZkClient.java:69)
at org.apache.solr.common.cloud.ZkStateReader.(CloudSolrServer.java:78)


REGRESSION: org.apache.solr.cloud.CloudStateUpdateTest.testCoreRegistration

Error Message:
expected:<2> but was:<3>

Stack Trace:
junit.framework.AssertionFailedError: expected:<2> but was:(LuceneTestCase.java:921)
at org.apache.lucene.util.LuceneTestCase$LuceneTestCaseRunner.runChild(LuceneTestCase.java:859)
at org.apache.solr.cloud.CloudStateUpdateTest.testCoreRegistration(CloudStateUpdateTest.java:208)


REGRESSION: org.apache.solr.cloud.ZkControllerTest.testUploadToCloud

Error Message:
KeeperErrorCode = ConnectionLoss for /configs/config1/solrconfig-master1.xml

Stack Trace:
org.apache.zookeeper.KeeperException$ConnectionLossException: KeeperErrorCode = ConnectionLoss for /configs/config1/solrconfig-master1.xml
at org.apache.zookeeper.KeeperException.create(KeeperException.java:90)
at org.apache.zookeeper.KeeperException.create(KeeperException.java:42)
at org.apache.zookeeper.ZooKeeper.create(ZooKeeper.java:637)
at org.apache.solr.common.cloud.SolrZkClient.makePath(SolrZkClient.java:348)
at org.apache.solr.common.cloud.SolrZkClient.makePath(SolrZkClient.java:309)
at org.apache.solr.common.cloud.SolrZkClient.makePath(SolrZkClient.java:291)
at org.apache.solr.common.cloud.SolrZkClient.makePath(SolrZkClient.java:256)
at org.apache.solr.common.cloud.SolrZkClient.setData(SolrZkClient.java:385)
at org.apache.solr.common.cloud.SolrZkClient.setData(SolrZkClient.java:411)
at org.apache.solr.cloud.ZkController.uploadToZK(ZkController.java:520)
at org.apache.solr.cloud.ZkControllerTest.testUploadToCloud(ZkControllerTest.java:192)
at org.apache.lucene.util.LuceneTestCase$LuceneTestCaseRunner.runChild(LuceneTestCase.java:921)
at org.apache.lucene.util.LuceneTestCase$LuceneTestCaseRunner.runChild(LuceneTestCase.java:859)




Build Log (for compile errors):
[...truncated 10073 lines...]



---------------------------------------------------------------------
To unsubscribe, e-mail: dev-unsubscribe@lucene.apache.org
For additional commands, e-mail: dev-help@lucene.apache.org

Search Discussions

  • Apache Hudson Server at Nov 20, 2010 at 10:36 am
    Build: https://hudson.apache.org/hudson/job/Lucene-Solr-tests-only-trunk/1633/

    27 tests failed.
    REGRESSION: org.apache.solr.client.solrj.TestLBHttpSolrServer.testReliability

    Error Message:
    No live SolrServers available to handle this request

    Stack Trace:
    org.apache.solr.client.solrj.SolrServerException: No live SolrServers available to handle this request
    at org.apache.solr.client.solrj.impl.LBHttpSolrServer.request(LBHttpSolrServer.java:442)
    at org.apache.solr.client.solrj.request.QueryRequest.process(QueryRequest.java:89)
    at org.apache.solr.client.solrj.SolrServer.query(SolrServer.java:119)
    at org.apache.solr.client.solrj.TestLBHttpSolrServer.waitForServer(TestLBHttpSolrServer.java:188)
    at org.apache.solr.client.solrj.TestLBHttpSolrServer.testReliability(TestLBHttpSolrServer.java:181)
    at org.apache.lucene.util.LuceneTestCase$LuceneTestCaseRunner.runChild(LuceneTestCase.java:921)
    at org.apache.lucene.util.LuceneTestCase$LuceneTestCaseRunner.runChild(LuceneTestCase.java:859)
    Caused by: org.apache.solr.client.solrj.SolrServerException: java.net.SocketTimeoutException: Read timed out
    at org.apache.solr.client.solrj.impl.CommonsHttpSolrServer.request(CommonsHttpSolrServer.java:483)
    at org.apache.solr.client.solrj.impl.CommonsHttpSolrServer.request(CommonsHttpSolrServer.java:244)
    at org.apache.solr.client.solrj.impl.LBHttpSolrServer.request(LBHttpSolrServer.java:418)
    Caused by: java.net.SocketTimeoutException: Read timed out
    at java.net.SocketInputStream.socketRead0(Native Method)
    at java.net.SocketInputStream.read(SocketInputStream.java:146)
    at java.io.BufferedInputStream.fill(BufferedInputStream.java:235)
    at java.io.BufferedInputStream.read(BufferedInputStream.java:254)
    at org.apache.commons.httpclient.HttpParser.readRawLine(HttpParser.java:78)
    at org.apache.commons.httpclient.HttpParser.readLine(HttpParser.java:106)
    at org.apache.commons.httpclient.HttpConnection.readLine(HttpConnection.java:1116)
    at org.apache.commons.httpclient.MultiThreadedHttpConnectionManager$HttpConnectionAdapter.readLine(MultiThreadedHttpConnectionManager.java:1413)
    at org.apache.commons.httpclient.HttpMethodBase.readStatusLine(HttpMethodBase.java:1973)
    at org.apache.commons.httpclient.HttpMethodBase.readResponse(HttpMethodBase.java:1735)
    at org.apache.commons.httpclient.HttpMethodBase.execute(HttpMethodBase.java:1098)
    at org.apache.commons.httpclient.HttpMethodDirector.executeWithRetry(HttpMethodDirector.java:398)
    at org.apache.commons.httpclient.HttpMethodDirector.executeMethod(HttpMethodDirector.java:171)
    at org.apache.commons.httpclient.HttpClient.executeMethod(HttpClient.java:397)
    at org.apache.commons.httpclient.HttpClient.executeMethod(HttpClient.java:323)
    at org.apache.solr.client.solrj.impl.CommonsHttpSolrServer.request(CommonsHttpSolrServer.java:427)


    FAILED: junit.framework.TestSuite.org.apache.solr.cloud.BasicZkTest

    Error Message:
    Could not connect to ZooKeeper 127.0.0.1:36750 within 30000 ms

    Stack Trace:
    java.util.concurrent.TimeoutException: Could not connect to ZooKeeper 127.0.0.1:36750 within 30000 ms
    at org.apache.solr.common.cloud.ConnectionManager.waitForConnected(ConnectionManager.java:124)
    at org.apache.solr.common.cloud.SolrZkClient.(SolrZkClient.java:85)
    at org.apache.solr.common.cloud.SolrZkClient.(AbstractZkTestCase.java:70)
    at org.apache.solr.cloud.AbstractZkTestCase.azt_beforeClass(AbstractZkTestCase.java:61)


    REGRESSION: org.apache.solr.cloud.ZkControllerTest.testReadShards

    Error Message:
    KeeperErrorCode = ConnectionLoss for /solr

    Stack Trace:
    org.apache.zookeeper.KeeperException$ConnectionLossException: KeeperErrorCode = ConnectionLoss for /solr
    at org.apache.zookeeper.KeeperException.create(KeeperException.java:90)
    at org.apache.zookeeper.KeeperException.create(KeeperException.java:42)
    at org.apache.zookeeper.ZooKeeper.create(ZooKeeper.java:637)
    at org.apache.solr.common.cloud.SolrZkClient.makePath(SolrZkClient.java:348)
    at org.apache.solr.common.cloud.SolrZkClient.makePath(SolrZkClient.java:309)
    at org.apache.solr.common.cloud.SolrZkClient.makePath(SolrZkClient.java:291)
    at org.apache.solr.common.cloud.SolrZkClient.makePath(SolrZkClient.java:256)
    at org.apache.solr.cloud.AbstractZkTestCase.makeSolrZkNode(AbstractZkTestCase.java:126)
    at org.apache.solr.cloud.ZkControllerTest.testReadShards(ZkControllerTest.java:76)
    at org.apache.lucene.util.LuceneTestCase$LuceneTestCaseRunner.runChild(LuceneTestCase.java:921)
    at org.apache.lucene.util.LuceneTestCase$LuceneTestCaseRunner.runChild(LuceneTestCase.java:859)


    REGRESSION: org.apache.solr.cloud.ZkSolrClientTest.testConnect

    Error Message:
    Could not connect to ZooKeeper 127.0.0.1:36550/solr within 30000 ms

    Stack Trace:
    java.util.concurrent.TimeoutException: Could not connect to ZooKeeper 127.0.0.1:36550/solr within 30000 ms
    at org.apache.solr.common.cloud.ConnectionManager.waitForConnected(ConnectionManager.java:124)
    at org.apache.solr.common.cloud.SolrZkClient.(SolrZkClient.java:85)
    at org.apache.solr.common.cloud.SolrZkClient.(ZkSolrClientTest.java:43)
    at org.apache.lucene.util.LuceneTestCase$LuceneTestCaseRunner.runChild(LuceneTestCase.java:921)
    at org.apache.lucene.util.LuceneTestCase$LuceneTestCaseRunner.runChild(LuceneTestCase.java:859)


    FAILED: junit.framework.TestSuite.org.apache.solr.core.AlternateDirectoryTest

    Error Message:
    org.apache.solr.common.cloud.ZooKeeperException:

    Stack Trace:
    java.lang.RuntimeException: org.apache.solr.common.cloud.ZooKeeperException:
    at org.apache.solr.util.TestHarness.(TestHarness.java:134)
    at org.apache.solr.util.TestHarness.(SolrTestCaseJ4.java:247)
    at org.apache.solr.SolrTestCaseJ4.initCore(SolrTestCaseJ4.java:110)
    at org.apache.solr.SolrTestCaseJ4.initCore(SolrTestCaseJ4.java:98)
    at org.apache.solr.core.AlternateDirectoryTest.beforeClass(AlternateDirectoryTest.java:32)
    Caused by: org.apache.solr.common.cloud.ZooKeeperException:
    at org.apache.solr.core.CoreContainer.register(CoreContainer.java:530)
    at org.apache.solr.util.TestHarness$Initializer.initialize(TestHarness.java:191)
    at org.apache.solr.util.TestHarness.<init>(TestHarness.java:139)
    Caused by: org.apache.zookeeper.KeeperException$ConnectionLossException: KeeperErrorCode = ConnectionLoss for /collections
    at org.apache.zookeeper.KeeperException.create(KeeperException.java:90)
    at org.apache.zookeeper.KeeperException.create(KeeperException.java:42)
    at org.apache.zookeeper.ZooKeeper.setData(ZooKeeper.java:1038)
    at org.apache.solr.common.cloud.SolrZkClient.setData(SolrZkClient.java:225)
    at org.apache.solr.common.cloud.SolrZkClient.makePath(SolrZkClient.java:355)
    at org.apache.solr.common.cloud.SolrZkClient.makePath(SolrZkClient.java:309)
    at org.apache.solr.common.cloud.SolrZkClient.makePath(SolrZkClient.java:291)
    at org.apache.solr.common.cloud.SolrZkClient.makePath(SolrZkClient.java:256)
    at org.apache.solr.common.cloud.SolrZkClient.setData(SolrZkClient.java:385)
    at org.apache.solr.cloud.ZkController.addZkShardsNode(ZkController.java:159)
    at org.apache.solr.cloud.ZkController.register(ZkController.java:481)
    at org.apache.solr.core.CoreContainer.register(CoreContainer.java:521)


    FAILED: junit.framework.TestSuite.org.apache.solr.core.AlternateDirectoryTest

    Error Message:
    ERROR: SolrIndexSearcher opens=1 closes=0

    Stack Trace:
    junit.framework.AssertionFailedError: ERROR: SolrIndexSearcher opens=1 closes=0
    at org.apache.solr.SolrTestCaseJ4.endTrackingSearchers(SolrTestCaseJ4.java:128)
    at org.apache.solr.SolrTestCaseJ4.deleteCore(SolrTestCaseJ4.java:302)
    at org.apache.solr.SolrTestCaseJ4.afterClassSolrTestCase(SolrTestCaseJ4.java:79)


    REGRESSION: org.apache.solr.core.TestPropInject.testMergePolicy

    Error Message:
    org.apache.solr.common.cloud.ZooKeeperException:

    Stack Trace:
    java.lang.RuntimeException: org.apache.solr.common.cloud.ZooKeeperException:
    at org.apache.solr.util.TestHarness.(TestHarness.java:134)
    at org.apache.solr.util.TestHarness.(AbstractSolrTestCase.java:121)
    at org.apache.lucene.util.LuceneTestCase$LuceneTestCaseRunner.runChild(LuceneTestCase.java:921)
    at org.apache.lucene.util.LuceneTestCase$LuceneTestCaseRunner.runChild(LuceneTestCase.java:859)
    Caused by: org.apache.solr.common.cloud.ZooKeeperException:
    at org.apache.solr.core.CoreContainer.initZooKeeper(CoreContainer.java:178)
    at org.apache.solr.util.TestHarness$Initializer$1.(TestHarness.java:178)
    at org.apache.solr.util.TestHarness.<init>(TestHarness.java:139)
    Caused by: java.util.concurrent.TimeoutException: Could not connect to ZooKeeper 127.0.0.1:36622/solr within 5000 ms
    at org.apache.solr.common.cloud.ConnectionManager.waitForConnected(ConnectionManager.java:124)
    at org.apache.solr.common.cloud.SolrZkClient.(SolrZkClient.java:69)
    at org.apache.solr.cloud.ZkController.(CoreContainer.java:159)


    REGRESSION: org.apache.solr.core.TestPropInject.testProps

    Error Message:
    org.apache.solr.common.cloud.ZooKeeperException:

    Stack Trace:
    java.lang.RuntimeException: org.apache.solr.common.cloud.ZooKeeperException:
    at org.apache.solr.util.TestHarness.(TestHarness.java:134)
    at org.apache.solr.util.TestHarness.(AbstractSolrTestCase.java:121)
    at org.apache.lucene.util.LuceneTestCase$LuceneTestCaseRunner.runChild(LuceneTestCase.java:921)
    at org.apache.lucene.util.LuceneTestCase$LuceneTestCaseRunner.runChild(LuceneTestCase.java:859)
    Caused by: org.apache.solr.common.cloud.ZooKeeperException:
    at org.apache.solr.core.CoreContainer.initZooKeeper(CoreContainer.java:178)
    at org.apache.solr.util.TestHarness$Initializer$1.(TestHarness.java:178)
    at org.apache.solr.util.TestHarness.<init>(TestHarness.java:139)
    Caused by: java.util.concurrent.TimeoutException: Could not connect to ZooKeeper 127.0.0.1:36622/solr within 5000 ms
    at org.apache.solr.common.cloud.ConnectionManager.waitForConnected(ConnectionManager.java:124)
    at org.apache.solr.common.cloud.SolrZkClient.(SolrZkClient.java:69)
    at org.apache.solr.cloud.ZkController.(CoreContainer.java:159)


    REGRESSION: org.apache.solr.handler.TestReplicationHandler.testReplicateAfterWrite2Slave

    Error Message:
    Error executing query

    Stack Trace:
    org.apache.solr.client.solrj.SolrServerException: Error executing query
    at org.apache.solr.client.solrj.request.QueryRequest.process(QueryRequest.java:95)
    at org.apache.solr.client.solrj.SolrServer.query(SolrServer.java:119)
    at org.apache.solr.handler.TestReplicationHandler.query(TestReplicationHandler.java:142)
    at org.apache.solr.handler.TestReplicationHandler.clearIndexWithReplication(TestReplicationHandler.java:85)
    at org.apache.solr.handler.TestReplicationHandler.testReplicateAfterWrite2Slave(TestReplicationHandler.java:165)
    at org.apache.lucene.util.LuceneTestCase$LuceneTestCaseRunner.runChild(LuceneTestCase.java:921)
    at org.apache.lucene.util.LuceneTestCase$LuceneTestCaseRunner.runChild(LuceneTestCase.java:859)


    request: http://localhost:36769/solr/select?q=*:*&wt=javabin&version=2
    at org.apache.solr.client.solrj.impl.CommonsHttpSolrServer.request(CommonsHttpSolrServer.java:435)
    at org.apache.solr.client.solrj.impl.CommonsHttpSolrServer.request(CommonsHttpSolrServer.java:244)
    at org.apache.solr.client.solrj.request.QueryRequest.process(QueryRequest.java:89)


    REGRESSION: org.apache.solr.handler.TestReplicationHandler.testIndexAndConfigReplication

    Error Message:
    Error executing query

    Stack Trace:
    org.apache.solr.client.solrj.SolrServerException: Error executing query
    at org.apache.solr.client.solrj.request.QueryRequest.process(QueryRequest.java:95)
    at org.apache.solr.client.solrj.SolrServer.query(SolrServer.java:119)
    at org.apache.solr.handler.TestReplicationHandler.query(TestReplicationHandler.java:142)
    at org.apache.solr.handler.TestReplicationHandler.clearIndexWithReplication(TestReplicationHandler.java:85)
    at org.apache.solr.handler.TestReplicationHandler.testIndexAndConfigReplication(TestReplicationHandler.java:230)
    at org.apache.lucene.util.LuceneTestCase$LuceneTestCaseRunner.runChild(LuceneTestCase.java:921)
    at org.apache.lucene.util.LuceneTestCase$LuceneTestCaseRunner.runChild(LuceneTestCase.java:859)


    request: http://localhost:36769/solr/select?q=*:*&wt=javabin&version=2
    at org.apache.solr.client.solrj.impl.CommonsHttpSolrServer.request(CommonsHttpSolrServer.java:435)
    at org.apache.solr.client.solrj.impl.CommonsHttpSolrServer.request(CommonsHttpSolrServer.java:244)
    at org.apache.solr.client.solrj.request.QueryRequest.process(QueryRequest.java:89)


    REGRESSION: org.apache.solr.handler.TestReplicationHandler.testStopPoll

    Error Message:
    Error executing query

    Stack Trace:
    org.apache.solr.client.solrj.SolrServerException: Error executing query
    at org.apache.solr.client.solrj.request.QueryRequest.process(QueryRequest.java:95)
    at org.apache.solr.client.solrj.SolrServer.query(SolrServer.java:119)
    at org.apache.solr.handler.TestReplicationHandler.query(TestReplicationHandler.java:142)
    at org.apache.solr.handler.TestReplicationHandler.clearIndexWithReplication(TestReplicationHandler.java:85)
    at org.apache.solr.handler.TestReplicationHandler.testStopPoll(TestReplicationHandler.java:285)
    at org.apache.lucene.util.LuceneTestCase$LuceneTestCaseRunner.runChild(LuceneTestCase.java:921)
    at org.apache.lucene.util.LuceneTestCase$LuceneTestCaseRunner.runChild(LuceneTestCase.java:859)


    request: http://localhost:36769/solr/select?q=*:*&wt=javabin&version=2
    at org.apache.solr.client.solrj.impl.CommonsHttpSolrServer.request(CommonsHttpSolrServer.java:435)
    at org.apache.solr.client.solrj.impl.CommonsHttpSolrServer.request(CommonsHttpSolrServer.java:244)
    at org.apache.solr.client.solrj.request.QueryRequest.process(QueryRequest.java:89)


    REGRESSION: org.apache.solr.handler.TestReplicationHandler.testSnapPullWithMasterUrl

    Error Message:
    Severe errors in solr configuration. Check your log files for more detailed information on what may be wrong. ------------------------------------------------------------- org.apache.solr.common.cloud.ZooKeeperException: Could not find config name for collection:collection1 at org.apache.solr.core.CoreContainer.create(CoreContainer.java:594) at org.apache.solr.core.CoreContainer.load(CoreContainer.java:412) at org.apache.solr.core.CoreContainer$Initializer.initialize(CoreContainer.java:246) at org.apache.solr.servlet.SolrDispatchFilter.init(SolrDispatchFilter.java:86) at org.mortbay.jetty.servlet.FilterHolder.doStart(FilterHolder.java:97) at org.mortbay.component.AbstractLifeCycle.start(AbstractLifeCycle.java:50) at org.mortbay.jetty.servlet.ServletHandler.initialize(ServletHandler.java:662) at org.mortbay.jetty.servlet.ServletHandler.updateMappings(ServletHandler.java:1053) at org.mortbay.jetty.servlet.ServletHandler.setFilterMappings(ServletHandler.java:1089) at org.mortbay.jetty.servlet.ServletHandler.addFilterWithMapping(ServletHandler.java:889) at org.mortbay.jetty.servlet.ServletHandler.addFilterWithMapping(ServletHandler.java:844) at org.mortbay.jetty.servlet.Context.addFilter(Context.java:207) at org.apache.solr.client.solrj.embedded.JettySolrRunner$1.lifeCycleStarted(JettySolrRunner.java:97) at org.mortbay.component.AbstractLifeCycle.setStarted(AbstractLifeCycle.java:140) at org.mortbay.component.AbstractLifeCycle.start(AbstractLifeCycle.java:52) at org.apache.solr.client.solrj.embedded.JettySolrRunner.start(JettySolrRunner.java:122) at org.apache.solr.client.solrj.embedded.JettySolrRunner.start(JettySolrRunner.java:117) at org.apache.solr.handler.TestReplicationHandler.createJetty(TestReplicationHandler.java:110) at org.apache.solr.handler.TestReplicationHandler.beforeClass(TestReplicationHandler.java:75) at sun.reflect.NativeMethodAccessorImpl.invoke0(Native Method) at sun.reflect.NativeMethodAccessorImpl.invoke(NativeMethodAccessorImpl.java:57) at sun.reflect.DelegatingMethodAc Severe errors in solr configuration. Check your log files for more detailed information on what may be wrong. ------------------------------------------------------------- org.apache.solr.common.cloud.ZooKeeperException: Could not find config name for collection:collection1 at org.apache.solr.core.CoreContainer.create(CoreContainer.java:594) at org.apache.solr.core.CoreContainer.load(CoreContainer.java:412) at org.apache.solr.core.CoreContainer$Initializer.initialize(CoreContainer.java:246) at org.apache.solr.servlet.SolrDispatchFilter.init(SolrDispatchFilter.java:86) at org.mortbay.jetty.servlet.FilterHolder.doStart(FilterHolder.java:97) at org.mortbay.component.AbstractLifeCycle.start(AbstractLifeCycle.java:50) at org.mortbay.jetty.servlet.ServletHandler.initialize(ServletHandler.java:662) at org.mortbay.jetty.servlet.ServletHandler.updateMappings(ServletHandler.java:1053) at org.mortbay.jetty.servlet.ServletHandler.setFilterMappings(ServletHandler.java:1089) at org.mortbay.jetty.servlet.ServletHandler.addFilterWithMapping(ServletHandler.java:889) at org.mortbay.jetty.servlet.ServletHandler.addFilterWithMapping(ServletHandler.java:844) at org.mortbay.jetty.servlet.Context.addFilter(Context.java:207) at org.apache.solr.client.solrj.embedded.JettySolrRunner$1.lifeCycleStarted(JettySolrRunner.java:97) at org.mortbay.component.AbstractLifeCycle.setStarted(AbstractLifeCycle.java:140) at org.mortbay.component.AbstractLifeCycle.start(AbstractLifeCycle.java:52) at org.apache.solr.client.solrj.embedded.JettySolrRunner.start(JettySolrRunner.java:122) at org.apache.solr.client.solrj.embedded.JettySolrRunner.start(JettySolrRunner.java:117) at org.apache.solr.handler.TestReplicationHandler.createJetty(TestReplicationHandler.java:110) at org.apache.solr.handler.TestReplicationHandler.beforeClass(TestReplicationHandler.java:75) at sun.reflect.NativeMethodAccessorImpl.invoke0(Native Method) at sun.reflect.NativeMethodAccessorImpl.invoke(NativeMethodAccessorImpl.java:57) at sun.reflect.DelegatingMethodAc request: http://localhost:36769/solr/update?wt=javabin&version=2

    Stack Trace:


    request: http://localhost:36769/solr/update?wt=javabin&version=2
    at org.apache.solr.client.solrj.impl.CommonsHttpSolrServer.request(CommonsHttpSolrServer.java:435)
    at org.apache.solr.client.solrj.impl.CommonsHttpSolrServer.request(CommonsHttpSolrServer.java:244)
    at org.apache.solr.client.solrj.request.AbstractUpdateRequest.process(AbstractUpdateRequest.java:105)
    at org.apache.solr.client.solrj.SolrServer.deleteByQuery(SolrServer.java:111)
    at org.apache.solr.handler.TestReplicationHandler.testSnapPullWithMasterUrl(TestReplicationHandler.java:360)
    at org.apache.lucene.util.LuceneTestCase$LuceneTestCaseRunner.runChild(LuceneTestCase.java:921)
    at org.apache.lucene.util.LuceneTestCase$LuceneTestCaseRunner.runChild(LuceneTestCase.java:859)


    REGRESSION: org.apache.solr.handler.TestReplicationHandler.testReplicateAfterStartup

    Error Message:
    Severe errors in solr configuration. Check your log files for more detailed information on what may be wrong. ------------------------------------------------------------- org.apache.solr.common.cloud.ZooKeeperException: Could not find config name for collection:collection1 at org.apache.solr.core.CoreContainer.create(CoreContainer.java:594) at org.apache.solr.core.CoreContainer.load(CoreContainer.java:412) at org.apache.solr.core.CoreContainer$Initializer.initialize(CoreContainer.java:246) at org.apache.solr.servlet.SolrDispatchFilter.init(SolrDispatchFilter.java:86) at org.mortbay.jetty.servlet.FilterHolder.doStart(FilterHolder.java:97) at org.mortbay.component.AbstractLifeCycle.start(AbstractLifeCycle.java:50) at org.mortbay.jetty.servlet.ServletHandler.initialize(ServletHandler.java:662) at org.mortbay.jetty.servlet.ServletHandler.updateMappings(ServletHandler.java:1053) at org.mortbay.jetty.servlet.ServletHandler.setFilterMappings(ServletHandler.java:1089) at org.mortbay.jetty.servlet.ServletHandler.addFilterWithMapping(ServletHandler.java:889) at org.mortbay.jetty.servlet.ServletHandler.addFilterWithMapping(ServletHandler.java:844) at org.mortbay.jetty.servlet.Context.addFilter(Context.java:207) at org.apache.solr.client.solrj.embedded.JettySolrRunner$1.lifeCycleStarted(JettySolrRunner.java:97) at org.mortbay.component.AbstractLifeCycle.setStarted(AbstractLifeCycle.java:140) at org.mortbay.component.AbstractLifeCycle.start(AbstractLifeCycle.java:52) at org.apache.solr.client.solrj.embedded.JettySolrRunner.start(JettySolrRunner.java:122) at org.apache.solr.client.solrj.embedded.JettySolrRunner.start(JettySolrRunner.java:117) at org.apache.solr.handler.TestReplicationHandler.createJetty(TestReplicationHandler.java:110) at org.apache.solr.handler.TestReplicationHandler.beforeClass(TestReplicationHandler.java:75) at sun.reflect.NativeMethodAccessorImpl.invoke0(Native Method) at sun.reflect.NativeMethodAccessorImpl.invoke(NativeMethodAccessorImpl.java:57) at sun.reflect.DelegatingMethodAc Severe errors in solr configuration. Check your log files for more detailed information on what may be wrong. ------------------------------------------------------------- org.apache.solr.common.cloud.ZooKeeperException: Could not find config name for collection:collection1 at org.apache.solr.core.CoreContainer.create(CoreContainer.java:594) at org.apache.solr.core.CoreContainer.load(CoreContainer.java:412) at org.apache.solr.core.CoreContainer$Initializer.initialize(CoreContainer.java:246) at org.apache.solr.servlet.SolrDispatchFilter.init(SolrDispatchFilter.java:86) at org.mortbay.jetty.servlet.FilterHolder.doStart(FilterHolder.java:97) at org.mortbay.component.AbstractLifeCycle.start(AbstractLifeCycle.java:50) at org.mortbay.jetty.servlet.ServletHandler.initialize(ServletHandler.java:662) at org.mortbay.jetty.servlet.ServletHandler.updateMappings(ServletHandler.java:1053) at org.mortbay.jetty.servlet.ServletHandler.setFilterMappings(ServletHandler.java:1089) at org.mortbay.jetty.servlet.ServletHandler.addFilterWithMapping(ServletHandler.java:889) at org.mortbay.jetty.servlet.ServletHandler.addFilterWithMapping(ServletHandler.java:844) at org.mortbay.jetty.servlet.Context.addFilter(Context.java:207) at org.apache.solr.client.solrj.embedded.JettySolrRunner$1.lifeCycleStarted(JettySolrRunner.java:97) at org.mortbay.component.AbstractLifeCycle.setStarted(AbstractLifeCycle.java:140) at org.mortbay.component.AbstractLifeCycle.start(AbstractLifeCycle.java:52) at org.apache.solr.client.solrj.embedded.JettySolrRunner.start(JettySolrRunner.java:122) at org.apache.solr.client.solrj.embedded.JettySolrRunner.start(JettySolrRunner.java:117) at org.apache.solr.handler.TestReplicationHandler.createJetty(TestReplicationHandler.java:110) at org.apache.solr.handler.TestReplicationHandler.beforeClass(TestReplicationHandler.java:75) at sun.reflect.NativeMethodAccessorImpl.invoke0(Native Method) at sun.reflect.NativeMethodAccessorImpl.invoke(NativeMethodAccessorImpl.java:57) at sun.reflect.DelegatingMethodAc request: http://localhost:36769/solr/update?wt=javabin&version=2

    Stack Trace:


    request: http://localhost:36769/solr/update?wt=javabin&version=2
    at org.apache.solr.client.solrj.impl.CommonsHttpSolrServer.request(CommonsHttpSolrServer.java:435)
    at org.apache.solr.client.solrj.impl.CommonsHttpSolrServer.request(CommonsHttpSolrServer.java:244)
    at org.apache.solr.client.solrj.request.AbstractUpdateRequest.process(AbstractUpdateRequest.java:105)
    at org.apache.solr.client.solrj.SolrServer.deleteByQuery(SolrServer.java:111)
    at org.apache.solr.handler.TestReplicationHandler.testReplicateAfterStartup(TestReplicationHandler.java:405)
    at org.apache.lucene.util.LuceneTestCase$LuceneTestCaseRunner.runChild(LuceneTestCase.java:921)
    at org.apache.lucene.util.LuceneTestCase$LuceneTestCaseRunner.runChild(LuceneTestCase.java:859)


    REGRESSION: org.apache.solr.handler.TestReplicationHandler.testIndexAndConfigAliasReplication

    Error Message:
    Error executing query

    Stack Trace:
    org.apache.solr.client.solrj.SolrServerException: Error executing query
    at org.apache.solr.client.solrj.request.QueryRequest.process(QueryRequest.java:95)
    at org.apache.solr.client.solrj.SolrServer.query(SolrServer.java:119)
    at org.apache.solr.handler.TestReplicationHandler.query(TestReplicationHandler.java:142)
    at org.apache.solr.handler.TestReplicationHandler.clearIndexWithReplication(TestReplicationHandler.java:85)
    at org.apache.solr.handler.TestReplicationHandler.testIndexAndConfigAliasReplication(TestReplicationHandler.java:455)
    at org.apache.lucene.util.LuceneTestCase$LuceneTestCaseRunner.runChild(LuceneTestCase.java:921)
    at org.apache.lucene.util.LuceneTestCase$LuceneTestCaseRunner.runChild(LuceneTestCase.java:859)


    request: http://localhost:36769/solr/select?q=*:*&wt=javabin&version=2
    at org.apache.solr.client.solrj.impl.CommonsHttpSolrServer.request(CommonsHttpSolrServer.java:435)
    at org.apache.solr.client.solrj.impl.CommonsHttpSolrServer.request(CommonsHttpSolrServer.java:244)
    at org.apache.solr.client.solrj.request.QueryRequest.process(QueryRequest.java:89)


    REGRESSION: org.apache.solr.handler.TestReplicationHandler.testBackup

    Error Message:
    Severe errors in solr configuration. Check your log files for more detailed information on what may be wrong. ------------------------------------------------------------- org.apache.solr.common.cloud.ZooKeeperException: Could not find config name for collection:collection1 at org.apache.solr.core.CoreContainer.create(CoreContainer.java:594) at org.apache.solr.core.CoreContainer.load(CoreContainer.java:412) at org.apache.solr.core.CoreContainer$Initializer.initialize(CoreContainer.java:246) at org.apache.solr.servlet.SolrDispatchFilter.init(SolrDispatchFilter.java:86) at org.mortbay.jetty.servlet.FilterHolder.doStart(FilterHolder.java:97) at org.mortbay.component.AbstractLifeCycle.start(AbstractLifeCycle.java:50) at org.mortbay.jetty.servlet.ServletHandler.initialize(ServletHandler.java:662) at org.mortbay.jetty.servlet.ServletHandler.updateMappings(ServletHandler.java:1053) at org.mortbay.jetty.servlet.ServletHandler.setFilterMappings(ServletHandler.java:1089) at org.mortbay.jetty.servlet.ServletHandler.addFilterWithMapping(ServletHandler.java:889) at org.mortbay.jetty.servlet.ServletHandler.addFilterWithMapping(ServletHandler.java:844) at org.mortbay.jetty.servlet.Context.addFilter(Context.java:207) at org.apache.solr.client.solrj.embedded.JettySolrRunner$1.lifeCycleStarted(JettySolrRunner.java:97) at org.mortbay.component.AbstractLifeCycle.setStarted(AbstractLifeCycle.java:140) at org.mortbay.component.AbstractLifeCycle.start(AbstractLifeCycle.java:52) at org.apache.solr.client.solrj.embedded.JettySolrRunner.start(JettySolrRunner.java:122) at org.apache.solr.client.solrj.embedded.JettySolrRunner.start(JettySolrRunner.java:117) at org.apache.solr.handler.TestReplicationHandler.createJetty(TestReplicationHandler.java:110) at org.apache.solr.handler.TestReplicationHandler.testSnapPullWithMasterUrl(TestReplicationHandler.java:357) at sun.reflect.NativeMethodAccessorImpl.invoke0(Native Method) at sun.reflect.NativeMethodAccessorImpl.invoke(NativeMethodAccessorImpl.java:57) at sun.reflect.Del Severe errors in solr configuration. Check your log files for more detailed information on what may be wrong. ------------------------------------------------------------- org.apache.solr.common.cloud.ZooKeeperException: Could not find config name for collection:collection1 at org.apache.solr.core.CoreContainer.create(CoreContainer.java:594) at org.apache.solr.core.CoreContainer.load(CoreContainer.java:412) at org.apache.solr.core.CoreContainer$Initializer.initialize(CoreContainer.java:246) at org.apache.solr.servlet.SolrDispatchFilter.init(SolrDispatchFilter.java:86) at org.mortbay.jetty.servlet.FilterHolder.doStart(FilterHolder.java:97) at org.mortbay.component.AbstractLifeCycle.start(AbstractLifeCycle.java:50) at org.mortbay.jetty.servlet.ServletHandler.initialize(ServletHandler.java:662) at org.mortbay.jetty.servlet.ServletHandler.updateMappings(ServletHandler.java:1053) at org.mortbay.jetty.servlet.ServletHandler.setFilterMappings(ServletHandler.java:1089) at org.mortbay.jetty.servlet.ServletHandler.addFilterWithMapping(ServletHandler.java:889) at org.mortbay.jetty.servlet.ServletHandler.addFilterWithMapping(ServletHandler.java:844) at org.mortbay.jetty.servlet.Context.addFilter(Context.java:207) at org.apache.solr.client.solrj.embedded.JettySolrRunner$1.lifeCycleStarted(JettySolrRunner.java:97) at org.mortbay.component.AbstractLifeCycle.setStarted(AbstractLifeCycle.java:140) at org.mortbay.component.AbstractLifeCycle.start(AbstractLifeCycle.java:52) at org.apache.solr.client.solrj.embedded.JettySolrRunner.start(JettySolrRunner.java:122) at org.apache.solr.client.solrj.embedded.JettySolrRunner.start(JettySolrRunner.java:117) at org.apache.solr.handler.TestReplicationHandler.createJetty(TestReplicationHandler.java:110) at org.apache.solr.handler.TestReplicationHandler.testSnapPullWithMasterUrl(TestReplicationHandler.java:357) at sun.reflect.NativeMethodAccessorImpl.invoke0(Native Method) at sun.reflect.NativeMethodAccessorImpl.invoke(NativeMethodAccessorImpl.java:57) at sun.reflect.Del request: http://localhost:36797/solr/update?wt=javabin&version=2

    Stack Trace:


    request: http://localhost:36797/solr/update?wt=javabin&version=2
    at org.apache.solr.client.solrj.impl.CommonsHttpSolrServer.request(CommonsHttpSolrServer.java:435)
    at org.apache.solr.client.solrj.impl.CommonsHttpSolrServer.request(CommonsHttpSolrServer.java:244)
    at org.apache.solr.client.solrj.request.AbstractUpdateRequest.process(AbstractUpdateRequest.java:105)
    at org.apache.solr.client.solrj.SolrServer.deleteByQuery(SolrServer.java:111)
    at org.apache.solr.handler.TestReplicationHandler.testBackup(TestReplicationHandler.java:535)
    at org.apache.lucene.util.LuceneTestCase$LuceneTestCaseRunner.runChild(LuceneTestCase.java:921)
    at org.apache.lucene.util.LuceneTestCase$LuceneTestCaseRunner.runChild(LuceneTestCase.java:859)


    FAILED: junit.framework.TestSuite.org.apache.solr.handler.TestReplicationHandler

    Error Message:
    ERROR: SolrIndexSearcher opens=1 closes=0

    Stack Trace:
    junit.framework.AssertionFailedError: ERROR: SolrIndexSearcher opens=1 closes=0
    at org.apache.solr.SolrTestCaseJ4.endTrackingSearchers(SolrTestCaseJ4.java:128)
    at org.apache.solr.SolrTestCaseJ4.deleteCore(SolrTestCaseJ4.java:302)
    at org.apache.solr.SolrTestCaseJ4.afterClassSolrTestCase(SolrTestCaseJ4.java:79)


    FAILED: junit.framework.TestSuite.org.apache.solr.handler.component.QueryElevationComponentTest

    Error Message:
    org.apache.solr.common.cloud.ZooKeeperException:

    Stack Trace:
    java.lang.RuntimeException: org.apache.solr.common.cloud.ZooKeeperException:
    at org.apache.solr.util.TestHarness.(TestHarness.java:134)
    at org.apache.solr.util.TestHarness.(SolrTestCaseJ4.java:247)
    at org.apache.solr.SolrTestCaseJ4.initCore(SolrTestCaseJ4.java:110)
    at org.apache.solr.SolrTestCaseJ4.initCore(SolrTestCaseJ4.java:98)
    at org.apache.solr.handler.component.QueryElevationComponentTest.beforeClass(QueryElevationComponentTest.java:50)
    Caused by: org.apache.solr.common.cloud.ZooKeeperException:
    at org.apache.solr.cloud.ZkController.init(ZkController.java:280)
    at org.apache.solr.cloud.ZkController.(CoreContainer.java:159)
    at org.apache.solr.util.TestHarness$Initializer$1.(TestHarness.java:178)
    at org.apache.solr.util.TestHarness.<init>(TestHarness.java:139)
    Caused by: org.apache.zookeeper.KeeperException$ConnectionLossException: KeeperErrorCode = ConnectionLoss for /live_nodes
    at org.apache.zookeeper.KeeperException.create(KeeperException.java:90)
    at org.apache.zookeeper.KeeperException.create(KeeperException.java:42)
    at org.apache.zookeeper.ZooKeeper.setData(ZooKeeper.java:1038)
    at org.apache.solr.common.cloud.SolrZkClient.setData(SolrZkClient.java:225)
    at org.apache.solr.common.cloud.SolrZkClient.makePath(SolrZkClient.java:355)
    at org.apache.solr.common.cloud.SolrZkClient.makePath(SolrZkClient.java:309)
    at org.apache.solr.common.cloud.SolrZkClient.makePath(SolrZkClient.java:291)
    at org.apache.solr.common.cloud.SolrZkClient.makePath(SolrZkClient.java:256)
    at org.apache.solr.cloud.ZkController.init(ZkController.java:275)


    REGRESSION: org.apache.solr.request.TestWriterPerf.testPerf

    Error Message:
    org.apache.solr.common.cloud.ZooKeeperException:

    Stack Trace:
    java.lang.RuntimeException: org.apache.solr.common.cloud.ZooKeeperException:
    at org.apache.solr.util.TestHarness.(TestHarness.java:134)
    at org.apache.solr.util.TestHarness.(AbstractSolrTestCase.java:121)
    at org.apache.solr.request.TestWriterPerf.setUp(TestWriterPerf.java:47)
    at org.apache.lucene.util.LuceneTestCase$LuceneTestCaseRunner.runChild(LuceneTestCase.java:921)
    at org.apache.lucene.util.LuceneTestCase$LuceneTestCaseRunner.runChild(LuceneTestCase.java:859)
    Caused by: org.apache.solr.common.cloud.ZooKeeperException:
    at org.apache.solr.core.CoreContainer.initZooKeeper(CoreContainer.java:178)
    at org.apache.solr.util.TestHarness$Initializer$1.(TestHarness.java:178)
    at org.apache.solr.util.TestHarness.<init>(TestHarness.java:139)
    Caused by: java.util.concurrent.TimeoutException: Could not connect to ZooKeeper 127.0.0.1:36622/solr within 5000 ms
    at org.apache.solr.common.cloud.ConnectionManager.waitForConnected(ConnectionManager.java:124)
    at org.apache.solr.common.cloud.SolrZkClient.(SolrZkClient.java:69)
    at org.apache.solr.cloud.ZkController.(CoreContainer.java:159)


    REGRESSION: org.apache.solr.servlet.CacheHeaderTest.testCacheVetoHandler

    Error Message:
    expected:<200> but was:<500>

    Stack Trace:
    junit.framework.AssertionFailedError: expected:<200> but was:(LuceneTestCase.java:921)
    at org.apache.lucene.util.LuceneTestCase$LuceneTestCaseRunner.runChild(LuceneTestCase.java:859)
    at org.apache.solr.servlet.CacheHeaderTest.testCacheVetoHandler(CacheHeaderTest.java:54)


    REGRESSION: org.apache.solr.servlet.CacheHeaderTest.testCacheVetoException

    Error Message:
    We got no Pragma header

    Stack Trace:
    junit.framework.AssertionFailedError: We got no Pragma header
    at org.apache.lucene.util.LuceneTestCase$LuceneTestCaseRunner.runChild(LuceneTestCase.java:921)
    at org.apache.lucene.util.LuceneTestCase$LuceneTestCaseRunner.runChild(LuceneTestCase.java:859)
    at org.apache.solr.servlet.CacheHeaderTest.checkVetoHeaders(CacheHeaderTest.java:77)
    at org.apache.solr.servlet.CacheHeaderTest.testCacheVetoException(CacheHeaderTest.java:66)


    REGRESSION: org.apache.solr.servlet.CacheHeaderTest.testLastModified

    Error Message:
    Unknown request response expected:<0> but was:<500>

    Stack Trace:
    junit.framework.AssertionFailedError: Unknown request response expected:<0> but was:(LuceneTestCase.java:921)
    at org.apache.lucene.util.LuceneTestCase$LuceneTestCaseRunner.runChild(LuceneTestCase.java:859)
    at org.apache.solr.servlet.CacheHeaderTestBase.checkResponseBody(CacheHeaderTestBase.java:91)
    at org.apache.solr.servlet.CacheHeaderTest.doLastModified(CacheHeaderTest.java:95)
    at org.apache.solr.servlet.CacheHeaderTestBase.testLastModified(CacheHeaderTestBase.java:103)


    REGRESSION: org.apache.solr.servlet.CacheHeaderTest.testEtag

    Error Message:
    Unknown request response expected:<0> but was:<500>

    Stack Trace:
    junit.framework.AssertionFailedError: Unknown request response expected:<0> but was:(LuceneTestCase.java:921)
    at org.apache.lucene.util.LuceneTestCase$LuceneTestCaseRunner.runChild(LuceneTestCase.java:859)
    at org.apache.solr.servlet.CacheHeaderTestBase.checkResponseBody(CacheHeaderTestBase.java:91)
    at org.apache.solr.servlet.CacheHeaderTest.doETag(CacheHeaderTest.java:148)
    at org.apache.solr.servlet.CacheHeaderTestBase.testEtag(CacheHeaderTestBase.java:109)


    REGRESSION: org.apache.solr.servlet.CacheHeaderTest.testCacheControl

    Error Message:
    Unknown request response expected:<0> but was:<500>

    Stack Trace:
    junit.framework.AssertionFailedError: Unknown request response expected:<0> but was:(LuceneTestCase.java:921)
    at org.apache.lucene.util.LuceneTestCase$LuceneTestCaseRunner.runChild(LuceneTestCase.java:859)
    at org.apache.solr.servlet.CacheHeaderTestBase.checkResponseBody(CacheHeaderTestBase.java:91)
    at org.apache.solr.servlet.CacheHeaderTest.doCacheControl(CacheHeaderTest.java:230)
    at org.apache.solr.servlet.CacheHeaderTestBase.testCacheControl(CacheHeaderTestBase.java:115)


    REGRESSION: org.apache.solr.update.processor.UpdateRequestProcessorFactoryTest.testConfiguration

    Error Message:
    org.apache.solr.common.cloud.ZooKeeperException:

    Stack Trace:
    java.lang.RuntimeException: org.apache.solr.common.cloud.ZooKeeperException:
    at org.apache.solr.util.TestHarness.(TestHarness.java:134)
    at org.apache.solr.util.TestHarness.(AbstractSolrTestCase.java:121)
    at org.apache.lucene.util.LuceneTestCase$LuceneTestCaseRunner.runChild(LuceneTestCase.java:921)
    at org.apache.lucene.util.LuceneTestCase$LuceneTestCaseRunner.runChild(LuceneTestCase.java:859)
    Caused by: org.apache.solr.common.cloud.ZooKeeperException:
    at org.apache.solr.core.CoreContainer.register(CoreContainer.java:530)
    at org.apache.solr.util.TestHarness$Initializer.initialize(TestHarness.java:191)
    at org.apache.solr.util.TestHarness.<init>(TestHarness.java:139)
    Caused by: org.apache.zookeeper.KeeperException$ConnectionLossException: KeeperErrorCode = ConnectionLoss for /collections/collection1/shards/lucene.zones.apache.org:null_solr_/lucene.zones.apache.org:null_solr_
    at org.apache.zookeeper.KeeperException.create(KeeperException.java:90)
    at org.apache.zookeeper.KeeperException.create(KeeperException.java:42)
    at org.apache.zookeeper.ZooKeeper.setData(ZooKeeper.java:1038)
    at org.apache.solr.common.cloud.SolrZkClient.setData(SolrZkClient.java:225)
    at org.apache.solr.common.cloud.SolrZkClient.makePath(SolrZkClient.java:355)
    at org.apache.solr.common.cloud.SolrZkClient.makePath(SolrZkClient.java:309)
    at org.apache.solr.common.cloud.SolrZkClient.makePath(SolrZkClient.java:291)
    at org.apache.solr.common.cloud.SolrZkClient.makePath(SolrZkClient.java:256)
    at org.apache.solr.common.cloud.SolrZkClient.setData(SolrZkClient.java:385)
    at org.apache.solr.cloud.ZkController.register(ZkController.java:477)
    at org.apache.solr.core.CoreContainer.register(CoreContainer.java:521)


    FAILED: org.apache.solr.cloud.BasicDistributedZkTest.testDistribSearch

    Error Message:
    Could not connect to ZooKeeper 127.0.0.1:36562 within 30000 ms

    Stack Trace:
    java.util.concurrent.TimeoutException: Could not connect to ZooKeeper 127.0.0.1:36562 within 30000 ms
    at org.apache.solr.common.cloud.ConnectionManager.waitForConnected(ConnectionManager.java:124)
    at org.apache.solr.common.cloud.SolrZkClient.(SolrZkClient.java:85)
    at org.apache.solr.common.cloud.SolrZkClient.(AbstractZkTestCase.java:70)
    at org.apache.solr.cloud.AbstractDistributedZkTestCase.setUp(AbstractDistributedZkTestCase.java:47)
    at org.apache.lucene.util.LuceneTestCase$LuceneTestCaseRunner.runChild(LuceneTestCase.java:921)
    at org.apache.lucene.util.LuceneTestCase$LuceneTestCaseRunner.runChild(LuceneTestCase.java:859)


    FAILED: org.apache.solr.cloud.CloudStateUpdateTest.testCoreRegistration

    Error Message:
    KeeperErrorCode = ConnectionLoss for /solr

    Stack Trace:
    org.apache.zookeeper.KeeperException$ConnectionLossException: KeeperErrorCode = ConnectionLoss for /solr
    at org.apache.zookeeper.KeeperException.create(KeeperException.java:90)
    at org.apache.zookeeper.KeeperException.create(KeeperException.java:42)
    at org.apache.zookeeper.ZooKeeper.create(ZooKeeper.java:637)
    at org.apache.solr.common.cloud.SolrZkClient.makePath(SolrZkClient.java:348)
    at org.apache.solr.common.cloud.SolrZkClient.makePath(SolrZkClient.java:309)
    at org.apache.solr.common.cloud.SolrZkClient.makePath(SolrZkClient.java:291)
    at org.apache.solr.common.cloud.SolrZkClient.makePath(SolrZkClient.java:256)
    at org.apache.solr.cloud.AbstractZkTestCase.buildZooKeeper(AbstractZkTestCase.java:71)
    at org.apache.solr.cloud.CloudStateUpdateTest.setUp(CloudStateUpdateTest.java:85)
    at org.apache.lucene.util.LuceneTestCase$LuceneTestCaseRunner.runChild(LuceneTestCase.java:921)
    at org.apache.lucene.util.LuceneTestCase$LuceneTestCaseRunner.runChild(LuceneTestCase.java:859)


    FAILED: org.apache.solr.cloud.ZkControllerTest.testUploadToCloud

    Error Message:
    KeeperErrorCode = ConnectionLoss for /configs/config1/keep-1.txt

    Stack Trace:
    org.apache.zookeeper.KeeperException$ConnectionLossException: KeeperErrorCode = ConnectionLoss for /configs/config1/keep-1.txt
    at org.apache.zookeeper.KeeperException.create(KeeperException.java:90)
    at org.apache.zookeeper.KeeperException.create(KeeperException.java:42)
    at org.apache.zookeeper.ZooKeeper.create(ZooKeeper.java:637)
    at org.apache.solr.common.cloud.SolrZkClient.makePath(SolrZkClient.java:348)
    at org.apache.solr.common.cloud.SolrZkClient.makePath(SolrZkClient.java:309)
    at org.apache.solr.common.cloud.SolrZkClient.makePath(SolrZkClient.java:291)
    at org.apache.solr.common.cloud.SolrZkClient.makePath(SolrZkClient.java:256)
    at org.apache.solr.common.cloud.SolrZkClient.setData(SolrZkClient.java:385)
    at org.apache.solr.common.cloud.SolrZkClient.setData(SolrZkClient.java:411)
    at org.apache.solr.cloud.ZkController.uploadToZK(ZkController.java:520)
    at org.apache.solr.cloud.ZkControllerTest.testUploadToCloud(ZkControllerTest.java:192)
    at org.apache.lucene.util.LuceneTestCase$LuceneTestCaseRunner.runChild(LuceneTestCase.java:921)
    at org.apache.lucene.util.LuceneTestCase$LuceneTestCaseRunner.runChild(LuceneTestCase.java:859)




    Build Log (for compile errors):
    [...truncated 10697 lines...]



    ---------------------------------------------------------------------
    To unsubscribe, e-mail: dev-unsubscribe@lucene.apache.org
    For additional commands, e-mail: dev-help@lucene.apache.org
  • Apache Hudson Server at Nov 20, 2010 at 11:38 am
    Build: https://hudson.apache.org/hudson/job/Lucene-Solr-tests-only-trunk/1634/

    1 tests failed.
    FAILED: org.apache.lucene.analysis.synonym.TestSynonymFilter.testArabicLetterTokenizerBWCompat

    Error Message:
    Forked Java VM exited abnormally. Please note the time in the report does not reflect the time until the VM exit.

    Stack Trace:
    junit.framework.AssertionFailedError: Forked Java VM exited abnormally. Please note the time in the report does not reflect the time until the VM exit.
    at java.lang.Thread.run(Thread.java:636)




    Build Log (for compile errors):
    [...truncated 6114 lines...]



    ---------------------------------------------------------------------
    To unsubscribe, e-mail: dev-unsubscribe@lucene.apache.org
    For additional commands, e-mail: dev-help@lucene.apache.org
  • Apache Hudson Server at Nov 20, 2010 at 11:51 am
    Build: https://hudson.apache.org/hudson/job/Lucene-Solr-tests-only-trunk/1635/

    No tests ran.

    Build Log (for compile errors):
    [...truncated 30 lines...]



    ---------------------------------------------------------------------
    To unsubscribe, e-mail: dev-unsubscribe@lucene.apache.org
    For additional commands, e-mail: dev-help@lucene.apache.org
  • Apache Hudson Server at Nov 20, 2010 at 11:55 am
    Build: https://hudson.apache.org/hudson/job/Lucene-Solr-tests-only-trunk/1636/

    No tests ran.

    Build Log (for compile errors):
    [...truncated 29 lines...]



    ---------------------------------------------------------------------
    To unsubscribe, e-mail: dev-unsubscribe@lucene.apache.org
    For additional commands, e-mail: dev-help@lucene.apache.org

Related Discussions

Discussion Navigation
viewthread | post
Discussion Overview
groupdev @
categorieslucene
postedNov 20, '10 at 8:28a
activeNov 20, '10 at 11:55a
posts5
users1
websitelucene.apache.org

1 user in discussion

Apache Hudson Server: 5 posts

People

Translate

site design / logo © 2017 Grokbase