Grokbase Groups R r-help January 2003
FAQ
After make check in a linux suse7.3
with

./configure --enable-R-shlib --with-blas=/usr/lib/libatlas.a --with-gnome
--with-gnome-includes=/opt/gnome/include --with-gnome-libs=/opt/gnome/lib
--with-libglade-config=/opt/gnome/bin/libglade-config


I run make and make check. I get, at the end:

running strict specific tests
make[3]: Entering directory `/usr/local/R-1.6.2/tests'
running code in 'eval-etc.R' ... OK
comparing 'eval-etc.Rout' to './eval-etc.Rout.save' ...1d0
< WARNING: ignoring environment value of R_HOME
make[3]: *** [eval-etc.Rout] Error 1
make[3]: Leaving directory `/usr/local/R-1.6.2/tests'
make[2]: *** [test-Specific] Error 2
make[2]: Leaving directory `/usr/local/R-1.6.2/tests'
make[1]: *** [test-all-basics] Error 1
make[1]: Leaving directory `/usr/local/R-1.6.2/tests'
make: *** [check] Error 2

What should I do to fix these errors?

Thanks,

Agus

Dr. Agustin Lobo
Instituto de Ciencias de la Tierra (CSIC)
Lluis Sole Sabaris s/n
08028 Barcelona SPAIN
tel 34 93409 5410
fax 34 93411 0012
alobo at ija.csic.es

Search Discussions

Related Discussions

Discussion Navigation
viewthread | post
posts ‹ prev | 1 of 1 | next ›
Discussion Overview
groupr-help @
categoriesr
postedJan 14, '03 at 11:14a
activeJan 14, '03 at 11:14a
posts1
users1
websiter-project.org
irc#r

1 user in discussion

Agustin Lobo: 1 post

People

Translate

site design / logo © 2017 Grokbase