FAQ
Smoke logs available at http://m-l.org/~perl/smoke/perl/win32/blead/log18d04e70ad3150934855463233bb7dc953f33a23.log.gz

Known failures on Win32:

../t/win32/popen.t..........................................FAILED
     Non-zero exit status: 9
     No plan found in TAP output

../cpan/Time-HiRes/t/usleep.t...............................FAILED
     3
     Non-zero exit status: 1

../t/op/threads.t...........................................FAILED
     Non-zero exit status: 9
     Bad plan. You planned 27 tests but ran 9.

../cpan/IPC-Cmd/t/01_IPC-Cmd.t..............................FAILED
     27-28
     42
     115-116
     Non-zero exit status: 2

Automated smoke report for 5.25.2 patch 18d04e70ad3150934855463233bb7dc953f33a23 v5.25.1-90-g18d04e7
perl-win2k: Intel(R) Core(TM) i7 CPU 920 @ 2.67GHz(~2673 MHz) (x86/1 cpu)
     on MSWin32 - Win2000 SP4
     using cl version 14.00.50727.762
     smoketime 2 hours 34 minutes (average 38 minutes 33 seconds)

Summary: FAIL(F)

O = OK F = Failure(s), extended report at the bottom
X = Failure(s) under TEST but not under harness
? = still running or test results not (yet) available
Build failures during: - = unknown or N/A
c = Configure, m = make, M = make (after miniperl), t = make test-prep

v5.25.1-90-g18d04e7 Configuration (common) none
----------- ---------------------------------------------------------
F F
F F -Duseithreads
+--------- -DDEBUGGING
+----------- no debugging


Locally applied patches:
     SMOKE18d04e70ad3150934855463233bb7dc953f33a23

Failures: (common-args) none
[default]
../cpan/ExtUtils-MakeMaker/t/02-xsdynamic.t.................FAILED
     17, 22, 35, 40
     Non-zero exit status: 4
../cpan/ExtUtils-MakeMaker/t/basic.t........................FAILED
     22-23, 34-36, 42-58, 69, 178-186
     Non-zero exit status: 32

[default] -DDEBUGGING
../cpan/ExtUtils-MakeMaker/t/02-xsdynamic.t.................FAILED
     17, 22, 35, 40
     Non-zero exit status: 4
../cpan/ExtUtils-MakeMaker/t/basic.t........................FAILED
     22-23, 34-36, 69, 178-186
     Non-zero exit status: 15

[default] -Duseithreads
../cpan/ExtUtils-MakeMaker/t/basic.t........................FAILED
     22-23, 34-36, 42-49, 69, 178-186
     Non-zero exit status: 23

[default] -DDEBUGGING -Duseithreads
../cpan/ExtUtils-MakeMaker/t/basic.t........................FAILED
     22-23, 34-36, 69, 178-186
     Non-zero exit status: 15

Passed Todo tests: (common-args) none
[default]
[default] -DDEBUGGING
[default] -Duseithreads
[default] -DDEBUGGING -Duseithreads
../cpan/Archive-Tar/t/09_roundtrip.t........................PASSED
     1, 4, 6
../ext/IPC-Open3/t/IPC-Open3.t..............................PASSED
     25

Compiler messages(MSWin32):
..\pp_sys.c(4647) : warning C4244: 'initializing' : conversion from 'time_t' to 'IV', possible loss of data
..\pp_sys.c(4850) : warning C4244: 'initializing' : conversion from 'time_t' to 'IV', possible loss of data
MD5.xs(763) : warning C4244: '=' : conversion from 'U32' to 'char', possible loss of data
MD5.xs(764) : warning C4244: '=' : conversion from 'U32' to 'char', possible loss of data
MD5.xs(765) : warning C4244: '=' : conversion from 'U32' to 'char', possible loss of data
MD5.xs(766) : warning C4244: '=' : conversion from 'U32' to 'char', possible loss of data
# Test.obj : error LNK2001: unresolved external symbol _PL_markstack_ptr
# Test.obj : error LNK2001: unresolved external symbol _PL_stack_sp
# Test.obj : error LNK2001: unresolved external symbol _PL_tainted
# Test.obj : error LNK2001: unresolved external symbol _PL_op
# Test.obj : error LNK2001: unresolved external symbol _PL_curpad
# Test.obj : error LNK2001: unresolved external symbol _PL_stack_base
# blib\arch\auto\XS\Test\Test.dll : fatal error LNK1120: 6 unresolved externals
# NMAKE : fatal error U1077: '"C:\Program Files\Microsoft Visual Studio 8\VC\BIN\link.EXE"' : return code '0x460'
# Other.obj : error LNK2001: unresolved external symbol _PL_markstack_ptr
# Other.obj : error LNK2001: unresolved external symbol _PL_stack_sp
# Other.obj : error LNK2001: unresolved external symbol _PL_tainted
# Other.obj : error LNK2001: unresolved external symbol _PL_op
# Other.obj : error LNK2001: unresolved external symbol _PL_curpad
# Other.obj : error LNK2001: unresolved external symbol _PL_stack_base
# blib\arch\auto\XS\Other\Other.dll : fatal error LNK1120: 6 unresolved externals
# NMAKE : fatal error U1077: 'pl2bat.bat' : return code '0x1'
# NMAKE : fatal error U1077: '"C:\Program Files\Microsoft Visual Studio 8\VC\BIN\nmake.EXE"' : return code '0x2'
# blib\arch\auto\XS\Test\Test.dll : fatal error LNK1120: 5 unresolved externals
# blib\arch\auto\XS\Other\Other.dll : fatal error LNK1120: 5 unresolved externals
d:\smoke\perl\blead\build\win32\vdir.h(647) : warning C4244: 'argument' : conversion from 'const WCHAR' to 'char', possible loss of data
--
Report by Test::Smoke v1.53 build 1374 running on perl 5.10.0
(Reporter v0.050 / Smoker v0.045)

Search Discussions

Related Discussions

Discussion Navigation
viewthread | post
posts ‹ prev | 1 of 1 | next ›
Discussion Overview
groupdaily-build-reports @
categoriesperl
postedMay 29, '16 at 11:57p
activeMay 29, '16 at 11:57p
posts1
users1
websiteperl.org

1 user in discussion

George Greer: 1 post

People

Translate

site design / logo © 2017 Grokbase