Automated smoke report for 5.13.5 patch 87b9e16005b9e39b8a24388159e899fe54b95979 v5.13.5-40-g87b9e16
ayla: i86pc (350MHz) (i386/1 cpu)
on Solaris - 2.10
using gcc version 3.4.6
smoketime 2 days 17 hours 10 minutes (average 8 hours 8 minutes)

Summary: FAIL(F)

O = OK F = Failure(s), extended report at the bottom
X = Failure(s) under TEST but not under harness
? = still running or test results not (yet) available
Build failures during: - = unknown or N/A
c = Configure, m = make, M = make (after miniperl), t = make test-prep

v5.13.5-40-g87b9e16 Configuration (common) -Dcc=gcc
----------- ---------------------------------------------------------
O O O F F O
F F O O F F -Dusemorebits
F O O F F F -Duseithreads
F F O F O O -Duseithreads -Dusemorebits
+- LC_ALL = nl_NL.UTF-8 -DDEBUGGING
+--- PERLIO = perlio -DDEBUGGING
+----- PERLIO = stdio -DDEBUGGING
+------- LC_ALL = nl_NL.UTF-8
+--------- PERLIO = perlio
+----------- PERLIO = stdio

Locally applied patches:
uncommitted-changes
SMOKE87b9e16005b9e39b8a24388159e899fe54b95979

Testsuite was run only with 'harness'

Failures: (common-args) -Dcc=gcc
[stdio/perlio] -DDEBUGGING
[stdio/perlio] -Dusemorebits
[perlio/nl_NL.UTF-8] -DDEBUGGING -Dusemorebits
[stdio] -Duseithreads
[stdio/nl_NL.UTF-8] -DDEBUGGING -Duseithreads
[stdio/perlio] -Duseithreads -Dusemorebits
[stdio] -DDEBUGGING -Duseithreads -Dusemorebits
../lib/File/stat.t..........................................FAILED
11
Non-zero exit status: 1

[perlio] -DDEBUGGING -Duseithreads
../dist/threads-shared/t/waithires.t........................FAILED
7
../lib/File/stat.t..........................................FAILED
11
Non-zero exit status: 1

Passed Todo tests: (common-args) -Dcc=gcc
[nl_NL.UTF-8]
[nl_NL.UTF-8] -DDEBUGGING
[nl_NL.UTF-8] -Dusemorebits
[nl_NL.UTF-8] -DDEBUGGING -Dusemorebits
[nl_NL.UTF-8] -Duseithreads
[nl_NL.UTF-8] -DDEBUGGING -Duseithreads
[nl_NL.UTF-8] -Duseithreads -Dusemorebits
[nl_NL.UTF-8] -DDEBUGGING -Duseithreads -Dusemorebits
../ext/XS-APItest/t/caller.t................................PASSED
22-23

Compiler messages(gcc):
regcomp.c: In function `Perl_re_compile':
regcomp.c:4273: warning: variable 'exp' might be clobbered by `longjmp' or `vfork'
regcomp.c:4274: warning: variable 'xend' might be clobbered by `longjmp' or `vfork'
regcomp.c:4286: warning: variable 'restudied' might be clobbered by `longjmp' or `vfork'
regcomp.c:4289: warning: variable 're_debug_flags' might be clobbered by `longjmp' or `vfork'

--
Report by Test::Smoke v1.41_01 build 1264 running on perl 5.8.4
(Reporter v0.034 / Smoker v0.045)

Search Discussions

Related Discussions

Discussion Navigation
viewthread | post
posts ‹ prev | 1 of 1 | next ›
Discussion Overview
groupdaily-build-reports @
categoriesperl
postedSep 24, '10 at 6:11a
activeSep 24, '10 at 6:11a
posts1
users1
websiteperl.org

1 user in discussion

Abe Timmerman: 1 post

People

Translate

site design / logo © 2017 Grokbase