Grokbase Groups Lucene dev June 2016
FAQ
Build: http://jenkins.thetaphi.de/job/Lucene-Solr-6.x-Windows/255/
Java: 32bit/jdk1.8.0_92 -server -XX:+UseParallelGC

2 tests failed.
FAILED: junit.framework.TestSuite.org.apache.solr.schema.TestManagedSchemaAPI

Error Message:
ObjectTracker found 8 object(s) that were not released!!! [MockDirectoryWrapper, TransactionLog, MockDirectoryWrapper, MockDirectoryWrapper, TransactionLog, MockDirectoryWrapper, MDCAwareThreadPoolExecutor, MDCAwareThreadPoolExecutor]

Stack Trace:
java.lang.AssertionError: ObjectTracker found 8 object(s) that were not released!!! [MockDirectoryWrapper, TransactionLog, MockDirectoryWrapper, MockDirectoryWrapper, TransactionLog, MockDirectoryWrapper, MDCAwareThreadPoolExecutor, MDCAwareThreadPoolExecutor]
  at __randomizedtesting.SeedInfo.seed([FDDAC5C51582F473]:0)
  at org.junit.Assert.fail(Assert.java:93)
  at org.junit.Assert.assertTrue(Assert.java:43)
  at org.junit.Assert.assertNull(Assert.java:551)
  at org.apache.solr.SolrTestCaseJ4.teardownTestCases(SolrTestCaseJ4.java:257)
  at sun.reflect.GeneratedMethodAccessor22.invoke(Unknown Source)
  at sun.reflect.DelegatingMethodAccessorImpl.invoke(DelegatingMethodAccessorImpl.java:43)
  at java.lang.reflect.Method.invoke(Method.java:498)
  at com.carrotsearch.randomizedtesting.RandomizedRunner.invoke(RandomizedRunner.java:1764)
  at com.carrotsearch.randomizedtesting.RandomizedRunner$7.evaluate(RandomizedRunner.java:834)
  at com.carrotsearch.randomizedtesting.rules.StatementAdapter.evaluate(StatementAdapter.java:36)
  at com.carrotsearch.randomizedtesting.rules.SystemPropertiesRestoreRule$1.evaluate(SystemPropertiesRestoreRule.java:57)
  at org.apache.lucene.util.AbstractBeforeAfterRule$1.evaluate(AbstractBeforeAfterRule.java:45)
  at com.carrotsearch.randomizedtesting.rules.StatementAdapter.evaluate(StatementAdapter.java:36)
  at org.apache.lucene.util.TestRuleStoreClassName$1.evaluate(TestRuleStoreClassName.java:41)
  at com.carrotsearch.randomizedtesting.rules.NoShadowingOrOverridesOnMethodsRule$1.evaluate(NoShadowingOrOverridesOnMethodsRule.java:40)
  at com.carrotsearch.randomizedtesting.rules.NoShadowingOrOverridesOnMethodsRule$1.evaluate(NoShadowingOrOverridesOnMethodsRule.java:40)
  at com.carrotsearch.randomizedtesting.rules.StatementAdapter.evaluate(StatementAdapter.java:36)
  at com.carrotsearch.randomizedtesting.rules.StatementAdapter.evaluate(StatementAdapter.java:36)
  at com.carrotsearch.randomizedtesting.rules.StatementAdapter.evaluate(StatementAdapter.java:36)
  at org.apache.lucene.util.TestRuleAssertionsRequired$1.evaluate(TestRuleAssertionsRequired.java:53)
  at org.apache.lucene.util.TestRuleMarkFailure$1.evaluate(TestRuleMarkFailure.java:47)
  at org.apache.lucene.util.TestRuleIgnoreAfterMaxFailures$1.evaluate(TestRuleIgnoreAfterMaxFailures.java:64)
  at org.apache.lucene.util.TestRuleIgnoreTestSuites$1.evaluate(TestRuleIgnoreTestSuites.java:54)
  at com.carrotsearch.randomizedtesting.rules.StatementAdapter.evaluate(StatementAdapter.java:36)
  at com.carrotsearch.randomizedtesting.ThreadLeakControl$StatementRunner.run(ThreadLeakControl.java:367)
  at java.lang.Thread.run(Thread.java:745)


FAILED: junit.framework.TestSuite.org.apache.solr.schema.TestManagedSchemaAPI

Error Message:
Could not remove the following files (in the order of attempts): C:\Users\jenkins\workspace\Lucene-Solr-6.x-Windows\solr\build\solr-core\test\J0\temp\solr.schema.TestManagedSchemaAPI_FDDAC5C51582F473-001\tempDir-001\node1\testschemaapi_shard1_replica2\data\tlog\tlog.0000000000000000001: java.nio.file.FileSystemException: C:\Users\jenkins\workspace\Lucene-Solr-6.x-Windows\solr\build\solr-core\test\J0\temp\solr.schema.TestManagedSchemaAPI_FDDAC5C51582F473-001\tempDir-001\node1\testschemaapi_shard1_replica2\data\tlog\tlog.0000000000000000001: The process cannot access the file because it is being used by another process. C:\Users\jenkins\workspace\Lucene-Solr-6.x-Windows\solr\build\solr-core\test\J0\temp\solr.schema.TestManagedSchemaAPI_FDDAC5C51582F473-001\tempDir-001\node1\testschemaapi_shard1_replica2\data\tlog: java.nio.file.DirectoryNotEmptyException: C:\Users\jenkins\workspace\Lucene-Solr-6.x-Windows\solr\build\solr-core\test\J0\temp\solr.schema.TestManagedSchemaAPI_FDDAC5C51582F473-001\tempDir-001\node1\testschemaapi_shard1_replica2\data\tlog C:\Users\jenkins\workspace\Lucene-Solr-6.x-Windows\solr\build\solr-core\test\J0\temp\solr.schema.TestManagedSchemaAPI_FDDAC5C51582F473-001\tempDir-001\node1\testschemaapi_shard1_replica2\data: java.nio.file.DirectoryNotEmptyException: C:\Users\jenkins\workspace\Lucene-Solr-6.x-Windows\solr\build\solr-core\test\J0\temp\solr.schema.TestManagedSchemaAPI_FDDAC5C51582F473-001\tempDir-001\node1\testschemaapi_shard1_replica2\data C:\Users\jenkins\workspace\Lucene-Solr-6.x-Windows\solr\build\solr-core\test\J0\temp\solr.schema.TestManagedSchemaAPI_FDDAC5C51582F473-001\tempDir-001\node1\testschemaapi_shard1_replica2: java.nio.file.DirectoryNotEmptyException: C:\Users\jenkins\workspace\Lucene-Solr-6.x-Windows\solr\build\solr-core\test\J0\temp\solr.schema.TestManagedSchemaAPI_FDDAC5C51582F473-001\tempDir-001\node1\testschemaapi_shard1_replica2 C:\Users\jenkins\workspace\Lucene-Solr-6.x-Windows\solr\build\solr-core\test\J0\temp\solr.schema.TestManagedSchemaAPI_FDDAC5C51582F473-001\tempDir-001\node1: java.nio.file.DirectoryNotEmptyException: C:\Users\jenkins\workspace\Lucene-Solr-6.x-Windows\solr\build\solr-core\test\J0\temp\solr.schema.TestManagedSchemaAPI_FDDAC5C51582F473-001\tempDir-001\node1 C:\Users\jenkins\workspace\Lucene-Solr-6.x-Windows\solr\build\solr-core\test\J0\temp\solr.schema.TestManagedSchemaAPI_FDDAC5C51582F473-001\tempDir-001\node2\testschemaapi_shard1_replica1\data\tlog\tlog.0000000000000000000: java.nio.file.FileSystemException: C:\Users\jenkins\workspace\Lucene-Solr-6.x-Windows\solr\build\solr-core\test\J0\temp\solr.schema.TestManagedSchemaAPI_FDDAC5C51582F473-001\tempDir-001\node2\testschemaapi_shard1_replica1\data\tlog\tlog.0000000000000000000: The process cannot access the file because it is being used by another process. C:\Users\jenkins\workspace\Lucene-Solr-6.x-Windows\solr\build\solr-core\test\J0\temp\solr.schema.TestManagedSchemaAPI_FDDAC5C51582F473-001\tempDir-001\node2\testschemaapi_shard1_replica1\data\tlog: java.nio.file.DirectoryNotEmptyException: C:\Users\jenkins\workspace\Lucene-Solr-6.x-Windows\solr\build\solr-core\test\J0\temp\solr.schema.TestManagedSchemaAPI_FDDAC5C51582F473-001\tempDir-001\node2\testschemaapi_shard1_replica1\data\tlog C:\Users\jenkins\workspace\Lucene-Solr-6.x-Windows\solr\build\solr-core\test\J0\temp\solr.schema.TestManagedSchemaAPI_FDDAC5C51582F473-001\tempDir-001\node2\testschemaapi_shard1_replica1\data: java.nio.file.DirectoryNotEmptyException: C:\Users\jenkins\workspace\Lucene-Solr-6.x-Windows\solr\build\solr-core\test\J0\temp\solr.schema.TestManagedSchemaAPI_FDDAC5C51582F473-001\tempDir-001\node2\testschemaapi_shard1_replica1\data C:\Users\jenkins\workspace\Lucene-Solr-6.x-Windows\solr\build\solr-core\test\J0\temp\solr.schema.TestManagedSchemaAPI_FDDAC5C51582F473-001\tempDir-001\node2\testschemaapi_shard1_replica1: java.nio.file.DirectoryNotEmptyException: C:\Users\jenkins\workspace\Lucene-Solr-6.x-Windows\solr\build\solr-core\test\J0\temp\solr.schema.TestManagedSchemaAPI_FDDAC5C51582F473-001\tempDir-001\node2\testschemaapi_shard1_replica1 C:\Users\jenkins\workspace\Lucene-Solr-6.x-Windows\solr\build\solr-core\test\J0\temp\solr.schema.TestManagedSchemaAPI_FDDAC5C51582F473-001\tempDir-001\node2: java.nio.file.DirectoryNotEmptyException: C:\Users\jenkins\workspace\Lucene-Solr-6.x-Windows\solr\build\solr-core\test\J0\temp\solr.schema.TestManagedSchemaAPI_FDDAC5C51582F473-001\tempDir-001\node2 C:\Users\jenkins\workspace\Lucene-Solr-6.x-Windows\solr\build\solr-core\test\J0\temp\solr.schema.TestManagedSchemaAPI_FDDAC5C51582F473-001\tempDir-001: java.nio.file.DirectoryNotEmptyException: C:\Users\jenkins\workspace\Lucene-Solr-6.x-Windows\solr\build\solr-core\test\J0\temp\solr.schema.TestManagedSchemaAPI_FDDAC5C51582F473-001\tempDir-001 C:\Users\jenkins\workspace\Lucene-Solr-6.x-Windows\solr\build\solr-core\test\J0\temp\solr.schema.TestManagedSchemaAPI_FDDAC5C51582F473-001: java.nio.file.DirectoryNotEmptyException: C:\Users\jenkins\workspace\Lucene-Solr-6.x-Windows\solr\build\solr-core\test\J0\temp\solr.schema.TestManagedSchemaAPI_FDDAC5C51582F473-001

Stack Trace:
java.io.IOException: Could not remove the following files (in the order of attempts):
    C:\Users\jenkins\workspace\Lucene-Solr-6.x-Windows\solr\build\solr-core\test\J0\temp\solr.schema.TestManagedSchemaAPI_FDDAC5C51582F473-001\tempDir-001\node1\testschemaapi_shard1_replica2\data\tlog\tlog.0000000000000000001: java.nio.file.FileSystemException: C:\Users\jenkins\workspace\Lucene-Solr-6.x-Windows\solr\build\solr-core\test\J0\temp\solr.schema.TestManagedSchemaAPI_FDDAC5C51582F473-001\tempDir-001\node1\testschemaapi_shard1_replica2\data\tlog\tlog.0000000000000000001: The process cannot access the file because it is being used by another process.

    C:\Users\jenkins\workspace\Lucene-Solr-6.x-Windows\solr\build\solr-core\test\J0\temp\solr.schema.TestManagedSchemaAPI_FDDAC5C51582F473-001\tempDir-001\node1\testschemaapi_shard1_replica2\data\tlog: java.nio.file.DirectoryNotEmptyException: C:\Users\jenkins\workspace\Lucene-Solr-6.x-Windows\solr\build\solr-core\test\J0\temp\solr.schema.TestManagedSchemaAPI_FDDAC5C51582F473-001\tempDir-001\node1\testschemaapi_shard1_replica2\data\tlog
    C:\Users\jenkins\workspace\Lucene-Solr-6.x-Windows\solr\build\solr-core\test\J0\temp\solr.schema.TestManagedSchemaAPI_FDDAC5C51582F473-001\tempDir-001\node1\testschemaapi_shard1_replica2\data: java.nio.file.DirectoryNotEmptyException: C:\Users\jenkins\workspace\Lucene-Solr-6.x-Windows\solr\build\solr-core\test\J0\temp\solr.schema.TestManagedSchemaAPI_FDDAC5C51582F473-001\tempDir-001\node1\testschemaapi_shard1_replica2\data
    C:\Users\jenkins\workspace\Lucene-Solr-6.x-Windows\solr\build\solr-core\test\J0\temp\solr.schema.TestManagedSchemaAPI_FDDAC5C51582F473-001\tempDir-001\node1\testschemaapi_shard1_replica2: java.nio.file.DirectoryNotEmptyException: C:\Users\jenkins\workspace\Lucene-Solr-6.x-Windows\solr\build\solr-core\test\J0\temp\solr.schema.TestManagedSchemaAPI_FDDAC5C51582F473-001\tempDir-001\node1\testschemaapi_shard1_replica2
    C:\Users\jenkins\workspace\Lucene-Solr-6.x-Windows\solr\build\solr-core\test\J0\temp\solr.schema.TestManagedSchemaAPI_FDDAC5C51582F473-001\tempDir-001\node1: java.nio.file.DirectoryNotEmptyException: C:\Users\jenkins\workspace\Lucene-Solr-6.x-Windows\solr\build\solr-core\test\J0\temp\solr.schema.TestManagedSchemaAPI_FDDAC5C51582F473-001\tempDir-001\node1
    C:\Users\jenkins\workspace\Lucene-Solr-6.x-Windows\solr\build\solr-core\test\J0\temp\solr.schema.TestManagedSchemaAPI_FDDAC5C51582F473-001\tempDir-001\node2\testschemaapi_shard1_replica1\data\tlog\tlog.0000000000000000000: java.nio.file.FileSystemException: C:\Users\jenkins\workspace\Lucene-Solr-6.x-Windows\solr\build\solr-core\test\J0\temp\solr.schema.TestManagedSchemaAPI_FDDAC5C51582F473-001\tempDir-001\node2\testschemaapi_shard1_replica1\data\tlog\tlog.0000000000000000000: The process cannot access the file because it is being used by another process.

    C:\Users\jenkins\workspace\Lucene-Solr-6.x-Windows\solr\build\solr-core\test\J0\temp\solr.schema.TestManagedSchemaAPI_FDDAC5C51582F473-001\tempDir-001\node2\testschemaapi_shard1_replica1\data\tlog: java.nio.file.DirectoryNotEmptyException: C:\Users\jenkins\workspace\Lucene-Solr-6.x-Windows\solr\build\solr-core\test\J0\temp\solr.schema.TestManagedSchemaAPI_FDDAC5C51582F473-001\tempDir-001\node2\testschemaapi_shard1_replica1\data\tlog
    C:\Users\jenkins\workspace\Lucene-Solr-6.x-Windows\solr\build\solr-core\test\J0\temp\solr.schema.TestManagedSchemaAPI_FDDAC5C51582F473-001\tempDir-001\node2\testschemaapi_shard1_replica1\data: java.nio.file.DirectoryNotEmptyException: C:\Users\jenkins\workspace\Lucene-Solr-6.x-Windows\solr\build\solr-core\test\J0\temp\solr.schema.TestManagedSchemaAPI_FDDAC5C51582F473-001\tempDir-001\node2\testschemaapi_shard1_replica1\data
    C:\Users\jenkins\workspace\Lucene-Solr-6.x-Windows\solr\build\solr-core\test\J0\temp\solr.schema.TestManagedSchemaAPI_FDDAC5C51582F473-001\tempDir-001\node2\testschemaapi_shard1_replica1: java.nio.file.DirectoryNotEmptyException: C:\Users\jenkins\workspace\Lucene-Solr-6.x-Windows\solr\build\solr-core\test\J0\temp\solr.schema.TestManagedSchemaAPI_FDDAC5C51582F473-001\tempDir-001\node2\testschemaapi_shard1_replica1
    C:\Users\jenkins\workspace\Lucene-Solr-6.x-Windows\solr\build\solr-core\test\J0\temp\solr.schema.TestManagedSchemaAPI_FDDAC5C51582F473-001\tempDir-001\node2: java.nio.file.DirectoryNotEmptyException: C:\Users\jenkins\workspace\Lucene-Solr-6.x-Windows\solr\build\solr-core\test\J0\temp\solr.schema.TestManagedSchemaAPI_FDDAC5C51582F473-001\tempDir-001\node2
    C:\Users\jenkins\workspace\Lucene-Solr-6.x-Windows\solr\build\solr-core\test\J0\temp\solr.schema.TestManagedSchemaAPI_FDDAC5C51582F473-001\tempDir-001: java.nio.file.DirectoryNotEmptyException: C:\Users\jenkins\workspace\Lucene-Solr-6.x-Windows\solr\build\solr-core\test\J0\temp\solr.schema.TestManagedSchemaAPI_FDDAC5C51582F473-001\tempDir-001
    C:\Users\jenkins\workspace\Lucene-Solr-6.x-Windows\solr\build\solr-core\test\J0\temp\solr.schema.TestManagedSchemaAPI_FDDAC5C51582F473-001: java.nio.file.DirectoryNotEmptyException: C:\Users\jenkins\workspace\Lucene-Solr-6.x-Windows\solr\build\solr-core\test\J0\temp\solr.schema.TestManagedSchemaAPI_FDDAC5C51582F473-001

  at org.apache.lucene.util.IOUtils.rm(IOUtils.java:323)
  at org.apache.lucene.util.TestRuleTemporaryFilesCleanup.afterAlways(TestRuleTemporaryFilesCleanup.java:216)
  at com.carrotsearch.randomizedtesting.rules.TestRuleAdapter$1.afterAlways(TestRuleAdapter.java:31)
  at com.carrotsearch.randomizedtesting.rules.StatementAdapter.evaluate(StatementAdapter.java:43)
  at com.carrotsearch.randomizedtesting.rules.StatementAdapter.evaluate(StatementAdapter.java:36)
  at org.apache.lucene.util.TestRuleAssertionsRequired$1.evaluate(TestRuleAssertionsRequired.java:53)
  at org.apache.lucene.util.TestRuleMarkFailure$1.evaluate(TestRuleMarkFailure.java:47)
  at org.apache.lucene.util.TestRuleIgnoreAfterMaxFailures$1.evaluate(TestRuleIgnoreAfterMaxFailures.java:64)
  at org.apache.lucene.util.TestRuleIgnoreTestSuites$1.evaluate(TestRuleIgnoreTestSuites.java:54)
  at com.carrotsearch.randomizedtesting.rules.StatementAdapter.evaluate(StatementAdapter.java:36)
  at com.carrotsearch.randomizedtesting.ThreadLeakControl$StatementRunner.run(ThreadLeakControl.java:367)
  at java.lang.Thread.run(Thread.java:745)




Build Log:
[...truncated 12312 lines...]
    [junit4] Suite: org.apache.solr.schema.TestManagedSchemaAPI
    [junit4] 2> Creating dataDir: C:\Users\jenkins\workspace\Lucene-Solr-6.x-Windows\solr\build\solr-core\test\J0\temp\solr.schema.TestManagedSchemaAPI_FDDAC5C51582F473-001\init-core-data-001
    [junit4] 2> 2792519 INFO (SUITE-TestManagedSchemaAPI-seed#[FDDAC5C51582F473]-worker) [ ] o.a.s.SolrTestCaseJ4 Randomized ssl (false) and clientAuth (false) via: @org.apache.solr.util.RandomizeSSL(reason=, value=NaN, ssl=NaN, clientAuth=NaN)
    [junit4] 2> 2792522 INFO (SUITE-TestManagedSchemaAPI-seed#[FDDAC5C51582F473]-worker) [ ] o.a.s.c.ZkTestServer STARTING ZK TEST SERVER
    [junit4] 2> 2792522 INFO (Thread-7690) [ ] o.a.s.c.ZkTestServer client port:0.0.0.0/0.0.0.0:0
    [junit4] 2> 2792522 INFO (Thread-7690) [ ] o.a.s.c.ZkTestServer Starting server
    [junit4] 2> 2792623 INFO (SUITE-TestManagedSchemaAPI-seed#[FDDAC5C51582F473]-worker) [ ] o.a.s.c.ZkTestServer start zk server on port:55294
    [junit4] 2> 2792623 INFO (SUITE-TestManagedSchemaAPI-seed#[FDDAC5C51582F473]-worker) [ ] o.a.s.c.c.SolrZkClient Using default ZkCredentialsProvider
    [junit4] 2> 2792624 INFO (SUITE-TestManagedSchemaAPI-seed#[FDDAC5C51582F473]-worker) [ ] o.a.s.c.c.ConnectionManager Waiting for client to connect to ZooKeeper
    [junit4] 2> 2792627 INFO (zkCallback-11009-thread-1) [ ] o.a.s.c.c.ConnectionManager Watcher org.apache.solr.common.cloud.ConnectionManager@1440d56 name:ZooKeeperConnection Watcher:127.0.0.1:55294 got event WatchedEvent state:SyncConnected type:None path:null path:null type:None
    [junit4] 2> 2792627 INFO (SUITE-TestManagedSchemaAPI-seed#[FDDAC5C51582F473]-worker) [ ] o.a.s.c.c.ConnectionManager Client is connected to ZooKeeper
    [junit4] 2> 2792628 INFO (SUITE-TestManagedSchemaAPI-seed#[FDDAC5C51582F473]-worker) [ ] o.a.s.c.c.SolrZkClient Using default ZkACLProvider
    [junit4] 2> 2792628 INFO (SUITE-TestManagedSchemaAPI-seed#[FDDAC5C51582F473]-worker) [ ] o.a.s.c.c.SolrZkClient makePath: /solr/solr.xml
    [junit4] 2> 2792631 WARN (NIOServerCxn.Factory:0.0.0.0/0.0.0.0:0) [ ] o.a.z.s.NIOServerCnxn caught end of stream exception
    [junit4] 2> EndOfStreamException: Unable to read additional data from client sessionid 0x155611bbeef0000, likely client has closed socket
    [junit4] 2> at org.apache.zookeeper.server.NIOServerCnxn.doIO(NIOServerCnxn.java:228)
    [junit4] 2> at org.apache.zookeeper.server.NIOServerCnxnFactory.run(NIOServerCnxnFactory.java:208)
    [junit4] 2> at java.lang.Thread.run(Thread.java:745)
    [junit4] 2> 2792634 INFO (jetty-launcher-11008-thread-1) [ ] o.e.j.s.Server jetty-9.3.8.v20160314
    [junit4] 2> 2792634 INFO (jetty-launcher-11008-thread-2) [ ] o.e.j.s.Server jetty-9.3.8.v20160314
    [junit4] 2> 2792635 INFO (jetty-launcher-11008-thread-2) [ ] o.e.j.s.h.ContextHandler Started o.e.j.s.ServletContextHandler@15bcfb9{/solr,null,AVAILABLE}
    [junit4] 2> 2792635 INFO (jetty-launcher-11008-thread-1) [ ] o.e.j.s.h.ContextHandler Started o.e.j.s.ServletContextHandler@1646fb1{/solr,null,AVAILABLE}
    [junit4] 2> 2792637 INFO (jetty-launcher-11008-thread-2) [ ] o.e.j.s.ServerConnector Started ServerConnector@1711dc0{HTTP/1.1,[http/1.1]}{127.0.0.1:55298}
    [junit4] 2> 2792637 INFO (jetty-launcher-11008-thread-2) [ ] o.e.j.s.Server Started @2799511ms
    [junit4] 2> 2792637 INFO (jetty-launcher-11008-thread-2) [ ] o.a.s.c.s.e.JettySolrRunner Jetty properties: {hostContext=/solr, hostPort=55298}
    [junit4] 2> 2792637 INFO (jetty-launcher-11008-thread-2) [ ] o.a.s.s.SolrDispatchFilter SolrDispatchFilter.init(): sun.misc.Launcher$AppClassLoader@1d16e93
    [junit4] 2> 2792638 INFO (jetty-launcher-11008-thread-1) [ ] o.e.j.s.ServerConnector Started ServerConnector@1c657f2{HTTP/1.1,[http/1.1]}{127.0.0.1:55299}
    [junit4] 2> 2792638 INFO (jetty-launcher-11008-thread-2) [ ] o.a.s.c.SolrResourceLoader new SolrResourceLoader for directory: 'C:\Users\jenkins\workspace\Lucene-Solr-6.x-Windows\solr\build\solr-core\test\J0\temp\solr.schema.TestManagedSchemaAPI_FDDAC5C51582F473-001\tempDir-001\node2'
    [junit4] 2> 2792638 INFO (jetty-launcher-11008-thread-1) [ ] o.e.j.s.Server Started @2799512ms
    [junit4] 2> 2792638 INFO (jetty-launcher-11008-thread-1) [ ] o.a.s.c.s.e.JettySolrRunner Jetty properties: {hostContext=/solr, hostPort=55299}
    [junit4] 2> 2792638 INFO (jetty-launcher-11008-thread-2) [ ] o.a.s.c.SolrResourceLoader JNDI not configured for solr (NoInitialContextEx)
    [junit4] 2> 2792638 INFO (jetty-launcher-11008-thread-2) [ ] o.a.s.c.SolrResourceLoader solr home defaulted to 'solr/' (could not find system property or JNDI)
    [junit4] 2> 2792639 INFO (jetty-launcher-11008-thread-1) [ ] o.a.s.s.SolrDispatchFilter SolrDispatchFilter.init(): sun.misc.Launcher$AppClassLoader@1d16e93
    [junit4] 2> 2792639 INFO (jetty-launcher-11008-thread-1) [ ] o.a.s.c.SolrResourceLoader new SolrResourceLoader for directory: 'C:\Users\jenkins\workspace\Lucene-Solr-6.x-Windows\solr\build\solr-core\test\J0\temp\solr.schema.TestManagedSchemaAPI_FDDAC5C51582F473-001\tempDir-001\node1'
    [junit4] 2> 2792639 INFO (jetty-launcher-11008-thread-1) [ ] o.a.s.c.SolrResourceLoader JNDI not configured for solr (NoInitialContextEx)
    [junit4] 2> 2792639 INFO (jetty-launcher-11008-thread-1) [ ] o.a.s.c.SolrResourceLoader solr home defaulted to 'solr/' (could not find system property or JNDI)
    [junit4] 2> 2792639 INFO (jetty-launcher-11008-thread-2) [ ] o.a.s.c.c.SolrZkClient Using default ZkCredentialsProvider
    [junit4] 2> 2792639 INFO (jetty-launcher-11008-thread-1) [ ] o.a.s.c.c.SolrZkClient Using default ZkCredentialsProvider
    [junit4] 2> 2792640 INFO (jetty-launcher-11008-thread-2) [ ] o.a.s.c.c.ConnectionManager Waiting for client to connect to ZooKeeper
    [junit4] 2> 2792640 INFO (jetty-launcher-11008-thread-1) [ ] o.a.s.c.c.ConnectionManager Waiting for client to connect to ZooKeeper
    [junit4] 2> 2792641 INFO (zkCallback-11010-thread-1) [ ] o.a.s.c.c.ConnectionManager Watcher org.apache.solr.common.cloud.ConnectionManager@e085ca name:ZooKeeperConnection Watcher:127.0.0.1:55294/solr got event WatchedEvent state:SyncConnected type:None path:null path:null type:None
    [junit4] 2> 2792641 INFO (jetty-launcher-11008-thread-2) [ ] o.a.s.c.c.ConnectionManager Client is connected to ZooKeeper
    [junit4] 2> 2792641 INFO (jetty-launcher-11008-thread-2) [ ] o.a.s.c.c.SolrZkClient Using default ZkACLProvider
    [junit4] 2> 2792641 INFO (zkCallback-11011-thread-1) [ ] o.a.s.c.c.ConnectionManager Watcher org.apache.solr.common.cloud.ConnectionManager@1844c53 name:ZooKeeperConnection Watcher:127.0.0.1:55294/solr got event WatchedEvent state:SyncConnected type:None path:null path:null type:None
    [junit4] 2> 2792643 INFO (jetty-launcher-11008-thread-1) [ ] o.a.s.c.c.ConnectionManager Client is connected to ZooKeeper
    [junit4] 2> 2792643 INFO (jetty-launcher-11008-thread-2) [ ] o.a.s.s.SolrDispatchFilter solr.xml found in ZooKeeper. Loading...
    [junit4] 2> 2792643 INFO (jetty-launcher-11008-thread-1) [ ] o.a.s.c.c.SolrZkClient Using default ZkACLProvider
    [junit4] 2> 2792643 INFO (jetty-launcher-11008-thread-1) [ ] o.a.s.s.SolrDispatchFilter solr.xml found in ZooKeeper. Loading...
    [junit4] 2> 2792647 INFO (jetty-launcher-11008-thread-1) [ ] o.a.s.c.CorePropertiesLocator Config-defined core root directory: C:\Users\jenkins\workspace\Lucene-Solr-6.x-Windows\solr\build\solr-core\test\J0\temp\solr.schema.TestManagedSchemaAPI_FDDAC5C51582F473-001\tempDir-001\node1\.
    [junit4] 2> 2792647 WARN (NIOServerCxn.Factory:0.0.0.0/0.0.0.0:0) [ ] o.a.z.s.NIOServerCnxn caught end of stream exception
    [junit4] 2> EndOfStreamException: Unable to read additional data from client sessionid 0x155611bbeef0001, likely client has closed socket
    [junit4] 2> at org.apache.zookeeper.server.NIOServerCnxn.doIO(NIOServerCnxn.java:228)
    [junit4] 2> at org.apache.zookeeper.server.NIOServerCnxnFactory.run(NIOServerCnxnFactory.java:208)
    [junit4] 2> at java.lang.Thread.run(Thread.java:745)
    [junit4] 2> 2792647 INFO (jetty-launcher-11008-thread-1) [ ] o.a.s.c.CoreContainer New CoreContainer 32983469
    [junit4] 2> 2792648 INFO (jetty-launcher-11008-thread-1) [ ] o.a.s.c.CoreContainer Loading cores into CoreContainer [instanceDir=C:\Users\jenkins\workspace\Lucene-Solr-6.x-Windows\solr\build\solr-core\test\J0\temp\solr.schema.TestManagedSchemaAPI_FDDAC5C51582F473-001\tempDir-001\node1]
    [junit4] 2> 2792648 WARN (jetty-launcher-11008-thread-1) [ ] o.a.s.c.CoreContainer Couldn't add files from C:\Users\jenkins\workspace\Lucene-Solr-6.x-Windows\solr\build\solr-core\test\J0\temp\solr.schema.TestManagedSchemaAPI_FDDAC5C51582F473-001\tempDir-001\node1\lib to classpath: C:\Users\jenkins\workspace\Lucene-Solr-6.x-Windows\solr\build\solr-core\test\J0\temp\solr.schema.TestManagedSchemaAPI_FDDAC5C51582F473-001\tempDir-001\node1\lib
    [junit4] 2> 2792648 INFO (jetty-launcher-11008-thread-1) [ ] o.a.s.h.c.HttpShardHandlerFactory created with socketTimeout : 90000,urlScheme : ,connTimeout : 15000,maxConnectionsPerHost : 20,maxConnections : 10000,corePoolSize : 0,maximumPoolSize : 2147483647,maxThreadIdleTime : 5,sizeOfQueue : -1,fairnessPolicy : false,useRetries : false,
    [junit4] 2> 2792649 INFO (jetty-launcher-11008-thread-1) [ ] o.a.s.u.UpdateShardHandler Creating UpdateShardHandler HTTP client with params: socketTimeout=340000&connTimeout=45000&retry=true
    [junit4] 2> 2792649 INFO (jetty-launcher-11008-thread-1) [ ] o.a.s.l.LogWatcher SLF4J impl is org.slf4j.impl.Log4jLoggerFactory
    [junit4] 2> 2792649 INFO (jetty-launcher-11008-thread-1) [ ] o.a.s.l.LogWatcher Registering Log Listener [Log4j (org.slf4j.impl.Log4jLoggerFactory)]
    [junit4] 2> 2792649 INFO (jetty-launcher-11008-thread-1) [ ] o.a.s.c.ZkContainer Zookeeper client=127.0.0.1:55294/solr
    [junit4] 2> 2792649 INFO (jetty-launcher-11008-thread-1) [ ] o.a.s.c.ZkController zkHost includes chroot
    [junit4] 2> 2792649 INFO (jetty-launcher-11008-thread-1) [ ] o.a.s.c.c.SolrZkClient Using default ZkCredentialsProvider
    [junit4] 2> 2792651 INFO (jetty-launcher-11008-thread-2) [ ] o.a.s.c.CorePropertiesLocator Config-defined core root directory: C:\Users\jenkins\workspace\Lucene-Solr-6.x-Windows\solr\build\solr-core\test\J0\temp\solr.schema.TestManagedSchemaAPI_FDDAC5C51582F473-001\tempDir-001\node2\.
    [junit4] 2> 2792651 INFO (jetty-launcher-11008-thread-2) [ ] o.a.s.c.CoreContainer New CoreContainer 13488437
    [junit4] 2> 2792651 INFO (jetty-launcher-11008-thread-2) [ ] o.a.s.c.CoreContainer Loading cores into CoreContainer [instanceDir=C:\Users\jenkins\workspace\Lucene-Solr-6.x-Windows\solr\build\solr-core\test\J0\temp\solr.schema.TestManagedSchemaAPI_FDDAC5C51582F473-001\tempDir-001\node2]
    [junit4] 2> 2792651 WARN (jetty-launcher-11008-thread-2) [ ] o.a.s.c.CoreContainer Couldn't add files from C:\Users\jenkins\workspace\Lucene-Solr-6.x-Windows\solr\build\solr-core\test\J0\temp\solr.schema.TestManagedSchemaAPI_FDDAC5C51582F473-001\tempDir-001\node2\lib to classpath: C:\Users\jenkins\workspace\Lucene-Solr-6.x-Windows\solr\build\solr-core\test\J0\temp\solr.schema.TestManagedSchemaAPI_FDDAC5C51582F473-001\tempDir-001\node2\lib
    [junit4] 2> 2792651 INFO (jetty-launcher-11008-thread-2) [ ] o.a.s.h.c.HttpShardHandlerFactory created with socketTimeout : 90000,urlScheme : ,connTimeout : 15000,maxConnectionsPerHost : 20,maxConnections : 10000,corePoolSize : 0,maximumPoolSize : 2147483647,maxThreadIdleTime : 5,sizeOfQueue : -1,fairnessPolicy : false,useRetries : false,
    [junit4] 2> 2792651 INFO (jetty-launcher-11008-thread-2) [ ] o.a.s.u.UpdateShardHandler Creating UpdateShardHandler HTTP client with params: socketTimeout=340000&connTimeout=45000&retry=true
    [junit4] 2> 2792651 INFO (jetty-launcher-11008-thread-1) [ ] o.a.s.c.c.ConnectionManager Waiting for client to connect to ZooKeeper
    [junit4] 2> 2792651 INFO (jetty-launcher-11008-thread-2) [ ] o.a.s.l.LogWatcher SLF4J impl is org.slf4j.impl.Log4jLoggerFactory
    [junit4] 2> 2792652 INFO (jetty-launcher-11008-thread-2) [ ] o.a.s.l.LogWatcher Registering Log Listener [Log4j (org.slf4j.impl.Log4jLoggerFactory)]
    [junit4] 2> 2792652 INFO (jetty-launcher-11008-thread-2) [ ] o.a.s.c.ZkContainer Zookeeper client=127.0.0.1:55294/solr
    [junit4] 2> 2792652 INFO (jetty-launcher-11008-thread-2) [ ] o.a.s.c.ZkController zkHost includes chroot
    [junit4] 2> 2792652 INFO (jetty-launcher-11008-thread-2) [ ] o.a.s.c.c.SolrZkClient Using default ZkCredentialsProvider
    [junit4] 2> 2792652 INFO (jetty-launcher-11008-thread-2) [ ] o.a.s.c.c.ConnectionManager Waiting for client to connect to ZooKeeper
    [junit4] 2> 2792654 INFO (zkCallback-11014-thread-1) [ ] o.a.s.c.c.ConnectionManager Watcher org.apache.solr.common.cloud.ConnectionManager@c3604a name:ZooKeeperConnection Watcher:127.0.0.1:55294 got event WatchedEvent state:SyncConnected type:None path:null path:null type:None
    [junit4] 2> 2792654 INFO (jetty-launcher-11008-thread-1) [ ] o.a.s.c.c.ConnectionManager Client is connected to ZooKeeper
    [junit4] 2> 2792654 INFO (jetty-launcher-11008-thread-1) [ ] o.a.s.c.c.SolrZkClient Using default ZkACLProvider
    [junit4] 2> 2792655 INFO (zkCallback-11017-thread-1) [ ] o.a.s.c.c.ConnectionManager Watcher org.apache.solr.common.cloud.ConnectionManager@bdc8b7 name:ZooKeeperConnection Watcher:127.0.0.1:55294 got event WatchedEvent state:SyncConnected type:None path:null path:null type:None
    [junit4] 2> 2792655 INFO (jetty-launcher-11008-thread-2) [ ] o.a.s.c.c.ConnectionManager Client is connected to ZooKeeper
    [junit4] 2> 2792655 INFO (jetty-launcher-11008-thread-2) [ ] o.a.s.c.c.SolrZkClient Using default ZkACLProvider
    [junit4] 2> 2792655 INFO (jetty-launcher-11008-thread-1) [n:127.0.0.1:55299_solr ] o.a.s.c.ZkController Added new OnReconnect listener org.apache.solr.cloud.ZkController$$Lambda$13/1516015@16fe73b
    [junit4] 2> 2792656 WARN (NIOServerCxn.Factory:0.0.0.0/0.0.0.0:0) [ ] o.a.z.s.NIOServerCnxn caught end of stream exception
    [junit4] 2> EndOfStreamException: Unable to read additional data from client sessionid 0x155611bbeef0003, likely client has closed socket
    [junit4] 2> at org.apache.zookeeper.server.NIOServerCnxn.doIO(NIOServerCnxn.java:228)
    [junit4] 2> at org.apache.zookeeper.server.NIOServerCnxnFactory.run(NIOServerCnxnFactory.java:208)
    [junit4] 2> at java.lang.Thread.run(Thread.java:745)
    [junit4] 2> 2792656 WARN (NIOServerCxn.Factory:0.0.0.0/0.0.0.0:0) [ ] o.a.z.s.NIOServerCnxn caught end of stream exception
    [junit4] 2> EndOfStreamException: Unable to read additional data from client sessionid 0x155611bbeef0004, likely client has closed socket
    [junit4] 2> at org.apache.zookeeper.server.NIOServerCnxn.doIO(NIOServerCnxn.java:228)
    [junit4] 2> at org.apache.zookeeper.server.NIOServerCnxnFactory.run(NIOServerCnxnFactory.java:208)
    [junit4] 2> at java.lang.Thread.run(Thread.java:745)
    [junit4] 2> 2792656 INFO (jetty-launcher-11008-thread-1) [n:127.0.0.1:55299_solr ] o.a.s.c.c.ConnectionManager Waiting for client to connect to ZooKeeper
    [junit4] 2> 2792656 INFO (jetty-launcher-11008-thread-2) [n:127.0.0.1:55298_solr ] o.a.s.c.ZkController Added new OnReconnect listener org.apache.solr.cloud.ZkController$$Lambda$13/1516015@ac463d
    [junit4] 2> 2792660 INFO (jetty-launcher-11008-thread-2) [n:127.0.0.1:55298_solr ] o.a.s.c.c.ConnectionManager Waiting for client to connect to ZooKeeper
    [junit4] 2> 2792660 INFO (zkCallback-11018-thread-1-processing-n:127.0.0.1:55299_solr) [n:127.0.0.1:55299_solr ] o.a.s.c.c.ConnectionManager Watcher org.apache.solr.common.cloud.ConnectionManager@10a6aa8 name:ZooKeeperConnection Watcher:127.0.0.1:55294/solr got event WatchedEvent state:SyncConnected type:None path:null path:null type:None
    [junit4] 2> 2792660 INFO (jetty-launcher-11008-thread-1) [n:127.0.0.1:55299_solr ] o.a.s.c.c.ConnectionManager Client is connected to ZooKeeper
    [junit4] 2> 2792660 INFO (zkCallback-11019-thread-1-processing-n:127.0.0.1:55298_solr) [n:127.0.0.1:55298_solr ] o.a.s.c.c.ConnectionManager Watcher org.apache.solr.common.cloud.ConnectionManager@1ceff3a name:ZooKeeperConnection Watcher:127.0.0.1:55294/solr got event WatchedEvent state:SyncConnected type:None path:null path:null type:None
    [junit4] 2> 2792660 INFO (jetty-launcher-11008-thread-2) [n:127.0.0.1:55298_solr ] o.a.s.c.c.ConnectionManager Client is connected to ZooKeeper
    [junit4] 2> 2792661 INFO (jetty-launcher-11008-thread-1) [n:127.0.0.1:55299_solr ] o.a.s.c.c.SolrZkClient makePath: /overseer/queue
    [junit4] 2> 2792661 INFO (jetty-launcher-11008-thread-2) [n:127.0.0.1:55298_solr ] o.a.s.c.c.SolrZkClient makePath: /overseer/queue
    [junit4] 2> 2792663 INFO (jetty-launcher-11008-thread-1) [n:127.0.0.1:55299_solr ] o.a.s.c.c.SolrZkClient makePath: /overseer/collection-queue-work
    [junit4] 2> 2792663 INFO (jetty-launcher-11008-thread-2) [n:127.0.0.1:55298_solr ] o.a.s.c.c.SolrZkClient makePath: /overseer/collection-queue-work
    [junit4] 2> 2792667 INFO (jetty-launcher-11008-thread-2) [n:127.0.0.1:55298_solr ] o.a.s.c.c.SolrZkClient makePath: /overseer/collection-map-running
    [junit4] 2> 2792667 INFO (jetty-launcher-11008-thread-1) [n:127.0.0.1:55299_solr ] o.a.s.c.c.SolrZkClient makePath: /overseer/collection-map-running
    [junit4] 2> 2792669 INFO (jetty-launcher-11008-thread-2) [n:127.0.0.1:55298_solr ] o.a.s.c.c.SolrZkClient makePath: /overseer/collection-map-completed
    [junit4] 2> 2792669 INFO (jetty-launcher-11008-thread-1) [n:127.0.0.1:55299_solr ] o.a.s.c.c.SolrZkClient makePath: /overseer/collection-map-completed
    [junit4] 2> 2792671 INFO (jetty-launcher-11008-thread-1) [n:127.0.0.1:55299_solr ] o.a.s.c.c.SolrZkClient makePath: /overseer/collection-map-failure
    [junit4] 2> 2792671 INFO (jetty-launcher-11008-thread-2) [n:127.0.0.1:55298_solr ] o.a.s.c.c.SolrZkClient makePath: /overseer/collection-map-failure
    [junit4] 2> 2792673 INFO (jetty-launcher-11008-thread-1) [n:127.0.0.1:55299_solr ] o.a.s.c.c.SolrZkClient makePath: /live_nodes
    [junit4] 2> 2792673 INFO (jetty-launcher-11008-thread-2) [n:127.0.0.1:55298_solr ] o.a.s.c.c.SolrZkClient makePath: /live_nodes
    [junit4] 2> 2792675 INFO (jetty-launcher-11008-thread-1) [n:127.0.0.1:55299_solr ] o.a.s.c.c.SolrZkClient makePath: /collections
    [junit4] 2> 2792675 INFO (jetty-launcher-11008-thread-2) [n:127.0.0.1:55298_solr ] o.a.s.c.c.SolrZkClient makePath: /collections
    [junit4] 2> 2792675 INFO (jetty-launcher-11008-thread-2) [n:127.0.0.1:55298_solr ] o.a.s.c.c.SolrZkClient makePath: /aliases.json
    [junit4] 2> 2792675 INFO (jetty-launcher-11008-thread-1) [n:127.0.0.1:55299_solr ] o.a.s.c.c.SolrZkClient makePath: /aliases.json
    [junit4] 2> 2792678 INFO (jetty-launcher-11008-thread-2) [n:127.0.0.1:55298_solr ] o.a.s.c.c.SolrZkClient makePath: /clusterstate.json
    [junit4] 2> 2792678 INFO (jetty-launcher-11008-thread-1) [n:127.0.0.1:55299_solr ] o.a.s.c.c.SolrZkClient makePath: /clusterstate.json
    [junit4] 2> 2792680 INFO (jetty-launcher-11008-thread-1) [n:127.0.0.1:55299_solr ] o.a.s.c.c.SolrZkClient makePath: /security.json
    [junit4] 2> 2792680 INFO (jetty-launcher-11008-thread-2) [n:127.0.0.1:55298_solr ] o.a.s.c.c.SolrZkClient makePath: /security.json
    [junit4] 2> 2792680 INFO (jetty-launcher-11008-thread-1) [n:127.0.0.1:55299_solr ] o.a.s.c.c.ZkStateReader Updating cluster state from ZooKeeper...
    [junit4] 2> 2792681 INFO (jetty-launcher-11008-thread-2) [n:127.0.0.1:55298_solr ] o.a.s.c.c.ZkStateReader Updating cluster state from ZooKeeper...
    [junit4] 2> 2792681 INFO (jetty-launcher-11008-thread-1) [n:127.0.0.1:55299_solr ] o.a.s.c.c.ZkStateReader Loaded empty cluster properties
    [junit4] 2> 2792681 INFO (jetty-launcher-11008-thread-2) [n:127.0.0.1:55298_solr ] o.a.s.c.c.ZkStateReader Loaded empty cluster properties
    [junit4] 2> 2792682 INFO (jetty-launcher-11008-thread-1) [n:127.0.0.1:55299_solr ] o.a.s.c.c.ZkStateReader Updated live nodes from ZooKeeper... (0) -> (0)
    [junit4] 2> 2792682 INFO (jetty-launcher-11008-thread-2) [n:127.0.0.1:55298_solr ] o.a.s.c.c.ZkStateReader Updated live nodes from ZooKeeper... (0) -> (0)
    [junit4] 2> 2792685 INFO (jetty-launcher-11008-thread-1) [n:127.0.0.1:55299_solr ] o.a.s.c.c.SolrZkClient makePath: /overseer_elect
    [junit4] 2> 2792685 INFO (jetty-launcher-11008-thread-2) [n:127.0.0.1:55298_solr ] o.a.s.c.c.SolrZkClient makePath: /overseer_elect
    [junit4] 2> 2792686 INFO (jetty-launcher-11008-thread-1) [n:127.0.0.1:55299_solr ] o.a.s.c.c.SolrZkClient makePath: /overseer_elect/election
    [junit4] 2> 2792686 INFO (jetty-launcher-11008-thread-2) [n:127.0.0.1:55298_solr ] o.a.s.c.c.SolrZkClient makePath: /overseer_elect/election
    [junit4] 2> 2792687 INFO (jetty-launcher-11008-thread-2) [n:127.0.0.1:55298_solr ] o.a.s.c.Overseer Overseer (id=null) closing
    [junit4] 2> 2792688 INFO (jetty-launcher-11008-thread-2) [n:127.0.0.1:55298_solr ] o.a.s.c.LeaderElector Joined leadership election with path: /overseer_elect/election/96089738853679110-127.0.0.1:55298_solr-n_0000000000
    [junit4] 2> 2792688 INFO (jetty-launcher-11008-thread-1) [n:127.0.0.1:55299_solr ] o.a.s.c.Overseer Overseer (id=null) closing
    [junit4] 2> 2792689 INFO (jetty-launcher-11008-thread-1) [n:127.0.0.1:55299_solr ] o.a.s.c.LeaderElector Joined leadership election with path: /overseer_elect/election/96089738853679109-127.0.0.1:55299_solr-n_0000000001
    [junit4] 2> 2792689 INFO (jetty-launcher-11008-thread-2) [n:127.0.0.1:55298_solr ] o.a.s.c.OverseerElectionContext I am going to be the leader 127.0.0.1:55298_solr
    [junit4] 2> 2792689 INFO (jetty-launcher-11008-thread-2) [n:127.0.0.1:55298_solr ] o.a.s.c.c.SolrZkClient makePath: /overseer_elect/leader
    [junit4] 2> 2792690 INFO (jetty-launcher-11008-thread-1) [n:127.0.0.1:55299_solr ] o.a.s.c.LeaderElector Watching path /overseer_elect/election/96089738853679110-127.0.0.1:55298_solr-n_0000000000 to know if I could be the leader
    [junit4] 2> 2792690 INFO (jetty-launcher-11008-thread-1) [n:127.0.0.1:55299_solr ] o.a.s.c.ZkController Register node as live in ZooKeeper:/live_nodes/127.0.0.1:55299_solr
    [junit4] 2> 2792690 INFO (jetty-launcher-11008-thread-2) [n:127.0.0.1:55298_solr ] o.a.s.c.Overseer Overseer (id=96089738853679110-127.0.0.1:55298_solr-n_0000000000) starting
    [junit4] 2> 2792691 INFO (jetty-launcher-11008-thread-1) [n:127.0.0.1:55299_solr ] o.a.s.c.c.SolrZkClient makePath: /live_nodes/127.0.0.1:55299_solr
    [junit4] 2> 2792693 INFO (jetty-launcher-11008-thread-2) [n:127.0.0.1:55298_solr ] o.a.s.c.c.SolrZkClient makePath: /overseer/queue-work
    [junit4] 2> 2792693 INFO (zkCallback-11019-thread-1-processing-n:127.0.0.1:55298_solr) [n:127.0.0.1:55298_solr ] o.a.s.c.c.ZkStateReader A live node change: [WatchedEvent state:SyncConnected type:NodeChildrenChanged path:/live_nodes], has occurred - updating... (live nodes size: [0])
    [junit4] 2> 2792693 INFO (zkCallback-11018-thread-1-processing-n:127.0.0.1:55299_solr) [n:127.0.0.1:55299_solr ] o.a.s.c.c.ZkStateReader A live node change: [WatchedEvent state:SyncConnected type:NodeChildrenChanged path:/live_nodes], has occurred - updating... (live nodes size: [0])
    [junit4] 2> 2792693 INFO (zkCallback-11019-thread-1-processing-n:127.0.0.1:55298_solr) [n:127.0.0.1:55298_solr ] o.a.s.c.c.ZkStateReader Updated live nodes from ZooKeeper... (0) -> (1)
    [junit4] 2> 2792694 INFO (zkCallback-11018-thread-1-processing-n:127.0.0.1:55299_solr) [n:127.0.0.1:55299_solr ] o.a.s.c.c.ZkStateReader Updated live nodes from ZooKeeper... (0) -> (1)
    [junit4] 2> 2792700 INFO (jetty-launcher-11008-thread-2) [n:127.0.0.1:55298_solr ] o.a.s.c.OverseerAutoReplicaFailoverThread Starting OverseerAutoReplicaFailoverThread autoReplicaFailoverWorkLoopDelay=10000 autoReplicaFailoverWaitAfterExpiration=30000 autoReplicaFailoverBadNodeExpiration=60000
    [junit4] 2> 2792701 INFO (jetty-launcher-11008-thread-2) [n:127.0.0.1:55298_solr ] o.a.s.c.ZkController Publish node=127.0.0.1:55298_solr as DOWN
    [junit4] 2> 2792701 INFO (OverseerStateUpdate-96089738853679110-127.0.0.1:55298_solr-n_0000000000) [n:127.0.0.1:55298_solr ] o.a.s.c.Overseer Starting to work on the main queue
    [junit4] 2> 2792702 INFO (OverseerCollectionConfigSetProcessor-96089738853679110-127.0.0.1:55298_solr-n_0000000000) [n:127.0.0.1:55298_solr ] o.a.s.c.OverseerTaskProcessor Process current queue of overseer operations
    [junit4] 2> 2792703 INFO (OverseerStateUpdate-96089738853679110-127.0.0.1:55298_solr-n_0000000000) [n:127.0.0.1:55298_solr ] o.a.s.c.c.ZkStateReader Updated live nodes from ZooKeeper... (1) -> (1)
    [junit4] 2> 2792705 INFO (OverseerStateUpdate-96089738853679110-127.0.0.1:55298_solr-n_0000000000) [n:127.0.0.1:55298_solr ] o.a.s.c.Overseer processMessage: queueSize: 1, message = {
    [junit4] 2> "operation":"downnode",
    [junit4] 2> "node_name":"127.0.0.1:55298_solr"} current state version: 0
    [junit4] 2> 2792705 INFO (OverseerStateUpdate-96089738853679110-127.0.0.1:55298_solr-n_0000000000) [n:127.0.0.1:55298_solr ] o.a.s.c.o.NodeMutator DownNode state invoked for node: 127.0.0.1:55298_solr
    [junit4] 2> 2792705 INFO (jetty-launcher-11008-thread-1) [n:127.0.0.1:55299_solr ] o.a.s.c.CoreContainer Security conf doesn't exist. Skipping setup for authorization module.
    [junit4] 2> 2792705 INFO (jetty-launcher-11008-thread-1) [n:127.0.0.1:55299_solr ] o.a.s.c.CoreContainer No authentication plugin used.
    [junit4] 2> 2792706 INFO (jetty-launcher-11008-thread-1) [n:127.0.0.1:55299_solr ] o.a.s.c.CorePropertiesLocator Looking for core definitions underneath C:\Users\jenkins\workspace\Lucene-Solr-6.x-Windows\solr\build\solr-core\test\J0\temp\solr.schema.TestManagedSchemaAPI_FDDAC5C51582F473-001\tempDir-001\node1\.
    [junit4] 2> 2792707 INFO (jetty-launcher-11008-thread-1) [n:127.0.0.1:55299_solr ] o.a.s.c.CorePropertiesLocator Found 0 core definitions
    [junit4] 2> 2792708 INFO (jetty-launcher-11008-thread-1) [n:127.0.0.1:55299_solr ] o.a.s.s.SolrDispatchFilter user.dir=C:\Users\jenkins\workspace\Lucene-Solr-6.x-Windows\solr\build\solr-core\test\J0
    [junit4] 2> 2792708 INFO (jetty-launcher-11008-thread-1) [n:127.0.0.1:55299_solr ] o.a.s.s.SolrDispatchFilter SolrDispatchFilter.init() done
    [junit4] 2> 2793703 INFO (jetty-launcher-11008-thread-2) [n:127.0.0.1:55298_solr ] o.a.s.c.ZkController Register node as live in ZooKeeper:/live_nodes/127.0.0.1:55298_solr
    [junit4] 2> 2793704 INFO (jetty-launcher-11008-thread-2) [n:127.0.0.1:55298_solr ] o.a.s.c.c.SolrZkClient makePath: /live_nodes/127.0.0.1:55298_solr
    [junit4] 2> 2793705 INFO (zkCallback-11019-thread-1-processing-n:127.0.0.1:55298_solr) [n:127.0.0.1:55298_solr ] o.a.s.c.c.ZkStateReader A live node change: [WatchedEvent state:SyncConnected type:NodeChildrenChanged path:/live_nodes], has occurred - updating... (live nodes size: [1])
    [junit4] 2> 2793705 INFO (zkCallback-11018-thread-1-processing-n:127.0.0.1:55299_solr) [n:127.0.0.1:55299_solr ] o.a.s.c.c.ZkStateReader A live node change: [WatchedEvent state:SyncConnected type:NodeChildrenChanged path:/live_nodes], has occurred - updating... (live nodes size: [1])
    [junit4] 2> 2793706 INFO (zkCallback-11019-thread-1-processing-n:127.0.0.1:55298_solr) [n:127.0.0.1:55298_solr ] o.a.s.c.c.ZkStateReader Updated live nodes from ZooKeeper... (1) -> (2)
    [junit4] 2> 2793706 INFO (zkCallback-11018-thread-1-processing-n:127.0.0.1:55299_solr) [n:127.0.0.1:55299_solr ] o.a.s.c.c.ZkStateReader Updated live nodes from ZooKeeper... (1) -> (2)
    [junit4] 2> 2793716 INFO (jetty-launcher-11008-thread-2) [n:127.0.0.1:55298_solr ] o.a.s.c.CoreContainer Security conf doesn't exist. Skipping setup for authorization module.
    [junit4] 2> 2793716 INFO (jetty-launcher-11008-thread-2) [n:127.0.0.1:55298_solr ] o.a.s.c.CoreContainer No authentication plugin used.
    [junit4] 2> 2793716 INFO (jetty-launcher-11008-thread-2) [n:127.0.0.1:55298_solr ] o.a.s.c.CorePropertiesLocator Looking for core definitions underneath C:\Users\jenkins\workspace\Lucene-Solr-6.x-Windows\solr\build\solr-core\test\J0\temp\solr.schema.TestManagedSchemaAPI_FDDAC5C51582F473-001\tempDir-001\node2\.
    [junit4] 2> 2793717 INFO (jetty-launcher-11008-thread-2) [n:127.0.0.1:55298_solr ] o.a.s.c.CorePropertiesLocator Found 0 core definitions
    [junit4] 2> 2793718 INFO (jetty-launcher-11008-thread-2) [n:127.0.0.1:55298_solr ] o.a.s.s.SolrDispatchFilter user.dir=C:\Users\jenkins\workspace\Lucene-Solr-6.x-Windows\solr\build\solr-core\test\J0
    [junit4] 2> 2793718 INFO (jetty-launcher-11008-thread-2) [n:127.0.0.1:55298_solr ] o.a.s.s.SolrDispatchFilter SolrDispatchFilter.init() done
    [junit4] 2> 2793718 INFO (SUITE-TestManagedSchemaAPI-seed#[FDDAC5C51582F473]-worker) [ ] o.a.s.c.c.SolrZkClient Using default ZkCredentialsProvider
    [junit4] 2> 2793720 INFO (SUITE-TestManagedSchemaAPI-seed#[FDDAC5C51582F473]-worker) [ ] o.a.s.c.c.ConnectionManager Waiting for client to connect to ZooKeeper
    [junit4] 2> 2793721 INFO (zkCallback-11022-thread-1) [ ] o.a.s.c.c.ConnectionManager Watcher org.apache.solr.common.cloud.ConnectionManager@19de2eb name:ZooKeeperConnection Watcher:127.0.0.1:55294 got event WatchedEvent state:SyncConnected type:None path:null path:null type:None
    [junit4] 2> 2793721 INFO (SUITE-TestManagedSchemaAPI-seed#[FDDAC5C51582F473]-worker) [ ] o.a.s.c.c.ConnectionManager Client is connected to ZooKeeper
    [junit4] 2> 2793721 INFO (SUITE-TestManagedSchemaAPI-seed#[FDDAC5C51582F473]-worker) [ ] o.a.s.c.c.SolrZkClient Using default ZkACLProvider
    [junit4] 2> 2793725 INFO (SUITE-TestManagedSchemaAPI-seed#[FDDAC5C51582F473]-worker) [ ] o.a.s.c.s.i.CloudSolrClient Final constructed zkHost string: 127.0.0.1:55294/solr
    [junit4] 2> 2793725 INFO (SUITE-TestManagedSchemaAPI-seed#[FDDAC5C51582F473]-worker) [ ] o.a.s.c.c.SolrZkClient Using default ZkCredentialsProvider
    [junit4] 2> 2793726 INFO (SUITE-TestManagedSchemaAPI-seed#[FDDAC5C51582F473]-worker) [ ] o.a.s.c.c.ConnectionManager Waiting for client to connect to ZooKeeper
    [junit4] 2> 2793729 INFO (zkCallback-11025-thread-1) [ ] o.a.s.c.c.ConnectionManager Watcher org.apache.solr.common.cloud.ConnectionManager@13ecf4c name:ZooKeeperConnection Watcher:127.0.0.1:55294/solr got event WatchedEvent state:SyncConnected type:None path:null path:null type:None
    [junit4] 2> 2793730 INFO (SUITE-TestManagedSchemaAPI-seed#[FDDAC5C51582F473]-worker) [ ] o.a.s.c.c.ConnectionManager Client is connected to ZooKeeper
    [junit4] 2> 2793730 INFO (SUITE-TestManagedSchemaAPI-seed#[FDDAC5C51582F473]-worker) [ ] o.a.s.c.c.SolrZkClient Using default ZkACLProvider
    [junit4] 2> 2793730 INFO (SUITE-TestManagedSchemaAPI-seed#[FDDAC5C51582F473]-worker) [ ] o.a.s.c.c.ZkStateReader Updating cluster state from ZooKeeper...
    [junit4] 2> 2793732 INFO (SUITE-TestManagedSchemaAPI-seed#[FDDAC5C51582F473]-worker) [ ] o.a.s.c.c.ZkStateReader Loaded empty cluster properties
    [junit4] 2> 2793734 INFO (SUITE-TestManagedSchemaAPI-seed#[FDDAC5C51582F473]-worker) [ ] o.a.s.c.c.ZkStateReader Updated live nodes from ZooKeeper... (0) -> (2)
    [junit4] 2> 2793738 INFO (SUITE-TestManagedSchemaAPI-seed#[FDDAC5C51582F473]-worker) [ ] o.a.s.c.c.SolrZkClient makePath: /configs/conf1/managed-schema
    [junit4] 2> 2793745 INFO (SUITE-TestManagedSchemaAPI-seed#[FDDAC5C51582F473]-worker) [ ] o.a.s.c.c.SolrZkClient makePath: /configs/conf1/solrconfig.xml
    [junit4] 2> 2793775 INFO (TEST-TestManagedSchemaAPI.test-seed#[FDDAC5C51582F473]) [ ] o.a.s.SolrTestCaseJ4 ###Starting test
    [junit4] 2> 2793779 INFO (qtp1275748-47705) [n:127.0.0.1:55299_solr ] o.a.s.h.a.CollectionsHandler Invoked Collection Action :create with params replicationFactor=2&collection.configName=conf1&name=testschemaapi&action=CREATE&numShards=1&wt=javabin&version=2 and sendToOCPQueue=true
    [junit4] 2> 2793782 INFO (OverseerCollectionConfigSetProcessor-96089738853679110-127.0.0.1:55298_solr-n_0000000000) [n:127.0.0.1:55298_solr ] o.a.s.c.OverseerTaskProcessor Overseer Collection Message Handler: Get the message id:/overseer/collection-queue-work/qn-0000000000 message:{
    [junit4] 2> "name":"testschemaapi",
    [junit4] 2> "fromApi":"true",
    [junit4] 2> "replicationFactor":"2",
    [junit4] 2> "collection.configName":"conf1",
    [junit4] 2> "numShards":"1",
    [junit4] 2> "stateFormat":"2",
    [junit4] 2> "operation":"create"}
    [junit4] 2> 2793783 INFO (OverseerThreadFactory-10982-thread-1-processing-n:127.0.0.1:55298_solr) [n:127.0.0.1:55298_solr ] o.a.s.c.OverseerCollectionMessageHandler OverseerCollectionMessageHandler.processMessage : create , {
    [junit4] 2> "name":"testschemaapi",
    [junit4] 2> "fromApi":"true",
    [junit4] 2> "replicationFactor":"2",
    [junit4] 2> "collection.configName":"conf1",
    [junit4] 2> "numShards":"1",
    [junit4] 2> "stateFormat":"2",
    [junit4] 2> "operation":"create"}
    [junit4] 2> 2793783 INFO (OverseerThreadFactory-10982-thread-1-processing-n:127.0.0.1:55298_solr) [n:127.0.0.1:55298_solr ] o.a.s.c.OverseerCollectionMessageHandler Create collection testschemaapi
    [junit4] 2> 2793784 INFO (OverseerThreadFactory-10982-thread-1-processing-n:127.0.0.1:55298_solr) [n:127.0.0.1:55298_solr ] o.a.s.c.OverseerCollectionMessageHandler creating collections conf node /collections/testschemaapi
    [junit4] 2> 2793785 INFO (OverseerThreadFactory-10982-thread-1-processing-n:127.0.0.1:55298_solr) [n:127.0.0.1:55298_solr ] o.a.s.c.c.SolrZkClient makePath: /collections/testschemaapi
    [junit4] 2> 2793788 INFO (zkCallback-11025-thread-1) [ ] o.a.s.c.c.ZkStateReader A collections change: [WatchedEvent state:SyncConnected type:NodeChildrenChanged path:/collections], has occurred - updating...
    [junit4] 2> 2793788 INFO (zkCallback-11019-thread-1-processing-n:127.0.0.1:55298_solr) [n:127.0.0.1:55298_solr ] o.a.s.c.c.ZkStateReader A collections change: [WatchedEvent state:SyncConnected type:NodeChildrenChanged path:/collections], has occurred - updating...
    [junit4] 2> 2793789 INFO (zkCallback-11018-thread-1-processing-n:127.0.0.1:55299_solr) [n:127.0.0.1:55299_solr ] o.a.s.c.c.ZkStateReader A collections change: [WatchedEvent state:SyncConnected type:NodeChildrenChanged path:/collections], has occurred - updating...
    [junit4] 2> 2793791 INFO (OverseerStateUpdate-96089738853679110-127.0.0.1:55298_solr-n_0000000000) [n:127.0.0.1:55298_solr ] o.a.s.c.Overseer processMessage: queueSize: 1, message = {
    [junit4] 2> "name":"testschemaapi",
    [junit4] 2> "fromApi":"true",
    [junit4] 2> "replicationFactor":"2",
    [junit4] 2> "collection.configName":"conf1",
    [junit4] 2> "numShards":"1",
    [junit4] 2> "stateFormat":"2",
    [junit4] 2> "operation":"create"} current state version: 0
    [junit4] 2> 2793791 INFO (OverseerStateUpdate-96089738853679110-127.0.0.1:55298_solr-n_0000000000) [n:127.0.0.1:55298_solr ] o.a.s.c.o.ClusterStateMutator building a new cName: testschemaapi
    [junit4] 2> 2793794 INFO (OverseerStateUpdate-96089738853679110-127.0.0.1:55298_solr-n_0000000000) [n:127.0.0.1:55298_solr ] o.a.s.c.o.ZkStateWriter going to create_collection /collections/testschemaapi/state.json
    [junit4] 2> 2793890 INFO (OverseerThreadFactory-10982-thread-1-processing-n:127.0.0.1:55298_solr) [n:127.0.0.1:55298_solr ] o.a.s.c.OverseerCollectionMessageHandler Creating SolrCores for new collection testschemaapi, shardNames [shard1] , replicationFactor : 2
    [junit4] 2> 2793890 INFO (OverseerThreadFactory-10982-thread-1-processing-n:127.0.0.1:55298_solr) [n:127.0.0.1:55298_solr ] o.a.s.c.OverseerCollectionMessageHandler Creating core testschemaapi_shard1_replica1 as part of shard shard1 of collection testschemaapi on 127.0.0.1:55298_solr
    [junit4] 2> 2793890 INFO (OverseerThreadFactory-10982-thread-1-processing-n:127.0.0.1:55298_solr) [n:127.0.0.1:55298_solr ] o.a.s.c.OverseerCollectionMessageHandler Creating core testschemaapi_shard1_replica2 as part of shard shard1 of collection testschemaapi on 127.0.0.1:55299_solr
    [junit4] 2> 2793898 INFO (qtp1275748-47708) [n:127.0.0.1:55299_solr ] o.a.s.h.a.CoreAdminOperation core create command qt=/admin/cores&collection.configName=conf1&name=testschemaapi_shard1_replica2&action=CREATE&numShards=1&collection=testschemaapi&shard=shard1&wt=javabin&version=2
    [junit4] 2> 2793900 INFO (qtp22088575-47706) [n:127.0.0.1:55298_solr ] o.a.s.h.a.CoreAdminOperation core create command qt=/admin/cores&collection.configName=conf1&name=testschemaapi_shard1_replica1&action=CREATE&numShards=1&collection=testschemaapi&shard=shard1&wt=javabin&version=2
    [junit4] 2> 2793902 INFO (qtp1275748-47708) [n:127.0.0.1:55299_solr ] o.a.s.c.CoreDescriptor Created CoreDescriptor: {name=testschemaapi_shard1_replica2, collection.configName=conf1, config=solrconfig.xml, transient=false, schema=schema.xml, loadOnStartup=true, configSetProperties=configsetprops.json, collection=testschemaapi, numShards=1, dataDir=data\, shard=shard1}
    [junit4] 2> 2793903 INFO (qtp22088575-47706) [n:127.0.0.1:55298_solr ] o.a.s.c.CoreDescriptor Created CoreDescriptor: {name=testschemaapi_shard1_replica1, collection.configName=conf1, config=solrconfig.xml, transient=false, schema=schema.xml, loadOnStartup=true, configSetProperties=configsetprops.json, collection=testschemaapi, numShards=1, dataDir=data\, shard=shard1}
    [junit4] 2> 2793904 INFO (qtp1275748-47708) [n:127.0.0.1:55299_solr c:testschemaapi s:shard1 x:testschemaapi_shard1_replica2] o.a.s.c.ZkController publishing state=down
    [junit4] 2> 2793904 INFO (qtp22088575-47706) [n:127.0.0.1:55298_solr c:testschemaapi s:shard1 x:testschemaapi_shard1_replica1] o.a.s.c.ZkController publishing state=down
    [junit4] 2> 2793905 INFO (qtp22088575-47706) [n:127.0.0.1:55298_solr c:testschemaapi s:shard1 x:testschemaapi_shard1_replica1] o.a.s.c.ZkController Registering watch for collection testschemaapi
    [junit4] 2> 2793906 INFO (qtp1275748-47708) [n:127.0.0.1:55299_solr c:testschemaapi s:shard1 x:testschemaapi_shard1_replica2] o.a.s.c.ZkController Registering watch for collection testschemaapi
    [junit4] 2> 2793906 INFO (qtp22088575-47706) [n:127.0.0.1:55298_solr c:testschemaapi s:shard1 x:testschemaapi_shard1_replica1] o.a.s.c.c.ZkStateReader Add data for [testschemaapi] ver [0]
    [junit4] 2> 2793906 INFO (OverseerStateUpdate-96089738853679110-127.0.0.1:55298_solr-n_0000000000) [n:127.0.0.1:55298_solr ] o.a.s.c.Overseer processMessage: queueSize: 2, message = {
    [junit4] 2> "core":"testschemaapi_shard1_replica1",
    [junit4] 2> "roles":null,
    [junit4] 2> "base_url":"http://127.0.0.1:55298/solr",
    [junit4] 2> "node_name":"127.0.0.1:55298_solr",
    [junit4] 2> "numShards":"1",
    [junit4] 2> "state":"down",
    [junit4] 2> "shard":"shard1",
    [junit4] 2> "collection":"testschemaapi",
    [junit4] 2> "operation":"state"} current state version: 0
    [junit4] 2> 2793906 INFO (qtp22088575-47706) [n:127.0.0.1:55298_solr c:testschemaapi s:shard1 x:testschemaapi_shard1_replica1] o.a.s.c.ZkController look for our core node name
    [junit4] 2> 2793906 INFO (qtp1275748-47708) [n:127.0.0.1:55299_solr c:testschemaapi s:shard1 x:testschemaapi_shard1_replica2] o.a.s.c.c.ZkStateReader Add data for [testschemaapi] ver [0]
    [junit4] 2> 2793906 INFO (OverseerStateUpdate-96089738853679110-127.0.0.1:55298_solr-n_0000000000) [n:127.0.0.1:55298_solr ] o.a.s.c.o.ReplicaMutator Update state numShards=1 message={
    [junit4] 2> "core":"testschemaapi_shard1_replica1",
    [junit4] 2> "roles":null,
    [junit4] 2> "base_url":"http://127.0.0.1:55298/solr",
    [junit4] 2> "node_name":"127.0.0.1:55298_solr",
    [junit4] 2> "numShards":"1",
    [junit4] 2> "state":"down",
    [junit4] 2> "shard":"shard1",
    [junit4] 2> "collection":"testschemaapi",
    [junit4] 2> "operation":"state"}
    [junit4] 2> 2793906 INFO (qtp1275748-47708) [n:127.0.0.1:55299_solr c:testschemaapi s:shard1 x:testschemaapi_shard1_replica2] o.a.s.c.ZkController look for our core node name
    [junit4] 2> 2793909 INFO (OverseerStateUpdate-96089738853679110-127.0.0.1:55298_solr-n_0000000000) [n:127.0.0.1:55298_solr ] o.a.s.c.Overseer processMessage: queueSize: 2, message = {
    [junit4] 2> "core":"testschemaapi_shard1_replica2",
    [junit4] 2> "roles":null,
    [junit4] 2> "base_url":"http://127.0.0.1:55299/solr",
    [junit4] 2> "node_name":"127.0.0.1:55299_solr",
    [junit4] 2> "numShards":"1",
    [junit4] 2> "state":"down",
    [junit4] 2> "shard":"shard1",
    [junit4] 2> "collection":"testschemaapi",
    [junit4] 2> "operation":"state"} current state version: 0
    [junit4] 2> 2793909 INFO (OverseerStateUpdate-96089738853679110-127.0.0.1:55298_solr-n_0000000000) [n:127.0.0.1:55298_solr ] o.a.s.c.o.ReplicaMutator Update state numShards=1 message={
    [junit4] 2> "core":"testschemaapi_shard1_replica2",
    [junit4] 2> "roles":null,
    [junit4] 2> "base_url":"http://127.0.0.1:55299/solr",
    [junit4] 2> "node_name":"127.0.0.1:55299_solr",
    [junit4] 2> "numShards":"1",
    [junit4] 2> "state":"down",
    [junit4] 2> "shard":"shard1",
    [junit4] 2> "collection":"testschemaapi",
    [junit4] 2> "operation":"state"}
    [junit4] 2> 2794013 INFO (OverseerStateUpdate-96089738853679110-127.0.0.1:55298_solr-n_0000000000) [n:127.0.0.1:55298_solr ] o.a.s.c.o.ZkStateWriter going to update_collection /collections/testschemaapi/state.json version: 0
    [junit4] 2> 2794014 INFO (zkCallback-11019-thread-1-processing-n:127.0.0.1:55298_solr) [n:127.0.0.1:55298_solr ] o.a.s.c.c.ZkStateReader A cluster state change: [WatchedEvent state:SyncConnected type:NodeDataChanged path:/collections/testschemaapi/state.json] for collection [testschemaapi] has occurred - updating... (live nodes size: [2])
    [junit4] 2> 2794014 INFO (zkCallback-11018-thread-1-processing-n:127.0.0.1:55299_solr) [n:127.0.0.1:55299_solr ] o.a.s.c.c.ZkStateReader A cluster state change: [WatchedEvent state:SyncConnected type:NodeDataChanged path:/collections/testschemaapi/state.json] for collection [testschemaapi] has occurred - updating... (live nodes size: [2])
    [junit4] 2> 2794015 INFO (zkCallback-11019-thread-1-processing-n:127.0.0.1:55298_solr) [n:127.0.0.1:55298_solr ] o.a.s.c.c.ZkStateReader Updating data for [testschemaapi] from [0] to [1]
    [junit4] 2> 2794015 INFO (zkCallback-11018-thread-1-processing-n:127.0.0.1:55299_solr) [n:127.0.0.1:55299_solr ] o.a.s.c.c.ZkStateReader Updating data for [testschemaapi] from [0] to [1]
    [junit4] 2> 2794907 INFO (qtp22088575-47706) [n:127.0.0.1:55298_solr c:testschemaapi s:shard1 x:testschemaapi_shard1_replica1] o.a.s.c.ZkController waiting to find shard id in clusterstate for testschemaapi_shard1_replica1
    [junit4] 2> 2794907 INFO (qtp22088575-47706) [n:127.0.0.1:55298_solr c:testschemaapi s:shard1 x:testschemaapi_shard1_replica1] o.a.s.c.ZkController Check for collection zkNode:testschemaapi
    [junit4] 2> 2794907 INFO (qtp22088575-47706) [n:127.0.0.1:55298_solr c:testschemaapi s:shard1 x:testschemaapi_shard1_replica1] o.a.s.c.ZkController Collection zkNode exists
    [junit4] 2> 2794907 INFO (qtp22088575-47706) [n:127.0.0.1:55298_solr c:testschemaapi s:shard1 x:testschemaapi_shard1_replica1] o.a.s.c.c.ZkStateReader Load collection config from: [/collections/testschemaapi]
    [junit4] 2> 2794908 INFO (qtp1275748-47708) [n:127.0.0.1:55299_solr c:testschemaapi s:shard1 x:testschemaapi_shard1_replica2] o.a.s.c.ZkController waiting to find shard id in clusterstate for testschemaapi_shard1_replica2
    [junit4] 2> 2794908 INFO (qtp1275748-47708) [n:127.0.0.1:55299_solr c:testschemaapi s:shard1 x:testschemaapi_shard1_replica2] o.a.s.c.ZkController Check for collection zkNode:testschemaapi
    [junit4] 2> 2794908 INFO (qtp1275748-47708) [n:127.0.0.1:55299_solr c:testschemaapi s:shard1 x:testschemaapi_shard1_replica2] o.a.s.c.ZkController Collection zkNode exists
    [junit4] 2> 2794908 INFO (qtp1275748-47708) [n:127.0.0.1:55299_solr c:testschemaapi s:shard1 x:testschemaapi_shard1_replica2] o.a.s.c.c.ZkStateReader Load collection config from: [/collections/testschemaapi]
    [junit4] 2> 2794909 INFO (qtp22088575-47706) [n:127.0.0.1:55298_solr c:testschemaapi s:shard1 x:testschemaapi_shard1_replica1] o.a.s.c.c.ZkStateReader path=[/collections/testschemaapi] [configName]=[conf1] specified config exists in ZooKeeper
    [junit4] 2> 2794909 INFO (qtp22088575-47706) [n:127.0.0.1:55298_solr c:testschemaapi s:shard1 x:testschemaapi_shard1_replica1] o.a.s.c.SolrResourceLoader new SolrResourceLoader for directory: 'C:\Users\jenkins\workspace\Lucene-Solr-6.x-Windows\solr\build\solr-core\test\J0\temp\solr.schema.TestManagedSchemaAPI_FDDAC5C51582F473-001\tempDir-001\node2\testschemaapi_shard1_replica1'
    [junit4] 2> 2794909 INFO (qtp22088575-47706) [n:127.0.0.1:55298_solr c:testschemaapi s:shard1 x:testschemaapi_shard1_replica1] o.a.s.c.SolrResourceLoader JNDI not configured for solr (NoInitialContextEx)
    [junit4] 2> 2794909 INFO (qtp22088575-47706) [n:127.0.0.1:55298_solr c:testschemaapi s:shard1 x:testschemaapi_shard1_replica1] o.a.s.c.SolrResourceLoader solr home defaulted to 'solr/' (could not find system property or JNDI)
    [junit4] 2> 2794909 INFO (qtp1275748-47708) [n:127.0.0.1:55299_solr c:testschemaapi s:shard1 x:testschemaapi_shard1_replica2] o.a.s.c.c.ZkStateReader path=[/collections/testschemaapi] [configName]=[conf1] specified config exists in ZooKeeper
    [junit4] 2> 2794909 INFO (qtp1275748-47708) [n:127.0.0.1:55299_solr c:testschemaapi s:shard1 x:testschemaapi_shard1_replica2] o.a.s.c.SolrResourceLoader new SolrResourceLoader for directory: 'C:\Users\jenkins\workspace\Lucene-Solr-6.x-Windows\solr\build\solr-core\test\J0\temp\solr.schema.TestManagedSchemaAPI_FDDAC5C51582F473-001\tempDir-001\node1\testschemaapi_shard1_replica2'
    [junit4] 2> 2794909 INFO (qtp1275748-47708) [n:127.0.0.1:55299_solr c:testschemaapi s:shard1 x:testschemaapi_shard1_replica2] o.a.s.c.SolrResourceLoader JNDI not configured for solr (NoInitialContextEx)
    [junit4] 2> 2794909 INFO (qtp1275748-47708) [n:127.0.0.1:55299_solr c:testschemaapi s:shard1 x:testschemaapi_shard1_replica2] o.a.s.c.SolrResourceLoader solr home defaulted to 'solr/' (could not find system property or JNDI)
    [junit4] 2> 2794912 INFO (qtp22088575-47706) [n:127.0.0.1:55298_solr c:testschemaapi s:shard1 x:testschemaapi_shard1_replica1] o.a.s.c.Config loaded config solrconfig.xml with version 0
    [junit4] 2> 2794913 INFO (qtp1275748-47708) [n:127.0.0.1:55299_solr c:testschemaapi s:shard1 x:testschemaapi_shard1_replica2] o.a.s.c.Config loaded config solrconfig.xml with version 0
    [junit4] 2> 2794915 INFO (qtp22088575-47706) [n:127.0.0.1:55298_solr c:testschemaapi s:shard1 x:testschemaapi_shard1_replica1] o.a.s.c.SolrConfig current version of requestparams : -1
    [junit4] 2> 2794916 INFO (qtp1275748-47708) [n:127.0.0.1:55299_solr c:testschemaapi s:shard1 x:testschemaapi_shard1_replica2] o.a.s.c.SolrConfig current version of requestparams : -1
    [junit4] 2> 2794917 INFO (qtp1275748-47708) [n:127.0.0.1:55299_solr c:testschemaapi s:shard1 x:testschemaapi_shard1_replica2] o.a.s.c.SolrConfig Using Lucene MatchVersion: 6.2.0
    [junit4] 2> 2794917 INFO (qtp22088575-47706) [n:127.0.0.1:55298_solr c:testschemaapi s:shard1 x:testschemaapi_shard1_replica1] o.a.s.c.SolrConfig Using Lucene MatchVersion: 6.2.0
    [junit4] 2> 2794920 INFO (qtp1275748-47708) [n:127.0.0.1:55299_solr c:testschemaapi s:shard1 x:testschemaapi_shard1_replica2] o.a.s.c.SolrConfig Loaded SolrConfig: solrconfig.xml
    [junit4] 2> 2794920 INFO (qtp22088575-47706) [n:127.0.0.1:55298_solr c:testschemaapi s:shard1 x:testschemaapi_shard1_replica1] o.a.s.c.SolrConfig Loaded SolrConfig: solrconfig.xml
    [junit4] 2> 2794924 INFO (qtp1275748-47708) [n:127.0.0.1:55299_solr c:testschemaapi s:shard1 x:testschemaapi_shard1_replica2] o.a.s.s.IndexSchema [testschemaapi_shard1_replica2] Schema name=minimal
    [junit4] 2> 2794924 INFO (qtp22088575-47706) [n:127.0.0.1:55298_solr c:testschemaapi s:shard1 x:testschemaapi_shard1_replica1] o.a.s.s.IndexSchema [testschemaapi_shard1_replica1] Schema name=minimal
    [junit4] 2> 2794926 INFO (qtp1275748-47708) [n:127.0.0.1:55299_solr c:testschemaapi s:shard1 x:testschemaapi_shard1_replica2] o.a.s.s.IndexSchema unique key field: id
    [junit4] 2> 2794926 INFO (qtp22088575-47706) [n:127.0.0.1:55298_solr c:testschemaapi s:shard1 x:testschemaapi_shard1_replica1] o.a.s.s.IndexSchema unique key field: id
    [junit4] 2> 2794928 INFO (qtp1275748-47708) [n:127.0.0.1:55299_solr c:testschemaapi s:shard1 x:testschemaapi_shard1_replica2] o.a.s.c.ConfigSetProperties Did not find ConfigSet properties, assuming default properties: Can't find resource 'configsetprops.json' in classpath or '/configs/conf1', cwd=C:\Users\jenkins\workspace\Lucene-Solr-6.x-Windows\solr\build\solr-core\test\J0
    [junit4] 2> 2794928 INFO (qtp22088575-47706) [n:127.0.0.1:55298_solr c:testschemaapi s:shard1 x:testschemaapi_shard1_replica1] o.a.s.c.ConfigSetProperties Did not find ConfigSet properties, assuming default properties: Can't find resource 'configsetprops.json' in classpath or '/configs/conf1', cwd=C:\Users\jenkins\workspace\Lucene-Solr-6.x-Windows\solr\build\solr-core\test\J0
    [junit4] 2> 2794928 INFO (qtp1275748-47708) [n:127.0.0.1:55299_solr c:testschemaapi s:shard1 x:testschemaapi_shard1_replica2] o.a.s.c.CoreContainer Creating SolrCore 'testschemaapi_shard1_replica2' using configuration from collection testschemaapi
    [junit4] 2> 2794928 INFO (qtp22088575-47706) [n:127.0.0.1:55298_solr c:testschemaapi s:shard1 x:testschemaapi_shard1_replica1] o.a.s.c.CoreContainer Creating SolrCore 'testschemaapi_shard1_replica1' using configuration from collection testschemaapi
    [junit4] 2> 2794928 INFO (qtp1275748-47708) [n:127.0.0.1:55299_solr c:testschemaapi s:shard1 r:core_node2 x:testschemaapi_shard1_replica2] o.a.s.c.SolrCore org.apache.solr.core.MockDirectoryFactory
    [junit4] 2> 2794928 INFO (qtp22088575-47706) [n:127.0.0.1:55298_solr c:testschemaapi s:shard1 r:core_node1 x:testschemaapi_shard1_replica1] o.a.s.c.SolrCore org.apache.solr.core.MockDirectoryFactory
    [junit4] 2> 2794929 INFO (qtp1275748-47708) [n:127.0.0.1:55299_solr c:testschemaapi s:shard1 r:core_node2 x:testschemaapi_shard1_replica2] o.a.s.c.SolrCore [[testschemaapi_shard1_replica2] ] Opening new SolrCore at [C:\Users\jenkins\workspace\Lucene-Solr-6.x-Windows\solr\build\solr-core\test\J0\temp\solr.schema.TestManagedSchemaAPI_FDDAC5C51582F473-001\tempDir-001\node1\testschemaapi_shard1_replica2], dataDir=[C:\Users\jenkins\workspace\Lucene-Solr-6.x-Windows\solr\build\solr-core\test\J0\temp\solr.schema.TestManagedSchemaAPI_FDDAC5C51582F473-001\tempDir-001\node1\.\testschemaapi_shard1_replica2\data\]
    [junit4] 2> 2794929 INFO (qtp22088575-47706) [n:127.0.0.1:55298_solr c:testschemaapi s:shard1 r:core_node1 x:testschemaapi_shard1_replica1] o.a.s.c.SolrCore [[testschemaapi_shard1_replica1] ] Opening new SolrCore at [C:\Users\jenkins\workspace\Lucene-Solr-6.x-Windows\solr\build\solr-core\test\J0\temp\solr.schema.TestManagedSchemaAPI_FDDAC5C51582F473-001\tempDir-001\node2\testschemaapi_shard1_replica1], dataDir=[C:\Users\jenkins\workspace\Lucene-Solr-6.x-Windows\solr\build\solr-core\test\J0\temp\solr.schema.TestManagedSchemaAPI_FDDAC5C51582F473-001\tempDir-001\node2\.\testschemaapi_shard1_replica1\data\]
    [junit4] 2> 2794929 INFO (qtp22088575-47706) [n:127.0.0.1:55298_solr c:testschemaapi s:shard1 r:core_node1 x:testschemaapi_shard1_replica1] o.a.s.c.SolrCore JMX monitoring not detected for core: testschemaapi_shard1_replica1
    [junit4] 2> 2794929 INFO (qtp1275748-47708) [n:127.0.0.1:55299_solr c:testschemaapi s:shard1 r:core_node2 x:testschemaapi_shard1_replica2] o.a.s.c.SolrCore JMX monitoring not detected for core: testschemaapi_shard1_replica2
    [junit4] 2> 2794930 INFO (qtp22088575-47706) [n:127.0.0.1:55298_solr c:testschemaapi s:shard1 r:core_node1 x:testschemaapi_shard1_replica1] o.a.s.c.CachingDirectoryFactory return new directory for C:\Users\jenkins\workspace\Lucene-Solr-6.x-Windows\solr\build\solr-core\test\J0\temp\solr.schema.TestManagedSchemaAPI_FDDAC5C51582F473-001\tempDir-001\node2\.\testschemaapi_shard1_replica1\data\
    [junit4] 2> 2794930 INFO (qtp22088575-47706) [n:127.0.0.1:55298_solr c:testschemaapi s:shard1 r:core_node1 x:testschemaapi_shard1_replica1] o.a.s.c.SolrCore New index directory detected: old=null new=C:\Users\jenkins\workspace\Lucene-Solr-6.x-Windows\solr\build\solr-core\test\J0\temp\solr.schema.TestManagedSchemaAPI_FDDAC5C51582F473-001\tempDir-001\node2\.\testschemaapi_shard1_replica1\data\index/
    [junit4] 2> 2794930 INFO (qtp1275748-47708) [n:127.0.0.1:55299_solr c:testschemaapi s:shard1 r:core_node2 x:testschemaapi_shard1_replica2] o.a.s.c.CachingDirectoryFactory return new directory for C:\Users\jenkins\workspace\Lucene-Solr-6.x-Windows\solr\build\solr-core\test\J0\temp\solr.schema.TestManagedSchemaAPI_FDDAC5C51582F473-001\tempDir-001\node1\.\testschemaapi_shard1_replica2\data\
    [junit4] 2> 2794930 WARN (qtp22088575-47706) [n:127.0.0.1:55298_solr c:testschemaapi s:shard1 r:core_node1 x:testschemaapi_shard1_replica1] o.a.s.c.SolrCore [testschemaapi_shard1_replica1] Solr index directory 'C:\Users\jenkins\workspace\Lucene-Solr-6.x-Windows\solr\build\solr-core\test\J0\temp\solr.schema.TestManagedSchemaAPI_FDDAC5C51582F473-001\tempDir-001\node2\.\testschemaapi_shard1_replica1\data\index' doesn't exist. Creating new index...
    [junit4] 2> 2794930 INFO (qtp1275748-47708) [n:127.0.0.1:55299_solr c:testschemaapi s:shard1 r:core_node2 x:testschemaapi_shard1_replica2] o.a.s.c.SolrCore New index directory detected: old=null new=C:\Users\jenkins\workspace\Lucene-Solr-6.x-Windows\solr\build\solr-core\test\J0\temp\solr.schema.TestManagedSchemaAPI_FDDAC5C51582F473-001\tempDir-001\node1\.\testschemaapi_shard1_replica2\data\index/
    [junit4] 2> 2794930 WARN (qtp1275748-47708) [n:127.0.0.1:55299_solr c:testschemaapi s:shard1 r:core_node2 x:testschemaapi_shard1_replica2] o.a.s.c.SolrCore [testschemaapi_shard1_replica2] Solr index directory 'C:\Users\jenkins\workspace\Lucene-Solr-6.x-Windows\solr\build\solr-core\test\J0\temp\solr.schema.TestManagedSchemaAPI_FDDAC5C51582F473-001\tempDir-001\node1\.\testschemaapi_shard1_replica2\data\index' doesn't exist. Creating new index...
    [junit4] 2> 2794930 INFO (qtp22088575-47706) [n:127.0.0.1:55298_solr c:testschemaapi s:shard1 r:core_node1 x:testschemaapi_shard1_replica1] o.a.s.c.CachingDirectoryFactory return new directory for C:\Users\jenkins\workspace\Lucene-Solr-6.x-Windows\solr\build\solr-core\test\J0\temp\solr.schema.TestManagedSchemaAPI_FDDAC5C51582F473-001\tempDir-001\node2\.\testschemaapi_shard1_replica1\data\index
    [junit4] 2> 2794931 INFO (qtp1275748-47708) [n:127.0.0.1:55299_solr c:testschemaapi s:shard1 r:core_node2 x:testschemaapi_shard1_replica2] o.a.s.c.CachingDirectoryFactory return new directory for C:\Users\jenkins\workspace\Lucene-Solr-6.x-Windows\solr\build\solr-core\test\J0\temp\solr.schema.TestManagedSchemaAPI_FDDAC5C51582F473-001\tempDir-001\node1\.\testschemaapi_shard1_replica2\data\index
    [junit4] 2> 2794931 INFO (qtp22088575-47706) [n:127.0.0.1:55298_solr c:testschemaapi s:shard1 r:core_node1 x:testschemaapi_shard1_replica1] o.a.s.c.SolrDeletionPolicy SolrDeletionPolicy.onCommit: commits: num=1
    [junit4] 2> commit{dir=MockDirectoryWrapper(RAMDirectory@15d6c6e lockFactory=org.apache.lucene.store.SingleInstanceLockFactory@160eee5),segFN=segments_1,generation=1}
    [junit4] 2> 2794931 INFO (qtp1275748-47708) [n:127.0.0.1:55299_solr c:testschemaapi s:shard1 r:core_node2 x:testschemaapi_shard1_replica2] o.a.s.c.SolrDeletionPolicy SolrDeletionPolicy.onCommit: commits: num=1
    [junit4] 2> commit{dir=MockDirectoryWrapper(RAMDirectory@1fe8946 lockFactory=org.apache.lucene.store.SingleInstanceLockFactory@1234f44),segFN=segments_1,generation=1}
    [junit4] 2> 2794931 INFO (qtp22088575-47706) [n:127.0.0.1:55298_solr c:testschemaapi s:shard1 r:core_node1 x:testschemaapi_shard1_replica1] o.a.s.c.SolrDeletionPolicy newest commit generation = 1
    [junit4] 2> 2794931 INFO (qtp1275748-47708) [n:127.0.0.1:55299_solr c:testschemaapi s:shard1 r:core_node2 x:testschemaapi_shard1_replica2] o.a.s.c.SolrDeletionPolicy newest commit generation = 1
    [junit4] 2> 2794935 INFO (qtp22088575-47706) [n:127.0.0.1:55298_solr c:testschemaapi s:shard1 r:core_node1 x:testschemaapi_shard1_replica1] o.a.s.c.SolrCore no updateRequestProcessorChain defined as default, creating implicit default
    [junit4] 2> 2794935 INFO (qtp1275748-47708) [n:127.0.0.1:55299_solr c:testschemaapi s:shard1 r:core_node2 x:testschemaapi_shard1_replica2] o.a.s.c.SolrCore no updateRequestProcessorChain defined as default, creating implicit default
    [junit4] 2> 2794936 INFO (qtp22088575-47706) [n:127.0.0.1:55298_solr c:testschemaapi s:shard1 r:core_node1 x:testschemaapi_shard1_replica1] o.a.s.h.l.XMLLoader xsltCacheLifetimeSeconds=60
    [junit4] 2> 2794936 INFO (qtp1275748-47708) [n:127.0.0.1:55299_solr c:testschemaapi s:shard1 r:core_node2 x:testschemaapi_shard1_replica2] o.a.s.h.l.XMLLoader xsltCacheLifetimeSeconds=60
    [junit4] 2> 2794937 INFO (qtp22088575-47706) [n:127.0.0.1:55298_solr c:testschemaapi s:shard1 r:core_node1 x:testschemaapi_shard1_replica1] o.a.s.h.l.XMLLoader xsltCacheLifetimeSeconds=60
    [junit4] 2> 2794938 INFO (qtp22088575-47706) [n:127.0.0.1:55298_solr c:testschemaapi s:shard1 r:core_node1 x:testschemaapi_shard1_replica1] o.a.s.h.l.XMLLoader xsltCacheLifetimeSeconds=60
    [junit4] 2> 2794939 INFO (qtp22088575-47706) [n:127.0.0.1:55298_solr c:testschemaapi s:shard1 r:core_node1 x:testschemaapi_shard1_replica1] o.a.s.h.l.XMLLoader xsltCacheLifetimeSeconds=60
    [junit4] 2> 2794940 INFO (qtp1275748-47708) [n:127.0.0.1:55299_solr c:testschemaapi s:shard1 r:core_node2 x:testschemaapi_shard1_replica2] o.a.s.h.l.XMLLoader xsltCacheLifetimeSeconds=60
    [junit4] 2> 2794940 INFO (qtp22088575-47706) [n:127.0.0.1:55298_solr c:testschemaapi s:shard1 r:core_node1 x:testschemaapi_shard1_replica1] o.a.s.c.RequestHandlers Registered paths: /admin/mbeans,/update/csv,/sql,/update/json/docs,/admin/luke,/graph,/export,/select,/admin/segments,/get,/admin/system,/replication,/admin/properties,/config,/stream,/schema,/admin/plugins,/admin/logging,/update/json,/admin/ping,/admin/threads,/update,/admin/file
    [junit4] 2> 2794940 INFO (qtp22088575-47706) [n:127.0.0.1:55298_solr c:testschemaapi s:shard1 r:core_node1 x:testschemaapi_shard1_replica1] o.a.s.c.SolrCore Using default statsCache cache: org.apache.solr.search.stats.LocalStatsCache
    [junit4] 2> 2794941 INFO (qtp1275748-47708) [n:127.0.0.1:55299_solr c:testschemaapi s:shard1 r:core_node2 x:testschemaapi_shard1_replica2] o.a.s.h.l.XMLLoader xsltCacheLifetimeSeconds=60
    [junit4] 2> 2794942 INFO (qtp22088575-47706) [n:127.0.0.1:55298_solr c:testschemaapi s:shard1 r:core_node1 x:testschemaapi_shard1_replica1] o.a.s.u.UpdateHandler Using UpdateLog implementation: org.apache.solr.update.UpdateLog
    [junit4] 2> 2794942 INFO (qtp22088575-47706) [n:127.0.0.1:55298_solr c:testschemaapi s:shard1 r:core_node1 x:testschemaapi_shard1_replica1] o.a.s.u.UpdateLog Initializing UpdateLog: dataDir=null defaultSyncLevel=FLUSH numRecordsToKeep=100 maxNumLogsToKeep=10 numVersionBuckets=65536
    [junit4] 2> 2794942 INFO (qtp1275748-47708) [n:127.0.0.1:55299_solr c:testschemaapi s:shard1 r:core_node2 x:testschemaapi_shard1_replica2] o.a.s.h.l.XMLLoader xsltCacheLifetimeSeconds=60
    [junit4] 2> 2794943 INFO (qtp1275748-47708) [n:127.0.0.1:55299_solr c:testschemaapi s:shard1 r:core_node2 x:testschemaapi_shard1_replica2] o.a.s.c.RequestHandlers Registered paths: /admin/mbeans,/update/csv,/sql,/update/json/docs,/admin/luke,/graph,/export,/select,/admin/segments,/get,/admin/system,/replication,/admin/properties,/config,/stream,/schema,/admin/plugins,/admin/logging,/update/json,/admin/ping,/admin/threads,/update,/admin/file
    [junit4] 2> 2794943 INFO (qtp1275748-47708) [n:127.0.0.1:55299_solr c:testschemaapi s:shard1 r:core_node2 x:testschemaapi_shard1_replica2] o.a.s.c.SolrCore Using default statsCache cache: org.apache.solr.search.stats.LocalStatsCache
    [junit4] 2> 2794944 INFO (qtp22088575-47706) [n:127.0.0.1:55298_solr c:testschemaapi s:shard1 r:core_node1 x:testschemaapi_shard1_replica1] o.a.s.u.CommitTracker Hard AutoCommit: disabled
    [junit4] 2> 2794944 INFO (qtp22088575-47706) [n:127.0.0.1:55298_solr c:testschemaapi s:shard1 r:core_node1 x:testschemaapi_shard1_replica1] o.a.s.u.CommitTracker Soft AutoCommit: disabled
    [junit4] 2> 2794944 INFO (qtp1275748-47708) [n:127.0.0.1:55299_solr c:testschemaapi s:shard1 r:core_node2 x:testschemaapi_shard1_replica2] o.a.s.u.UpdateHandler Using UpdateLog implementation: org.apache.solr.update.UpdateLog
    [junit4] 2> 2794944 INFO (qtp1275748-47708) [n:127.0.0.1:55299_solr c:testschemaapi s:shard1 r:core_node2 x:testschemaapi_shard1_replica2] o.a.s.u.UpdateLog Initializing UpdateLog: dataDir=null defaultSyncLevel=FLUSH numRecordsToKeep=100 maxNumLogsToKeep=10 numVersionBuckets=65536
    [junit4] 2> 2794944 INFO (qtp22088575-47706) [n:127.0.0.1:55298_solr c:testschemaapi s:shard1 r:core_node1 x:testschemaapi_shard1_replica1] o.a.s.c.SolrDeletionPolicy SolrDeletionPolicy.onInit: commits: num=1
    [junit4] 2> commit{dir=MockDirectoryWrapper(RAMDirectory@15d6c6e lockFactory=org.apache.lucene.store.SingleInstanceLockFactory@160eee5),segFN=segments_1,generation=1}
    [junit4] 2> 2794944 INFO (qtp22088575-47706) [n:127.0.0.1:55298_solr c:testschemaapi s:shard1 r:core_node1 x:testschemaapi_shard1_replica1] o.a.s.c.SolrDeletionPolicy newest commit generation = 1
    [junit4] 2> 2794944 INFO (OldIndexDirectoryCleanupThreadForCore-testschemaapi_shard1_replica2) [n:127.0.0.1:55299_solr c:testschemaapi s:shard1 r:core_node2 x:testschemaapi_shard1_replica2] o.a.s.c.SolrCore Looking for old index directories to cleanup for core testschemaapi_shard1_replica2 in C:\Users\jenkins\workspace\Lucene-Solr-6.x-Windows\solr\build\solr-core\test\J0\temp\solr.schema.TestManagedSchemaAPI_FDDAC5C51582F473-001\tempDir-001\node1\.\testschemaapi_shard1_replica2\data\
    [junit4] 2> 2794944 INFO (qtp22088575-47706) [n:127.0.0.1:55298_solr c:testschemaapi s:shard1 r:core_node1 x:testschemaapi_shard1_replica1] o.a.s.s.SolrIndexSearcher Opening [Searcher@1c065b3[testschemaapi_shard1_replica1] main]
    [junit4] 2> 2794945 INFO (qtp22088575-47706) [n:127.0.0.1:55298_solr c:testschemaapi s:shard1 r:core_node1 x:testschemaapi_shard1_replica1] o.a.s.c.c.ZkStateReader Load collection config from: [/collections/testschemaapi]
    [junit4] 2> 2794945 INFO (OldIndexDirectoryCleanupThreadForCore-testschemaapi_shard1_replica1) [n:127.0.0.1:55298_solr c:testschemaapi s:shard1 r:core_node1 x:testschemaapi_shard1_replica1] o.a.s.c.SolrCore Looking for old index directories to cleanup for core testschemaapi_shard1_replica1 in C:\Users\jenkins\workspace\Lucene-Solr-6.x-Windows\solr\build\solr-core\test\J0\temp\solr.schema.TestManagedSchemaAPI_FDDAC5C51582F473-001\tempDir-001\node2\.\testschemaapi_shard1_replica1\data\
    [junit4] 2> 2794946 INFO (qtp1275748-47708) [n:127.0.0.1:55299_solr c:testschemaapi s:shard1 r:core_node2 x:testschemaapi_shard1_replica2] o.a.s.u.CommitTracker Hard AutoCommit: disabled
    [junit4] 2> 2794946 INFO (qtp1275748-47708) [n:127.0.0.1:55299_solr c:testschemaapi s:shard1 r:core_node2 x:testschemaapi_shard1_replica2] o.a.s.u.CommitTracker Soft AutoCommit: disabled
    [junit4] 2> 2794947 INFO (qtp22088575-47706) [n:127.0.0.1:55298_solr c:testschemaapi s:shard1 r:core_node1 x:testschemaapi_shard1_replica1] o.a.s.c.c.ZkStateReader path=[/collections/testschemaapi] [configName]=[conf1] specified config exists in ZooKeeper
    [junit4] 2> 2794947 INFO (qtp22088575-47706) [n:127.0.0.1:55298_solr c:testschemaapi s:shard1 r:core_node1 x:testschemaapi_shard1_replica1] o.a.s.r.ManagedResourceStorage Setting up ZooKeeper-based storage for the RestManager with znodeBase: /configs/conf1
    [junit4] 2> 2794947 INFO (qtp1275748-47708) [n:127.0.0.1:55299_solr c:testschemaapi s:shard1 r:core_node2 x:testschemaapi_shard1_replica2] o.a.s.c.SolrDeletionPolicy SolrDeletionPolicy.onInit: commits: num=1
    [junit4] 2> commit{dir=MockDirectoryWrapper(RAMDirectory@1fe8946 lockFactory=org.apache.lucene.store.SingleInstanceLockFactory@1234f44),segFN=segments_1,generation=1}
    [junit4] 2> 2794947 INFO (qtp1275748-47708) [n:127.0.0.1:55299_solr c:testschemaapi s:shard1 r:core_node2 x:testschemaapi_shard1_replica2] o.a.s.c.SolrDeletionPolicy newest commit generation = 1
    [junit4] 2> 2794947 INFO (qtp1275748-47708) [n:127.0.0.1:55299_solr c:testschemaapi s:shard1 r:core_node2 x:testschemaapi_shard1_replica2] o.a.s.s.SolrIndexSearcher Opening [Searcher@382b5[testschemaapi_shard1_replica2] main]
    [junit4] 2> 2794947 INFO (qtp1275748-47708) [n:127.0.0.1:55299_solr c:testschemaapi s:shard1 r:core_node2 x:testschemaapi_shard1_replica2] o.a.s.c.c.ZkStateReader Load collection config from: [/collections/testschemaapi]
    [junit4] 2> 2794947 INFO (qtp22088575-47706) [n:127.0.0.1:55298_solr c:testschemaapi s:shard1 r:core_node1 x:testschemaapi_shard1_replica1] o.a.s.r.ManagedResourceStorage Configured ZooKeeperStorageIO with znodeBase: /configs/conf1
    [junit4] 2> 2794947 INFO (qtp22088575-47706) [n:127.0.0.1:55298_solr c:testschemaapi s:shard1 r:core_node1 x:testschemaapi_shard1_replica1] o.a.s.r.RestManager Initializing RestManager with initArgs: {}
    [junit4] 2> 2794947 INFO (qtp22088575-47706) [n:127.0.0.1:55298_solr c:testschemaapi s:shard1 r:core_node1 x:testschemaapi_shard1_replica1] o.a.s.r.ManagedResourceStorage Reading _rest_managed.json using ZooKeeperStorageIO:path=/configs/conf1
    [junit4] 2> 2794949 INFO (qtp22088575-47706) [n:127.0.0.1:55298_solr c:testschemaapi s:shard1 r:core_node1 x:testschemaapi_shard1_replica1] o.a.s.r.ManagedResourceStorage No data found for znode /configs/conf1/_rest_managed.json
    [junit4] 2> 2794949 INFO (qtp22088575-47706) [n:127.0.0.1:55298_solr c:testschemaapi s:shard1 r:core_node1 x:testschemaapi_shard1_replica1] o.a.s.r.ManagedResourceStorage Loaded null at path _rest_managed.json using ZooKeeperStorageIO:path=/configs/conf1
    [junit4] 2> 2794949 INFO (qtp1275748-47708) [n:127.0.0.1:55299_solr c:testschemaapi s:shard1 r:core_node2 x:testschemaapi_shard1_replica2] o.a.s.c.c.ZkStateReader path=[/collections/testschemaapi] [configName]=[conf1] specified config exists in ZooKeeper
    [junit4] 2> 2794949 INFO (qtp1275748-47708) [n:127.0.0.1:55299_solr c:testschemaapi s:shard1 r:core_node2 x:testschemaapi_shard1_replica2] o.a.s.r.ManagedResourceStorage Setting up ZooKeeper-based storage for the RestManager with znodeBase: /configs/conf1
    [junit4] 2> 2794949 INFO (qtp22088575-47706) [n:127.0.0.1:55298_solr c:testschemaapi s:shard1 r:core_node1 x:testschemaapi_shard1_replica1] o.a.s.r.RestManager Initializing 0 registered ManagedResources
    [junit4] 2> 2794949 INFO (qtp22088575-47706) [n:127.0.0.1:55298_solr c:testschemaapi s:shard1 r:core_node1 x:testschemaapi_shard1_replica1] o.a.s.s.ZkIndexSchemaReader Creating ZooKeeper watch for the managed schema at /configs/conf1/managed-schema
    [junit4] 2> 2794949 INFO (qtp1275748-47708) [n:127.0.0.1:55299_solr c:testschemaapi s:shard1 r:core_node2 x:testschemaapi_shard1_replica2] o.a.s.r.ManagedResourceStorage Configured ZooKeeperStorageIO with znodeBase: /configs/conf1
    [junit4] 2> 2794949 INFO (qtp22088575-47706) [n:127.0.0.1:55298_solr c:testschemaapi s:shard1 r:core_node1 x:testschemaapi_shard1_replica1] o.a.s.c.ZkController Added new OnReconnect listener ZkIndexSchemaReader: /configs/conf1/managed-schema, uniqueCoreId: testschemaapi_shard1_replica1:118280722242915
    [junit4] 2> 2794949 INFO (qtp1275748-47708) [n:127.0.0.1:55299_solr c:testschemaapi s:shard1 r:core_node2 x:testschemaapi_shard1_replica2] o.a.s.r.RestManager Initializing RestManager with initArgs: {}
    [junit4] 2> 2794949 INFO (qtp22088575-47706) [n:127.0.0.1:55298_solr c:testschemaapi s:shard1 r:core_node1 x:testschemaapi_shard1_replica1] o.a.s.h.ReplicationHandler Commits will be reserved for 10000
    [junit4] 2> 2794949 INFO (qtp1275748-47708) [n:127.0.0.1:55299_solr c:testschemaapi s:shard1 r:core_node2 x:testschemaapi_shard1_replica2] o.a.s.r.ManagedResourceStorage Reading _rest_managed.json using ZooKeeperStorageIO:path=/configs/conf1
    [junit4] 2> 2794950 INFO (searcherExecutor-10988-thread-1-processing-n:127.0.0.1:55298_solr x:testschemaapi_shard1_replica1 s:shard1 c:testschemaapi r:core_node1) [n:127.0.0.1:55298_solr c:testschemaapi s:shard1 r:core_node1 x:testschemaapi_shard1_replica1] o.a.s.c.SolrCore [testschemaapi_shard1_replica1] Registered new searcher Searcher@1c065b3[testschemaapi_shard1_replica1] main{ExitableDirectoryReader(UninvertingDirectoryReader())}
    [junit4] 2> 2794950 INFO (qtp22088575-47706) [n:127.0.0.1:55298_solr c:testschemaapi s:shard1 r:core_node1 x:testschemaapi_shard1_replica1] o.a.s.u.UpdateLog Looking up max value of version field to seed version buckets
    [junit4] 2> 2794950 INFO (qtp22088575-47706) [n:127.0.0.1:55298_solr c:testschemaapi s:shard1 r:core_node1 x:testschemaapi_shard1_replica1] o.a.s.u.VersionInfo Refreshing highest value of _version_ for 65536 version buckets from index
    [junit4] 2> 2794950 INFO (qtp1275748-47708) [n:127.0.0.1:55299_solr c:testschemaapi s:shard1 r:core_node2 x:testschemaapi_shard1_replica2] o.a.s.r.ManagedResourceStorage No data found for znode /configs/conf1/_rest_managed.json
    [junit4] 2> 2794950 INFO (qtp22088575-47706) [n:127.0.0.1:55298_solr c:testschemaapi s:shard1 r:core_node1 x:testschemaapi_shard1_replica1] o.a.s.u.VersionInfo No terms found for _version_, cannot seed version bucket highest value from index
    [junit4] 2> 2794950 INFO (qtp1275748-47708) [n:127.0.0.1:55299_solr c:testschemaapi s:shard1 r:core_node2 x:testschemaapi_shard1_replica2] o.a.s.r.ManagedResourceStorage Loaded null at path _rest_managed.json using ZooKeeperStorageIO:path=/configs/conf1
    [junit4] 2> 2794950 INFO (qtp1275748-47708) [n:127.0.0.1:55299_solr c:testschemaapi s:shard1 r:core_node2 x:testschemaapi_shard1_replica2] o.a.s.r.RestManager Initializing 0 registered ManagedResources
    [junit4] 2> 2794950 INFO (qtp22088575-47706) [n:127.0.0.1:55298_solr c:testschemaapi s:shard1 r:core_node1 x:testschemaapi_shard1_replica1] o.a.s.u.UpdateLog Could not find max version in index or recent updates, using new clock 1537435824200613888
    [junit4] 2> 2794950 INFO (qtp1275748-47708) [n:127.0.0.1:55299_solr c:testschemaapi s:shard1 r:core_node2 x:testschemaapi_shard1_replica2] o.a.s.s.ZkIndexSchemaReader Creating ZooKeeper watch for the managed schema at /configs/conf1/managed-schema
    [junit4] 2> 2794951 INFO (qtp1275748-47708) [n:127.0.0.1:55299_solr c:testschemaapi s:shard1 r:core_node2 x:testschemaapi_shard1_replica2] o.a.s.c.ZkController Added new OnReconnect listener ZkIndexSchemaReader: /configs/conf1/managed-schema, uniqueCoreId: testschemaapi_shard1_replica2:118280722100244
    [junit4] 2> 2794951 INFO (qtp1275748-47708) [n:127.0.0.1:55299_solr c:testschemaapi s:shard1 r:core_node2 x:testschemaapi_shard1_replica2] o.a.s.h.ReplicationHandler Commits will be reserved for 10000
    [junit4] 2> 2794951 INFO (searcherExecutor-10987-thread-1-processing-n:127.0.0.1:55299_solr x:testschemaapi_shard1_replica2 s:shard1 c:testschemaapi r:core_node2) [n:127.0.0.1:55299_solr c:testschemaapi s:shard1 r:core_node2 x:testschemaapi_shard1_replica2] o.a.s.c.SolrCore [testschemaapi_shard1_replica2] Registered new searcher Searcher@382b5[testschemaapi_shard1_replica2] main{ExitableDirectoryReader(UninvertingDirectoryReader())}
    [junit4] 2> 2794951 INFO (qtp1275748-47708) [n:127.0.0.1:55299_solr c:testschemaapi s:shard1 r:core_node2 x:testschemaapi_shard1_replica2] o.a.s.u.UpdateLog Looking up max value of version field to seed version buckets
    [junit4] 2> 2794951 INFO (qtp1275748-47708) [n:127.0.0.1:55299_solr c:testschemaapi s:shard1 r:core_node2 x:testschemaapi_shard1_replica2] o.a.s.u.VersionInfo Refreshing highest value of _version_ for 65536 version buckets from index
    [junit4] 2> 2794951 INFO (qtp1275748-47708) [n:127.0.0.1:55299_solr c:testschemaapi s:shard1 r:core_node2 x:testschemaapi_shard1_replica2] o.a.s.u.VersionInfo No terms found for _version_, cannot seed version bucket highest value from index
    [junit4] 2> 2794951 INFO (qtp1275748-47708) [n:127.0.0.1:55299_solr c:testschemaapi s:shard1 r:core_node2 x:testschemaapi_shard1_replica2] o.a.s.u.UpdateLog Could not find max version in index or recent updates, using new clock 1537435824201662464
    [junit4] 2> 2794952 INFO (qtp22088575-47706) [n:127.0.0.1:55298_solr c:testschemaapi s:shard1 r:core_node1 x:testschemaapi_shard1_replica1] o.a.s.u.UpdateLog Took 1.0ms to seed version buckets with highest version 1537435824200613888
    [junit4] 2> 2794952 INFO (qtp22088575-47706) [n:127.0.0.1:55298_solr c:testschemaapi s:shard1 r:core_node1 x:testschemaapi_shard1_replica1] o.a.s.c.ZkController watch zkdir /configs/conf1
    [junit4] 2> 2794953 INFO (qtp22088575-47706) [n:127.0.0.1:55298_solr c:testschemaapi s:shard1 r:core_node1 x:testschemaapi_shard1_replica1] o.a.s.c.CoreContainer registering core: testschemaapi_shard1_replica1
    [junit4] 2> 2794953

[...truncated too long message...]

TestHashPartitioner, ZkControllerTest, TestRealTimeGet, TestReload, HardAutoCommitTest, SolrCoreTest, StatsComponentTest, PeerSyncTest, DirectUpdateHandlerTest, SoftAutoCommitTest, CurrencyFieldOpenExchangeTest, TestCoreDiscovery, TestExtendedDismaxParser, SpellCheckCollatorTest, TestFoldingMultitermQuery, TestStressLucene, TestCSVLoader, SchemaVersionSpecificBehaviorTest, DefaultValueUpdateProcessorTest, SortByFunctionTest, DistanceFunctionTest, XsltUpdateRequestHandlerTest, DebugComponentTest, StandardRequestHandlerTest, PrimitiveFieldTypeTest, TestOmitPositions, TermsComponentTest, RequestHandlersTest, TermVectorComponentTest, RequiredFieldsTest, IndexSchemaRuntimeFieldTest, ReturnFieldsTest, TestCSVResponseWriter, UniqFieldsUpdateProcessorFactoryTest, TestPartialUpdateDeduplication, TestLFUCache, PrimUtilsTest, TestSolrJ, SliceStateTest, FileUtilsTest, DistributedIntervalFacetingTest, BaseCdcrDistributedZkTest, CdcrVersionReplicationTest, CleanupOldIndexTest, CollectionsAPIAsyncDistributedZkTest, ConfigSetsAPITest, CustomCollectionTest, DistribDocExpirationUpdateProcessorTest, LeaderFailoverAfterPartitionTest, OverseerRolesTest, SharedFSAutoReplicaFailoverTest, SharedFSAutoReplicaFailoverUtilsTest, SolrXmlInZkTest, TestCloudInspectUtil, TestCollectionAPI, TestCryptoKeys, TestExclusionRuleCollectionAccess, TestMiniSolrCloudCluster, TestRequestForwarding, TestRequestStatusCollectionAPI, TestSizeLimitedDistributedMap, TestTolerantUpdateProcessorRandomCloud, DirectoryFactoryTest, QueryResultKeyTest, TestConfigSetImmutable, TestSolrDynamicMBean, TestReqParamsAPI, TestSolrConfigHandlerConcurrent, CoreAdminCreateDiscoverTest, CoreAdminRequestStatusTest, SecurityConfHandlerTest, SegmentsInfoRequestHandlerTest, DistributedFacetPivotLongTailTest, SpatialHeatmapFacetsTest, TestBulkSchemaAPI, TestCopyFieldCollectionResource, TestDefaultSearchFieldResource, TestFieldCollectionResource, TestFieldResource, TestFieldTypeCollectionResource, TestSchemaNameResource, TestSchemaResource, TestSchemaVersionResource, TestSerializedLuceneMatchVersion, BadCopyFieldTest, ChangedSchemaMergeTest, DateRangeFieldTest, SpatialRPTFieldTypeTest, TestCloudManagedSchema, TestCollationFieldDocValues, TestManagedSchemaAPI]
    [junit4] 2> NOTE: reproduce with: ant test -Dtestcase=TestManagedSchemaAPI -Dtests.seed=FDDAC5C51582F473 -Dtests.slow=true -Dtests.locale=ar-SY -Dtests.timezone=Indian/Reunion -Dtests.asserts=true -Dtests.file.encoding=Cp1252
    [junit4] ERROR 0.00s J0 | TestManagedSchemaAPI (suite) <<<
    [junit4] > Throwable #1: java.lang.AssertionError: ObjectTracker found 8 object(s) that were not released!!! [MockDirectoryWrapper, TransactionLog, MockDirectoryWrapper, MockDirectoryWrapper, TransactionLog, MockDirectoryWrapper, MDCAwareThreadPoolExecutor, MDCAwareThreadPoolExecutor]
    [junit4] > at __randomizedtesting.SeedInfo.seed([FDDAC5C51582F473]:0)
    [junit4] > at org.apache.solr.SolrTestCaseJ4.teardownTestCases(SolrTestCaseJ4.java:257)
    [junit4] > at java.lang.Thread.run(Thread.java:745)Throwable #2: java.io.IOException: Could not remove the following files (in the order of attempts):
    [junit4] > C:\Users\jenkins\workspace\Lucene-Solr-6.x-Windows\solr\build\solr-core\test\J0\temp\solr.schema.TestManagedSchemaAPI_FDDAC5C51582F473-001\tempDir-001\node1\testschemaapi_shard1_replica2\data\tlog\tlog.0000000000000000001: java.nio.file.FileSystemException: C:\Users\jenkins\workspace\Lucene-Solr-6.x-Windows\solr\build\solr-core\test\J0\temp\solr.schema.TestManagedSchemaAPI_FDDAC5C51582F473-001\tempDir-001\node1\testschemaapi_shard1_replica2\data\tlog\tlog.0000000000000000001: The process cannot access the file because it is being used by another process.
    [junit4] > C:\Users\jenkins\workspace\Lucene-Solr-6.x-Windows\solr\build\solr-core\test\J0\temp\solr.schema.TestManagedSchemaAPI_FDDAC5C51582F473-001\tempDir-001\node1\testschemaapi_shard1_replica2\data\tlog: java.nio.file.DirectoryNotEmptyException: C:\Users\jenkins\workspace\Lucene-Solr-6.x-Windows\solr\build\solr-core\test\J0\temp\solr.schema.TestManagedSchemaAPI_FDDAC5C51582F473-001\tempDir-001\node1\testschemaapi_shard1_replica2\data\tlog
    [junit4] > C:\Users\jenkins\workspace\Lucene-Solr-6.x-Windows\solr\build\solr-core\test\J0\temp\solr.schema.TestManagedSchemaAPI_FDDAC5C51582F473-001\tempDir-001\node1\testschemaapi_shard1_replica2\data: java.nio.file.DirectoryNotEmptyException: C:\Users\jenkins\workspace\Lucene-Solr-6.x-Windows\solr\build\solr-core\test\J0\temp\solr.schema.TestManagedSchemaAPI_FDDAC5C51582F473-001\tempDir-001\node1\testschemaapi_shard1_replica2\data
    [junit4] > C:\Users\jenkins\workspace\Lucene-Solr-6.x-Windows\solr\build\solr-core\test\J0\temp\solr.schema.TestManagedSchemaAPI_FDDAC5C51582F473-001\tempDir-001\node1\testschemaapi_shard1_replica2: java.nio.file.DirectoryNotEmptyException: C:\Users\jenkins\workspace\Lucene-Solr-6.x-Windows\solr\build\solr-core\test\J0\temp\solr.schema.TestManagedSchemaAPI_FDDAC5C51582F473-001\tempDir-001\node1\testschemaapi_shard1_replica2
    [junit4] > C:\Users\jenkins\workspace\Lucene-Solr-6.x-Windows\solr\build\solr-core\test\J0\temp\solr.schema.TestManagedSchemaAPI_FDDAC5C51582F473-001\tempDir-001\node1: java.nio.file.DirectoryNotEmptyException: C:\Users\jenkins\workspace\Lucene-Solr-6.x-Windows\solr\build\solr-core\test\J0\temp\solr.schema.TestManagedSchemaAPI_FDDAC5C51582F473-001\tempDir-001\node1
    [junit4] > C:\Users\jenkins\workspace\Lucene-Solr-6.x-Windows\solr\build\solr-core\test\J0\temp\solr.schema.TestManagedSchemaAPI_FDDAC5C51582F473-001\tempDir-001\node2\testschemaapi_shard1_replica1\data\tlog\tlog.0000000000000000000: java.nio.file.FileSystemException: C:\Users\jenkins\workspace\Lucene-Solr-6.x-Windows\solr\build\solr-core\test\J0\temp\solr.schema.TestManagedSchemaAPI_FDDAC5C51582F473-001\tempDir-001\node2\testschemaapi_shard1_replica1\data\tlog\tlog.0000000000000000000: The process cannot access the file because it is being used by another process.
    [junit4] > C:\Users\jenkins\workspace\Lucene-Solr-6.x-Windows\solr\build\solr-core\test\J0\temp\solr.schema.TestManagedSchemaAPI_FDDAC5C51582F473-001\tempDir-001\node2\testschemaapi_shard1_replica1\data\tlog: java.nio.file.DirectoryNotEmptyException: C:\Users\jenkins\workspace\Lucene-Solr-6.x-Windows\solr\build\solr-core\test\J0\temp\solr.schema.TestManagedSchemaAPI_FDDAC5C51582F473-001\tempDir-001\node2\testschemaapi_shard1_replica1\data\tlog
    [junit4] > C:\Users\jenkins\workspace\Lucene-Solr-6.x-Windows\solr\build\solr-core\test\J0\temp\solr.schema.TestManagedSchemaAPI_FDDAC5C51582F473-001\tempDir-001\node2\testschemaapi_shard1_replica1\data: java.nio.file.DirectoryNotEmptyException: C:\Users\jenkins\workspace\Lucene-Solr-6.x-Windows\solr\build\solr-core\test\J0\temp\solr.schema.TestManagedSchemaAPI_FDDAC5C51582F473-001\tempDir-001\node2\testschemaapi_shard1_replica1\data
    [junit4] > C:\Users\jenkins\workspace\Lucene-Solr-6.x-Windows\solr\build\solr-core\test\J0\temp\solr.schema.TestManagedSchemaAPI_FDDAC5C51582F473-001\tempDir-001\node2\testschemaapi_shard1_replica1: java.nio.file.DirectoryNotEmptyException: C:\Users\jenkins\workspace\Lucene-Solr-6.x-Windows\solr\build\solr-core\test\J0\temp\solr.schema.TestManagedSchemaAPI_FDDAC5C51582F473-001\tempDir-001\node2\testschemaapi_shard1_replica1
    [junit4] > C:\Users\jenkins\workspace\Lucene-Solr-6.x-Windows\solr\build\solr-core\test\J0\temp\solr.schema.TestManagedSchemaAPI_FDDAC5C51582F473-001\tempDir-001\node2: java.nio.file.DirectoryNotEmptyException: C:\Users\jenkins\workspace\Lucene-Solr-6.x-Windows\solr\build\solr-core\test\J0\temp\solr.schema.TestManagedSchemaAPI_FDDAC5C51582F473-001\tempDir-001\node2
    [junit4] > C:\Users\jenkins\workspace\Lucene-Solr-6.x-Windows\solr\build\solr-core\test\J0\temp\solr.schema.TestManagedSchemaAPI_FDDAC5C51582F473-001\tempDir-001: java.nio.file.DirectoryNotEmptyException: C:\Users\jenkins\workspace\Lucene-Solr-6.x-Windows\solr\build\solr-core\test\J0\temp\solr.schema.TestManagedSchemaAPI_FDDAC5C51582F473-001\tempDir-001
    [junit4] > C:\Users\jenkins\workspace\Lucene-Solr-6.x-Windows\solr\build\solr-core\test\J0\temp\solr.schema.TestManagedSchemaAPI_FDDAC5C51582F473-001: java.nio.file.DirectoryNotEmptyException: C:\Users\jenkins\workspace\Lucene-Solr-6.x-Windows\solr\build\solr-core\test\J0\temp\solr.schema.TestManagedSchemaAPI_FDDAC5C51582F473-001
    [junit4] > at org.apache.lucene.util.IOUtils.rm(IOUtils.java:323)
    [junit4] > at java.lang.Thread.run(Thread.java:745)
    [junit4] Completed [549/615 (1!)] on J0 in 13.96s, 1 test, 1 failure, 1 error <<< FAILURES!

[...truncated 238 lines...]
BUILD FAILED
C:\Users\jenkins\workspace\Lucene-Solr-6.x-Windows\build.xml:740: The following error occurred while executing this line:
C:\Users\jenkins\workspace\Lucene-Solr-6.x-Windows\build.xml:684: The following error occurred while executing this line:
C:\Users\jenkins\workspace\Lucene-Solr-6.x-Windows\build.xml:59: The following error occurred while executing this line:
C:\Users\jenkins\workspace\Lucene-Solr-6.x-Windows\solr\build.xml:233: The following error occurred while executing this line:
C:\Users\jenkins\workspace\Lucene-Solr-6.x-Windows\solr\common-build.xml:531: The following error occurred while executing this line:
C:\Users\jenkins\workspace\Lucene-Solr-6.x-Windows\lucene\common-build.xml:1427: The following error occurred while executing this line:
C:\Users\jenkins\workspace\Lucene-Solr-6.x-Windows\lucene\common-build.xml:984: There were test failures: 615 suites (10 ignored), 2591 tests, 2 suite-level errors, 126 ignored (82 assumptions) [seed: FDDAC5C51582F473]

Total time: 74 minutes 0 seconds
Build step 'Invoke Ant' marked build as failure
Archiving artifacts
[WARNINGS] Skipping publisher since build result is FAILURE
Recording test results
Email was triggered for: Failure - Any
Sending email for trigger: Failure - Any

Search Discussions

Discussion Posts

Previous

Related Discussions

Discussion Navigation
viewthread | post
posts ‹ prev | 2 of 2 | next ›
Discussion Overview
groupdev @
categorieslucene
postedJun 17, '16 at 2:02p
activeJun 18, '16 at 1:27a
posts2
users1
websitelucene.apache.org

1 user in discussion

Policeman Jenkins Server: 2 posts

People

Translate

site design / logo © 2017 Grokbase