Grokbase Groups Lucene dev June 2016
FAQ
Build: http://jenkins.thetaphi.de/job/Lucene-Solr-5.5-Linux/302/
Java: 64bit/jdk1.7.0_80 -XX:-UseCompressedOops -XX:+UseG1GC

1 tests failed.
FAILED: org.apache.solr.schema.TestManagedSchemaAPI.test

Error Message:
Error from server at http://127.0.0.1:37276/solr/testschemaapi_shard1_replica1: ERROR: [doc=2] unknown field 'myNewField1'

Stack Trace:
org.apache.solr.client.solrj.impl.CloudSolrClient$RouteException: Error from server at http://127.0.0.1:37276/solr/testschemaapi_shard1_replica1: ERROR: [doc=2] unknown field 'myNewField1'
  at __randomizedtesting.SeedInfo.seed([DD7EE446806D56DA:552ADB9C2E913B22]:0)
  at org.apache.solr.client.solrj.impl.CloudSolrClient.directUpdate(CloudSolrClient.java:632)
  at org.apache.solr.client.solrj.impl.CloudSolrClient.sendRequest(CloudSolrClient.java:981)
  at org.apache.solr.client.solrj.impl.CloudSolrClient.requestWithRetryOnStaleState(CloudSolrClient.java:870)
  at org.apache.solr.client.solrj.impl.CloudSolrClient.request(CloudSolrClient.java:806)
  at org.apache.solr.schema.TestManagedSchemaAPI.testAddFieldAndDocument(TestManagedSchemaAPI.java:101)
  at org.apache.solr.schema.TestManagedSchemaAPI.test(TestManagedSchemaAPI.java:69)
  at sun.reflect.NativeMethodAccessorImpl.invoke0(Native Method)
  at sun.reflect.NativeMethodAccessorImpl.invoke(NativeMethodAccessorImpl.java:57)
  at sun.reflect.DelegatingMethodAccessorImpl.invoke(DelegatingMethodAccessorImpl.java:43)
  at java.lang.reflect.Method.invoke(Method.java:606)
  at com.carrotsearch.randomizedtesting.RandomizedRunner.invoke(RandomizedRunner.java:1764)
  at com.carrotsearch.randomizedtesting.RandomizedRunner$8.evaluate(RandomizedRunner.java:871)
  at com.carrotsearch.randomizedtesting.RandomizedRunner$9.evaluate(RandomizedRunner.java:907)
  at com.carrotsearch.randomizedtesting.RandomizedRunner$10.evaluate(RandomizedRunner.java:921)
  at com.carrotsearch.randomizedtesting.rules.SystemPropertiesRestoreRule$1.evaluate(SystemPropertiesRestoreRule.java:57)
  at org.apache.lucene.util.TestRuleSetupTeardownChained$1.evaluate(TestRuleSetupTeardownChained.java:49)
  at org.apache.lucene.util.AbstractBeforeAfterRule$1.evaluate(AbstractBeforeAfterRule.java:45)
  at org.apache.lucene.util.TestRuleThreadAndTestName$1.evaluate(TestRuleThreadAndTestName.java:48)
  at org.apache.lucene.util.TestRuleIgnoreAfterMaxFailures$1.evaluate(TestRuleIgnoreAfterMaxFailures.java:64)
  at org.apache.lucene.util.TestRuleMarkFailure$1.evaluate(TestRuleMarkFailure.java:47)
  at com.carrotsearch.randomizedtesting.rules.StatementAdapter.evaluate(StatementAdapter.java:36)
  at com.carrotsearch.randomizedtesting.ThreadLeakControl$StatementRunner.run(ThreadLeakControl.java:367)
  at com.carrotsearch.randomizedtesting.ThreadLeakControl.forkTimeoutingTask(ThreadLeakControl.java:809)
  at com.carrotsearch.randomizedtesting.ThreadLeakControl$3.evaluate(ThreadLeakControl.java:460)
  at com.carrotsearch.randomizedtesting.RandomizedRunner.runSingleTest(RandomizedRunner.java:880)
  at com.carrotsearch.randomizedtesting.RandomizedRunner$5.evaluate(RandomizedRunner.java:781)
  at com.carrotsearch.randomizedtesting.RandomizedRunner$6.evaluate(RandomizedRunner.java:816)
  at com.carrotsearch.randomizedtesting.RandomizedRunner$7.evaluate(RandomizedRunner.java:827)
  at com.carrotsearch.randomizedtesting.rules.StatementAdapter.evaluate(StatementAdapter.java:36)
  at com.carrotsearch.randomizedtesting.rules.SystemPropertiesRestoreRule$1.evaluate(SystemPropertiesRestoreRule.java:57)
  at org.apache.lucene.util.AbstractBeforeAfterRule$1.evaluate(AbstractBeforeAfterRule.java:45)
  at com.carrotsearch.randomizedtesting.rules.StatementAdapter.evaluate(StatementAdapter.java:36)
  at org.apache.lucene.util.TestRuleStoreClassName$1.evaluate(TestRuleStoreClassName.java:41)
  at com.carrotsearch.randomizedtesting.rules.NoShadowingOrOverridesOnMethodsRule$1.evaluate(NoShadowingOrOverridesOnMethodsRule.java:40)
  at com.carrotsearch.randomizedtesting.rules.NoShadowingOrOverridesOnMethodsRule$1.evaluate(NoShadowingOrOverridesOnMethodsRule.java:40)
  at com.carrotsearch.randomizedtesting.rules.StatementAdapter.evaluate(StatementAdapter.java:36)
  at com.carrotsearch.randomizedtesting.rules.StatementAdapter.evaluate(StatementAdapter.java:36)
  at com.carrotsearch.randomizedtesting.rules.StatementAdapter.evaluate(StatementAdapter.java:36)
  at org.apache.lucene.util.TestRuleAssertionsRequired$1.evaluate(TestRuleAssertionsRequired.java:53)
  at org.apache.lucene.util.TestRuleMarkFailure$1.evaluate(TestRuleMarkFailure.java:47)
  at org.apache.lucene.util.TestRuleIgnoreAfterMaxFailures$1.evaluate(TestRuleIgnoreAfterMaxFailures.java:64)
  at org.apache.lucene.util.TestRuleIgnoreTestSuites$1.evaluate(TestRuleIgnoreTestSuites.java:54)
  at com.carrotsearch.randomizedtesting.rules.StatementAdapter.evaluate(StatementAdapter.java:36)
  at com.carrotsearch.randomizedtesting.ThreadLeakControl$StatementRunner.run(ThreadLeakControl.java:367)
  at java.lang.Thread.run(Thread.java:745)
Caused by: org.apache.solr.client.solrj.impl.HttpSolrClient$RemoteSolrException: Error from server at http://127.0.0.1:37276/solr/testschemaapi_shard1_replica1: ERROR: [doc=2] unknown field 'myNewField1'
  at org.apache.solr.client.solrj.impl.HttpSolrClient.executeMethod(HttpSolrClient.java:577)
  at org.apache.solr.client.solrj.impl.HttpSolrClient.request(HttpSolrClient.java:241)
  at org.apache.solr.client.solrj.impl.HttpSolrClient.request(HttpSolrClient.java:230)
  at org.apache.solr.client.solrj.impl.LBHttpSolrClient.doRequest(LBHttpSolrClient.java:372)
  at org.apache.solr.client.solrj.impl.LBHttpSolrClient.request(LBHttpSolrClient.java:325)
  at org.apache.solr.client.solrj.impl.CloudSolrClient$2.call(CloudSolrClient.java:607)
  at org.apache.solr.client.solrj.impl.CloudSolrClient$2.call(CloudSolrClient.java:604)
  at java.util.concurrent.FutureTask.run(FutureTask.java:262)
  at org.apache.solr.common.util.ExecutorUtil$MDCAwareThreadPoolExecutor$1.run(ExecutorUtil.java:231)
  at java.util.concurrent.ThreadPoolExecutor.runWorker(ThreadPoolExecutor.java:1145)
  at java.util.concurrent.ThreadPoolExecutor$Worker.run(ThreadPoolExecutor.java:615)
  ... 1 more




Build Log:
[...truncated 10805 lines...]
    [junit4] Suite: org.apache.solr.schema.TestManagedSchemaAPI
    [junit4] 2> Creating dataDir: /home/jenkins/workspace/Lucene-Solr-5.5-Linux/solr/build/solr-core/test/J0/temp/solr.schema.TestManagedSchemaAPI_DD7EE446806D56DA-001/init-core-data-001
    [junit4] 2> 222360 INFO (SUITE-TestManagedSchemaAPI-seed#[DD7EE446806D56DA]-worker) [ ] o.a.s.SolrTestCaseJ4 Randomized ssl (false) and clientAuth (false)
    [junit4] 2> 222363 INFO (TEST-TestManagedSchemaAPI.test-seed#[DD7EE446806D56DA]) [ ] o.a.s.SolrTestCaseJ4 ###Starting test
    [junit4] 2> 222364 INFO (TEST-TestManagedSchemaAPI.test-seed#[DD7EE446806D56DA]) [ ] o.a.s.c.ZkTestServer STARTING ZK TEST SERVER
    [junit4] 2> 222364 INFO (Thread-358) [ ] o.a.s.c.ZkTestServer client port:0.0.0.0/0.0.0.0:0
    [junit4] 2> 222364 INFO (Thread-358) [ ] o.a.s.c.ZkTestServer Starting server
    [junit4] 2> 222464 INFO (TEST-TestManagedSchemaAPI.test-seed#[DD7EE446806D56DA]) [ ] o.a.s.c.ZkTestServer start zk server on port:36828
    [junit4] 2> 222465 INFO (TEST-TestManagedSchemaAPI.test-seed#[DD7EE446806D56DA]) [ ] o.a.s.c.c.SolrZkClient Using default ZkCredentialsProvider
    [junit4] 2> 222465 INFO (TEST-TestManagedSchemaAPI.test-seed#[DD7EE446806D56DA]) [ ] o.a.s.c.c.ConnectionManager Waiting for client to connect to ZooKeeper
    [junit4] 2> 222467 INFO (zkCallback-136-thread-1) [ ] o.a.s.c.c.ConnectionManager Watcher org.apache.solr.common.cloud.ConnectionManager@6fc62bf4 name:ZooKeeperConnection Watcher:127.0.0.1:36828 got event WatchedEvent state:SyncConnected type:None path:null path:null type:None
    [junit4] 2> 222467 INFO (TEST-TestManagedSchemaAPI.test-seed#[DD7EE446806D56DA]) [ ] o.a.s.c.c.ConnectionManager Client is connected to ZooKeeper
    [junit4] 2> 222467 INFO (TEST-TestManagedSchemaAPI.test-seed#[DD7EE446806D56DA]) [ ] o.a.s.c.c.SolrZkClient Using default ZkACLProvider
    [junit4] 2> 222467 INFO (TEST-TestManagedSchemaAPI.test-seed#[DD7EE446806D56DA]) [ ] o.a.s.c.c.SolrZkClient makePath: /solr/solr.xml
    [junit4] 2> 222471 INFO (jetty-launcher-135-thread-1) [ ] o.e.j.s.Server jetty-9.2.13.v20150730
    [junit4] 2> 222472 INFO (jetty-launcher-135-thread-2) [ ] o.e.j.s.Server jetty-9.2.13.v20150730
    [junit4] 2> 222474 INFO (jetty-launcher-135-thread-2) [ ] o.e.j.s.h.ContextHandler Started o.e.j.s.ServletContextHandler@14c0bfbe{/solr,null,AVAILABLE}
    [junit4] 2> 222474 INFO (jetty-launcher-135-thread-1) [ ] o.e.j.s.h.ContextHandler Started o.e.j.s.ServletContextHandler@7a6c5d96{/solr,null,AVAILABLE}
    [junit4] 2> 222475 INFO (jetty-launcher-135-thread-2) [ ] o.e.j.s.ServerConnector Started ServerConnector@6a9a525a{HTTP/1.1}{127.0.0.1:37276}
    [junit4] 2> 222476 INFO (jetty-launcher-135-thread-2) [ ] o.e.j.s.Server Started @224348ms
    [junit4] 2> 222476 INFO (jetty-launcher-135-thread-1) [ ] o.e.j.s.ServerConnector Started ServerConnector@75003ef0{HTTP/1.1}{127.0.0.1:41153}
    [junit4] 2> 222476 INFO (jetty-launcher-135-thread-2) [ ] o.a.s.c.s.e.JettySolrRunner Jetty properties: {hostPort=37276, hostContext=/solr}
    [junit4] 2> 222476 INFO (jetty-launcher-135-thread-1) [ ] o.e.j.s.Server Started @224348ms
    [junit4] 2> 222476 INFO (jetty-launcher-135-thread-1) [ ] o.a.s.c.s.e.JettySolrRunner Jetty properties: {hostContext=/solr, hostPort=41153}
    [junit4] 2> 222476 INFO (jetty-launcher-135-thread-2) [ ] o.a.s.s.SolrDispatchFilter SolrDispatchFilter.init(): sun.misc.Launcher$AppClassLoader@2026c088
    [junit4] 2> 222476 INFO (jetty-launcher-135-thread-2) [ ] o.a.s.c.SolrResourceLoader new SolrResourceLoader for directory: '/home/jenkins/workspace/Lucene-Solr-5.5-Linux/solr/build/solr-core/test/J0/temp/solr.schema.TestManagedSchemaAPI_DD7EE446806D56DA-001/tempDir-001/node2'
    [junit4] 2> 222476 INFO (jetty-launcher-135-thread-1) [ ] o.a.s.s.SolrDispatchFilter SolrDispatchFilter.init(): sun.misc.Launcher$AppClassLoader@2026c088
    [junit4] 2> 222476 INFO (jetty-launcher-135-thread-1) [ ] o.a.s.c.SolrResourceLoader new SolrResourceLoader for directory: '/home/jenkins/workspace/Lucene-Solr-5.5-Linux/solr/build/solr-core/test/J0/temp/solr.schema.TestManagedSchemaAPI_DD7EE446806D56DA-001/tempDir-001/node1'
    [junit4] 2> 222476 INFO (jetty-launcher-135-thread-2) [ ] o.a.s.c.SolrResourceLoader JNDI not configured for solr (NoInitialContextEx)
    [junit4] 2> 222476 INFO (jetty-launcher-135-thread-2) [ ] o.a.s.c.SolrResourceLoader solr home defaulted to 'solr/' (could not find system property or JNDI)
    [junit4] 2> 222476 INFO (jetty-launcher-135-thread-1) [ ] o.a.s.c.SolrResourceLoader JNDI not configured for solr (NoInitialContextEx)
    [junit4] 2> 222476 INFO (jetty-launcher-135-thread-1) [ ] o.a.s.c.SolrResourceLoader solr home defaulted to 'solr/' (could not find system property or JNDI)
    [junit4] 2> 222476 INFO (jetty-launcher-135-thread-2) [ ] o.a.s.c.c.SolrZkClient Using default ZkCredentialsProvider
    [junit4] 2> 222476 INFO (jetty-launcher-135-thread-1) [ ] o.a.s.c.c.SolrZkClient Using default ZkCredentialsProvider
    [junit4] 2> 222477 INFO (jetty-launcher-135-thread-2) [ ] o.a.s.c.c.ConnectionManager Waiting for client to connect to ZooKeeper
    [junit4] 2> 222477 INFO (jetty-launcher-135-thread-1) [ ] o.a.s.c.c.ConnectionManager Waiting for client to connect to ZooKeeper
    [junit4] 2> 222478 INFO (zkCallback-138-thread-1) [ ] o.a.s.c.c.ConnectionManager Watcher org.apache.solr.common.cloud.ConnectionManager@21a4dc87 name:ZooKeeperConnection Watcher:127.0.0.1:36828/solr got event WatchedEvent state:SyncConnected type:None path:null path:null type:None
    [junit4] 2> 222478 INFO (jetty-launcher-135-thread-1) [ ] o.a.s.c.c.ConnectionManager Client is connected to ZooKeeper
    [junit4] 2> 222478 INFO (jetty-launcher-135-thread-1) [ ] o.a.s.c.c.SolrZkClient Using default ZkACLProvider
    [junit4] 2> 222478 INFO (zkCallback-137-thread-1) [ ] o.a.s.c.c.ConnectionManager Watcher org.apache.solr.common.cloud.ConnectionManager@1320240e name:ZooKeeperConnection Watcher:127.0.0.1:36828/solr got event WatchedEvent state:SyncConnected type:None path:null path:null type:None
    [junit4] 2> 222478 INFO (jetty-launcher-135-thread-2) [ ] o.a.s.c.c.ConnectionManager Client is connected to ZooKeeper
    [junit4] 2> 222478 INFO (jetty-launcher-135-thread-2) [ ] o.a.s.c.c.SolrZkClient Using default ZkACLProvider
    [junit4] 2> 222479 INFO (jetty-launcher-135-thread-1) [ ] o.a.s.s.SolrDispatchFilter solr.xml found in ZooKeeper. Loading...
    [junit4] 2> 222479 INFO (jetty-launcher-135-thread-2) [ ] o.a.s.s.SolrDispatchFilter solr.xml found in ZooKeeper. Loading...
    [junit4] 2> 222492 INFO (jetty-launcher-135-thread-2) [ ] o.a.s.c.CorePropertiesLocator Config-defined core root directory: /home/jenkins/workspace/Lucene-Solr-5.5-Linux/solr/build/solr-core/test/J0/temp/solr.schema.TestManagedSchemaAPI_DD7EE446806D56DA-001/tempDir-001/node2/.
    [junit4] 2> 222492 INFO (jetty-launcher-135-thread-1) [ ] o.a.s.c.CorePropertiesLocator Config-defined core root directory: /home/jenkins/workspace/Lucene-Solr-5.5-Linux/solr/build/solr-core/test/J0/temp/solr.schema.TestManagedSchemaAPI_DD7EE446806D56DA-001/tempDir-001/node1/.
    [junit4] 2> 222492 INFO (jetty-launcher-135-thread-2) [ ] o.a.s.c.CoreContainer New CoreContainer 1584398407
    [junit4] 2> 222492 WARN (NIOServerCxn.Factory:0.0.0.0/0.0.0.0:0) [ ] o.a.z.s.NIOServerCnxn caught end of stream exception
    [junit4] 2> EndOfStreamException: Unable to read additional data from client sessionid 0x15561ff26550001, likely client has closed socket
    [junit4] 2> at org.apache.zookeeper.server.NIOServerCnxn.doIO(NIOServerCnxn.java:228)
    [junit4] 2> at org.apache.zookeeper.server.NIOServerCnxnFactory.run(NIOServerCnxnFactory.java:208)
    [junit4] 2> at java.lang.Thread.run(Thread.java:745)
    [junit4] 2> 222492 INFO (jetty-launcher-135-thread-1) [ ] o.a.s.c.CoreContainer New CoreContainer 186803649
    [junit4] 2> 222492 INFO (jetty-launcher-135-thread-2) [ ] o.a.s.c.CoreContainer Loading cores into CoreContainer [instanceDir=/home/jenkins/workspace/Lucene-Solr-5.5-Linux/solr/build/solr-core/test/J0/temp/solr.schema.TestManagedSchemaAPI_DD7EE446806D56DA-001/tempDir-001/node2]
    [junit4] 2> 222492 INFO (jetty-launcher-135-thread-1) [ ] o.a.s.c.CoreContainer Loading cores into CoreContainer [instanceDir=/home/jenkins/workspace/Lucene-Solr-5.5-Linux/solr/build/solr-core/test/J0/temp/solr.schema.TestManagedSchemaAPI_DD7EE446806D56DA-001/tempDir-001/node1]
    [junit4] 2> 222492 WARN (jetty-launcher-135-thread-2) [ ] o.a.s.c.CoreContainer Couldn't add files from /home/jenkins/workspace/Lucene-Solr-5.5-Linux/solr/build/solr-core/test/J0/temp/solr.schema.TestManagedSchemaAPI_DD7EE446806D56DA-001/tempDir-001/node2/lib to classpath: /home/jenkins/workspace/Lucene-Solr-5.5-Linux/solr/build/solr-core/test/J0/temp/solr.schema.TestManagedSchemaAPI_DD7EE446806D56DA-001/tempDir-001/node2/lib
    [junit4] 2> 222492 WARN (jetty-launcher-135-thread-1) [ ] o.a.s.c.CoreContainer Couldn't add files from /home/jenkins/workspace/Lucene-Solr-5.5-Linux/solr/build/solr-core/test/J0/temp/solr.schema.TestManagedSchemaAPI_DD7EE446806D56DA-001/tempDir-001/node1/lib to classpath: /home/jenkins/workspace/Lucene-Solr-5.5-Linux/solr/build/solr-core/test/J0/temp/solr.schema.TestManagedSchemaAPI_DD7EE446806D56DA-001/tempDir-001/node1/lib
    [junit4] 2> 222492 INFO (jetty-launcher-135-thread-2) [ ] o.a.s.h.c.HttpShardHandlerFactory created with socketTimeout : 90000,urlScheme : ,connTimeout : 15000,maxConnectionsPerHost : 20,maxConnections : 10000,corePoolSize : 0,maximumPoolSize : 2147483647,maxThreadIdleTime : 5,sizeOfQueue : -1,fairnessPolicy : false,useRetries : false,
    [junit4] 2> 222493 INFO (jetty-launcher-135-thread-1) [ ] o.a.s.h.c.HttpShardHandlerFactory created with socketTimeout : 90000,urlScheme : ,connTimeout : 15000,maxConnectionsPerHost : 20,maxConnections : 10000,corePoolSize : 0,maximumPoolSize : 2147483647,maxThreadIdleTime : 5,sizeOfQueue : -1,fairnessPolicy : false,useRetries : false,
    [junit4] 2> 222494 INFO (jetty-launcher-135-thread-2) [ ] o.a.s.u.UpdateShardHandler Creating UpdateShardHandler HTTP client with params: socketTimeout=340000&connTimeout=45000&retry=true
    [junit4] 2> 222494 INFO (jetty-launcher-135-thread-1) [ ] o.a.s.u.UpdateShardHandler Creating UpdateShardHandler HTTP client with params: socketTimeout=340000&connTimeout=45000&retry=true
    [junit4] 2> 222494 INFO (jetty-launcher-135-thread-2) [ ] o.a.s.l.LogWatcher SLF4J impl is org.slf4j.impl.Log4jLoggerFactory
    [junit4] 2> 222494 INFO (jetty-launcher-135-thread-2) [ ] o.a.s.l.LogWatcher Registering Log Listener [Log4j (org.slf4j.impl.Log4jLoggerFactory)]
    [junit4] 2> 222494 INFO (jetty-launcher-135-thread-1) [ ] o.a.s.l.LogWatcher SLF4J impl is org.slf4j.impl.Log4jLoggerFactory
    [junit4] 2> 222494 INFO (jetty-launcher-135-thread-1) [ ] o.a.s.l.LogWatcher Registering Log Listener [Log4j (org.slf4j.impl.Log4jLoggerFactory)]
    [junit4] 2> 222494 INFO (jetty-launcher-135-thread-2) [ ] o.a.s.c.ZkContainer Zookeeper client=127.0.0.1:36828/solr
    [junit4] 2> 222494 INFO (jetty-launcher-135-thread-2) [ ] o.a.s.c.ZkController zkHost includes chroot
    [junit4] 2> 222494 INFO (jetty-launcher-135-thread-1) [ ] o.a.s.c.ZkContainer Zookeeper client=127.0.0.1:36828/solr
    [junit4] 2> 222494 INFO (jetty-launcher-135-thread-2) [ ] o.a.s.c.c.SolrZkClient Using default ZkCredentialsProvider
    [junit4] 2> 222494 INFO (jetty-launcher-135-thread-1) [ ] o.a.s.c.ZkController zkHost includes chroot
    [junit4] 2> 222494 INFO (jetty-launcher-135-thread-1) [ ] o.a.s.c.c.SolrZkClient Using default ZkCredentialsProvider
    [junit4] 2> 222495 INFO (jetty-launcher-135-thread-2) [ ] o.a.s.c.c.ConnectionManager Waiting for client to connect to ZooKeeper
    [junit4] 2> 222495 INFO (jetty-launcher-135-thread-1) [ ] o.a.s.c.c.ConnectionManager Waiting for client to connect to ZooKeeper
    [junit4] 2> 222496 INFO (zkCallback-143-thread-1) [ ] o.a.s.c.c.ConnectionManager Watcher org.apache.solr.common.cloud.ConnectionManager@742705b0 name:ZooKeeperConnection Watcher:127.0.0.1:36828 got event WatchedEvent state:SyncConnected type:None path:null path:null type:None
    [junit4] 2> 222496 INFO (jetty-launcher-135-thread-2) [ ] o.a.s.c.c.ConnectionManager Client is connected to ZooKeeper
    [junit4] 2> 222496 INFO (jetty-launcher-135-thread-2) [ ] o.a.s.c.c.SolrZkClient Using default ZkACLProvider
    [junit4] 2> 222496 INFO (zkCallback-144-thread-1) [ ] o.a.s.c.c.ConnectionManager Watcher org.apache.solr.common.cloud.ConnectionManager@75738bdb name:ZooKeeperConnection Watcher:127.0.0.1:36828 got event WatchedEvent state:SyncConnected type:None path:null path:null type:None
    [junit4] 2> 222496 INFO (jetty-launcher-135-thread-1) [ ] o.a.s.c.c.ConnectionManager Client is connected to ZooKeeper
    [junit4] 2> 222496 INFO (jetty-launcher-135-thread-1) [ ] o.a.s.c.c.SolrZkClient Using default ZkACLProvider
    [junit4] 2> 222498 INFO (jetty-launcher-135-thread-2) [n:127.0.0.1:37276_solr ] o.a.s.c.ZkController Added new OnReconnect listener org.apache.solr.cloud.ZkController$6@750468e2
    [junit4] 2> 222499 INFO (jetty-launcher-135-thread-2) [n:127.0.0.1:37276_solr ] o.a.s.c.c.ConnectionManager Waiting for client to connect to ZooKeeper
    [junit4] 2> 222499 INFO (jetty-launcher-135-thread-1) [n:127.0.0.1:41153_solr ] o.a.s.c.ZkController Added new OnReconnect listener org.apache.solr.cloud.ZkController$6@73ad9fb8
    [junit4] 2> 222499 INFO (jetty-launcher-135-thread-1) [n:127.0.0.1:41153_solr ] o.a.s.c.c.ConnectionManager Waiting for client to connect to ZooKeeper
    [junit4] 2> 222500 INFO (zkCallback-145-thread-1-processing-n:127.0.0.1:37276_solr) [n:127.0.0.1:37276_solr ] o.a.s.c.c.ConnectionManager Watcher org.apache.solr.common.cloud.ConnectionManager@2e162ba9 name:ZooKeeperConnection Watcher:127.0.0.1:36828/solr got event WatchedEvent state:SyncConnected type:None path:null path:null type:None
    [junit4] 2> 222500 INFO (jetty-launcher-135-thread-2) [n:127.0.0.1:37276_solr ] o.a.s.c.c.ConnectionManager Client is connected to ZooKeeper
    [junit4] 2> 222500 INFO (zkCallback-146-thread-1-processing-n:127.0.0.1:41153_solr) [n:127.0.0.1:41153_solr ] o.a.s.c.c.ConnectionManager Watcher org.apache.solr.common.cloud.ConnectionManager@74fe9f46 name:ZooKeeperConnection Watcher:127.0.0.1:36828/solr got event WatchedEvent state:SyncConnected type:None path:null path:null type:None
    [junit4] 2> 222500 INFO (jetty-launcher-135-thread-1) [n:127.0.0.1:41153_solr ] o.a.s.c.c.ConnectionManager Client is connected to ZooKeeper
    [junit4] 2> 222501 INFO (jetty-launcher-135-thread-2) [n:127.0.0.1:37276_solr ] o.a.s.c.c.SolrZkClient makePath: /overseer/queue
    [junit4] 2> 222501 INFO (jetty-launcher-135-thread-1) [n:127.0.0.1:41153_solr ] o.a.s.c.c.SolrZkClient makePath: /overseer/queue
    [junit4] 2> 222502 INFO (jetty-launcher-135-thread-1) [n:127.0.0.1:41153_solr ] o.a.s.c.c.SolrZkClient makePath: /overseer/collection-queue-work
    [junit4] 2> 222502 INFO (jetty-launcher-135-thread-2) [n:127.0.0.1:37276_solr ] o.a.s.c.c.SolrZkClient makePath: /overseer/collection-queue-work
    [junit4] 2> 222504 INFO (jetty-launcher-135-thread-2) [n:127.0.0.1:37276_solr ] o.a.s.c.c.SolrZkClient makePath: /overseer/collection-map-running
    [junit4] 2> 222504 INFO (jetty-launcher-135-thread-1) [n:127.0.0.1:41153_solr ] o.a.s.c.c.SolrZkClient makePath: /overseer/collection-map-running
    [junit4] 2> 222505 INFO (jetty-launcher-135-thread-1) [n:127.0.0.1:41153_solr ] o.a.s.c.c.SolrZkClient makePath: /overseer/collection-map-completed
    [junit4] 2> 222505 INFO (jetty-launcher-135-thread-2) [n:127.0.0.1:37276_solr ] o.a.s.c.c.SolrZkClient makePath: /overseer/collection-map-completed
    [junit4] 2> 222506 INFO (jetty-launcher-135-thread-2) [n:127.0.0.1:37276_solr ] o.a.s.c.c.SolrZkClient makePath: /overseer/collection-map-failure
    [junit4] 2> 222506 INFO (jetty-launcher-135-thread-1) [n:127.0.0.1:41153_solr ] o.a.s.c.c.SolrZkClient makePath: /overseer/collection-map-failure
    [junit4] 2> 222507 INFO (jetty-launcher-135-thread-1) [n:127.0.0.1:41153_solr ] o.a.s.c.c.SolrZkClient makePath: /live_nodes
    [junit4] 2> 222507 INFO (jetty-launcher-135-thread-2) [n:127.0.0.1:37276_solr ] o.a.s.c.c.SolrZkClient makePath: /live_nodes
    [junit4] 2> 222508 INFO (jetty-launcher-135-thread-2) [n:127.0.0.1:37276_solr ] o.a.s.c.c.SolrZkClient makePath: /collections
    [junit4] 2> 222508 INFO (jetty-launcher-135-thread-1) [n:127.0.0.1:41153_solr ] o.a.s.c.c.SolrZkClient makePath: /collections
    [junit4] 2> 222508 INFO (jetty-launcher-135-thread-1) [n:127.0.0.1:41153_solr ] o.a.s.c.c.SolrZkClient makePath: /aliases.json
    [junit4] 2> 222508 INFO (jetty-launcher-135-thread-2) [n:127.0.0.1:37276_solr ] o.a.s.c.c.SolrZkClient makePath: /aliases.json
    [junit4] 2> 222510 INFO (jetty-launcher-135-thread-2) [n:127.0.0.1:37276_solr ] o.a.s.c.c.SolrZkClient makePath: /clusterstate.json
    [junit4] 2> 222510 INFO (jetty-launcher-135-thread-1) [n:127.0.0.1:41153_solr ] o.a.s.c.c.SolrZkClient makePath: /clusterstate.json
    [junit4] 2> 222511 INFO (jetty-launcher-135-thread-1) [n:127.0.0.1:41153_solr ] o.a.s.c.c.SolrZkClient makePath: /security.json
    [junit4] 2> 222511 INFO (jetty-launcher-135-thread-2) [n:127.0.0.1:37276_solr ] o.a.s.c.c.SolrZkClient makePath: /security.json
    [junit4] 2> 222511 INFO (jetty-launcher-135-thread-2) [n:127.0.0.1:37276_solr ] o.a.s.c.ZkController Register node as live in ZooKeeper:/live_nodes/127.0.0.1:37276_solr
    [junit4] 2> 222512 INFO (jetty-launcher-135-thread-1) [n:127.0.0.1:41153_solr ] o.a.s.c.ZkController Register node as live in ZooKeeper:/live_nodes/127.0.0.1:41153_solr
    [junit4] 2> 222512 INFO (jetty-launcher-135-thread-2) [n:127.0.0.1:37276_solr ] o.a.s.c.c.SolrZkClient makePath: /live_nodes/127.0.0.1:37276_solr
    [junit4] 2> 222512 INFO (jetty-launcher-135-thread-1) [n:127.0.0.1:41153_solr ] o.a.s.c.c.SolrZkClient makePath: /live_nodes/127.0.0.1:41153_solr
    [junit4] 2> 222513 INFO (jetty-launcher-135-thread-2) [n:127.0.0.1:37276_solr ] o.a.s.c.c.SolrZkClient makePath: /overseer_elect
    [junit4] 2> 222513 INFO (jetty-launcher-135-thread-1) [n:127.0.0.1:41153_solr ] o.a.s.c.c.SolrZkClient makePath: /overseer_elect
    [junit4] 2> 222513 INFO (jetty-launcher-135-thread-1) [n:127.0.0.1:41153_solr ] o.a.s.c.c.SolrZkClient makePath: /overseer_elect/election
    [junit4] 2> 222513 INFO (jetty-launcher-135-thread-2) [n:127.0.0.1:37276_solr ] o.a.s.c.c.SolrZkClient makePath: /overseer_elect/election
    [junit4] 2> 222514 INFO (jetty-launcher-135-thread-2) [n:127.0.0.1:37276_solr ] o.a.s.c.Overseer Overseer (id=null) closing
    [junit4] 2> 222514 INFO (jetty-launcher-135-thread-1) [n:127.0.0.1:41153_solr ] o.a.s.c.Overseer Overseer (id=null) closing
    [junit4] 2> 222514 INFO (jetty-launcher-135-thread-2) [n:127.0.0.1:37276_solr ] o.a.s.c.LeaderElector Joined leadership election with path: /overseer_elect/election/96090715545993221-127.0.0.1:37276_solr-n_0000000000
    [junit4] 2> 222514 INFO (jetty-launcher-135-thread-1) [n:127.0.0.1:41153_solr ] o.a.s.c.LeaderElector Joined leadership election with path: /overseer_elect/election/96090715545993222-127.0.0.1:41153_solr-n_0000000001
    [junit4] 2> 222515 INFO (jetty-launcher-135-thread-2) [n:127.0.0.1:37276_solr ] o.a.s.c.OverseerElectionContext I am going to be the leader 127.0.0.1:37276_solr
    [junit4] 2> 222515 INFO (jetty-launcher-135-thread-2) [n:127.0.0.1:37276_solr ] o.a.s.c.c.SolrZkClient makePath: /overseer_elect/leader
    [junit4] 2> 222515 INFO (jetty-launcher-135-thread-1) [n:127.0.0.1:41153_solr ] o.a.s.c.LeaderElector Watching path /overseer_elect/election/96090715545993221-127.0.0.1:37276_solr-n_0000000000 to know if I could be the leader
    [junit4] 2> 222515 INFO (jetty-launcher-135-thread-1) [n:127.0.0.1:41153_solr ] o.a.s.c.c.ZkStateReader Updating cluster state from ZooKeeper...
    [junit4] 2> 222515 INFO (jetty-launcher-135-thread-2) [n:127.0.0.1:37276_solr ] o.a.s.c.Overseer Overseer (id=96090715545993221-127.0.0.1:37276_solr-n_0000000000) starting
    [junit4] 2> 222516 INFO (jetty-launcher-135-thread-2) [n:127.0.0.1:37276_solr ] o.a.s.c.c.SolrZkClient makePath: /overseer/queue-work
    [junit4] 2> 222522 INFO (jetty-launcher-135-thread-2) [n:127.0.0.1:37276_solr ] o.a.s.c.OverseerAutoReplicaFailoverThread Starting OverseerAutoReplicaFailoverThread autoReplicaFailoverWorkLoopDelay=10000 autoReplicaFailoverWaitAfterExpiration=30000 autoReplicaFailoverBadNodeExpiration=60000
    [junit4] 2> 222522 INFO (OverseerCollectionConfigSetProcessor-96090715545993221-127.0.0.1:37276_solr-n_0000000000) [n:127.0.0.1:37276_solr ] o.a.s.c.OverseerTaskProcessor Process current queue of overseer operations
    [junit4] 2> 222522 INFO (jetty-launcher-135-thread-2) [n:127.0.0.1:37276_solr ] o.a.s.c.c.ZkStateReader Updating cluster state from ZooKeeper...
    [junit4] 2> 222523 INFO (OverseerStateUpdate-96090715545993221-127.0.0.1:37276_solr-n_0000000000) [n:127.0.0.1:37276_solr ] o.a.s.c.Overseer Starting to work on the main queue
    [junit4] 2> 222530 INFO (jetty-launcher-135-thread-1) [n:127.0.0.1:41153_solr ] o.a.s.c.CoreContainer Security conf doesn't exist. Skipping setup for authorization module.
    [junit4] 2> 222530 INFO (jetty-launcher-135-thread-1) [n:127.0.0.1:41153_solr ] o.a.s.c.CoreContainer No authentication plugin used.
    [junit4] 2> 222531 INFO (jetty-launcher-135-thread-1) [n:127.0.0.1:41153_solr ] o.a.s.c.CorePropertiesLocator Looking for core definitions underneath /home/jenkins/workspace/Lucene-Solr-5.5-Linux/solr/build/solr-core/test/J0/temp/solr.schema.TestManagedSchemaAPI_DD7EE446806D56DA-001/tempDir-001/node1/.
    [junit4] 2> 222531 INFO (jetty-launcher-135-thread-1) [n:127.0.0.1:41153_solr ] o.a.s.c.CorePropertiesLocator Found 0 core definitions
    [junit4] 2> 222531 INFO (jetty-launcher-135-thread-1) [n:127.0.0.1:41153_solr ] o.a.s.s.SolrDispatchFilter user.dir=/home/jenkins/workspace/Lucene-Solr-5.5-Linux/solr/build/solr-core/test/J0
    [junit4] 2> 222531 INFO (jetty-launcher-135-thread-1) [n:127.0.0.1:41153_solr ] o.a.s.s.SolrDispatchFilter SolrDispatchFilter.init() done
    [junit4] 2> 222537 INFO (jetty-launcher-135-thread-2) [n:127.0.0.1:37276_solr ] o.a.s.c.CoreContainer Security conf doesn't exist. Skipping setup for authorization module.
    [junit4] 2> 222537 INFO (jetty-launcher-135-thread-2) [n:127.0.0.1:37276_solr ] o.a.s.c.CoreContainer No authentication plugin used.
    [junit4] 2> 222537 INFO (jetty-launcher-135-thread-2) [n:127.0.0.1:37276_solr ] o.a.s.c.CorePropertiesLocator Looking for core definitions underneath /home/jenkins/workspace/Lucene-Solr-5.5-Linux/solr/build/solr-core/test/J0/temp/solr.schema.TestManagedSchemaAPI_DD7EE446806D56DA-001/tempDir-001/node2/.
    [junit4] 2> 222538 INFO (jetty-launcher-135-thread-2) [n:127.0.0.1:37276_solr ] o.a.s.c.CorePropertiesLocator Found 0 core definitions
    [junit4] 2> 222538 INFO (jetty-launcher-135-thread-2) [n:127.0.0.1:37276_solr ] o.a.s.s.SolrDispatchFilter user.dir=/home/jenkins/workspace/Lucene-Solr-5.5-Linux/solr/build/solr-core/test/J0
    [junit4] 2> 222538 INFO (jetty-launcher-135-thread-2) [n:127.0.0.1:37276_solr ] o.a.s.s.SolrDispatchFilter SolrDispatchFilter.init() done
    [junit4] 2> 222538 INFO (TEST-TestManagedSchemaAPI.test-seed#[DD7EE446806D56DA]) [ ] o.a.s.c.c.SolrZkClient Using default ZkCredentialsProvider
    [junit4] 2> 222539 INFO (TEST-TestManagedSchemaAPI.test-seed#[DD7EE446806D56DA]) [ ] o.a.s.c.c.ConnectionManager Waiting for client to connect to ZooKeeper
    [junit4] 2> 222540 INFO (zkCallback-147-thread-1) [ ] o.a.s.c.c.ConnectionManager Watcher org.apache.solr.common.cloud.ConnectionManager@78e3e2dd name:ZooKeeperConnection Watcher:127.0.0.1:36828 got event WatchedEvent state:SyncConnected type:None path:null path:null type:None
    [junit4] 2> 222540 INFO (TEST-TestManagedSchemaAPI.test-seed#[DD7EE446806D56DA]) [ ] o.a.s.c.c.ConnectionManager Client is connected to ZooKeeper
    [junit4] 2> 222540 INFO (TEST-TestManagedSchemaAPI.test-seed#[DD7EE446806D56DA]) [ ] o.a.s.c.c.SolrZkClient Using default ZkACLProvider
    [junit4] 2> 222542 INFO (TEST-TestManagedSchemaAPI.test-seed#[DD7EE446806D56DA]) [ ] o.a.s.c.c.SolrZkClient Using default ZkCredentialsProvider
    [junit4] 2> 222542 INFO (TEST-TestManagedSchemaAPI.test-seed#[DD7EE446806D56DA]) [ ] o.a.s.c.c.ConnectionManager Waiting for client to connect to ZooKeeper
    [junit4] 2> 222543 INFO (zkCallback-149-thread-1) [ ] o.a.s.c.c.ConnectionManager Watcher org.apache.solr.common.cloud.ConnectionManager@7b482ad2 name:ZooKeeperConnection Watcher:127.0.0.1:36828/solr got event WatchedEvent state:SyncConnected type:None path:null path:null type:None
    [junit4] 2> 222543 INFO (TEST-TestManagedSchemaAPI.test-seed#[DD7EE446806D56DA]) [ ] o.a.s.c.c.ConnectionManager Client is connected to ZooKeeper
    [junit4] 2> 222543 INFO (TEST-TestManagedSchemaAPI.test-seed#[DD7EE446806D56DA]) [ ] o.a.s.c.c.SolrZkClient Using default ZkACLProvider
    [junit4] 2> 222544 INFO (TEST-TestManagedSchemaAPI.test-seed#[DD7EE446806D56DA]) [ ] o.a.s.c.c.SolrZkClient makePath: /configs/conf1/solrconfig.xml
    [junit4] 2> 222547 INFO (TEST-TestManagedSchemaAPI.test-seed#[DD7EE446806D56DA]) [ ] o.a.s.c.c.SolrZkClient makePath: /configs/conf1/managed-schema
    [junit4] 2> 222549 INFO (TEST-TestManagedSchemaAPI.test-seed#[DD7EE446806D56DA]) [ ] o.a.s.c.c.SolrZkClient Using default ZkCredentialsProvider
    [junit4] 2> 222549 INFO (TEST-TestManagedSchemaAPI.test-seed#[DD7EE446806D56DA]) [ ] o.a.s.c.c.ConnectionManager Waiting for client to connect to ZooKeeper
    [junit4] 2> 222550 INFO (zkCallback-150-thread-1) [ ] o.a.s.c.c.ConnectionManager Watcher org.apache.solr.common.cloud.ConnectionManager@34985ea name:ZooKeeperConnection Watcher:127.0.0.1:36828/solr got event WatchedEvent state:SyncConnected type:None path:null path:null type:None
    [junit4] 2> 222550 INFO (TEST-TestManagedSchemaAPI.test-seed#[DD7EE446806D56DA]) [ ] o.a.s.c.c.ConnectionManager Client is connected to ZooKeeper
    [junit4] 2> 222550 INFO (TEST-TestManagedSchemaAPI.test-seed#[DD7EE446806D56DA]) [ ] o.a.s.c.c.SolrZkClient Using default ZkACLProvider
    [junit4] 2> 222550 INFO (TEST-TestManagedSchemaAPI.test-seed#[DD7EE446806D56DA]) [ ] o.a.s.c.c.ZkStateReader Updating cluster state from ZooKeeper...
    [junit4] 2> 222554 INFO (qtp1560316757-1131) [n:127.0.0.1:41153_solr ] o.a.s.h.a.CollectionsHandler Invoked Collection Action :create with params wt=javabin&numShards=1&replicationFactor=2&action=CREATE&collection.configName=conf1&version=2&name=testschemaapi and sendToOCPQueue=true
    [junit4] 2> 222556 INFO (OverseerCollectionConfigSetProcessor-96090715545993221-127.0.0.1:37276_solr-n_0000000000) [n:127.0.0.1:37276_solr ] o.a.s.c.OverseerTaskProcessor Overseer Collection Message Handler: Get the message id:/overseer/collection-queue-work/qn-0000000000 message:{
    [junit4] 2> "name":"testschemaapi",
    [junit4] 2> "fromApi":"true",
    [junit4] 2> "replicationFactor":"2",
    [junit4] 2> "collection.configName":"conf1",
    [junit4] 2> "numShards":"1",
    [junit4] 2> "stateFormat":"2",
    [junit4] 2> "operation":"create"}
    [junit4] 2> 222556 INFO (OverseerThreadFactory-376-thread-1-processing-n:127.0.0.1:37276_solr) [n:127.0.0.1:37276_solr ] o.a.s.c.OverseerCollectionMessageHandler OverseerCollectionMessageHandler.processMessage : create , {
    [junit4] 2> "name":"testschemaapi",
    [junit4] 2> "fromApi":"true",
    [junit4] 2> "replicationFactor":"2",
    [junit4] 2> "collection.configName":"conf1",
    [junit4] 2> "numShards":"1",
    [junit4] 2> "stateFormat":"2",
    [junit4] 2> "operation":"create"}
    [junit4] 2> 222558 INFO (OverseerThreadFactory-376-thread-1-processing-n:127.0.0.1:37276_solr) [n:127.0.0.1:37276_solr ] o.a.s.c.OverseerCollectionMessageHandler Create collection testschemaapi
    [junit4] 2> 222558 INFO (OverseerThreadFactory-376-thread-1-processing-n:127.0.0.1:37276_solr) [n:127.0.0.1:37276_solr ] o.a.s.c.OverseerCollectionMessageHandler creating collections conf node /collections/testschemaapi
    [junit4] 2> 222559 INFO (OverseerThreadFactory-376-thread-1-processing-n:127.0.0.1:37276_solr) [n:127.0.0.1:37276_solr ] o.a.s.c.c.SolrZkClient makePath: /collections/testschemaapi
    [junit4] 2> 222559 INFO (zkCallback-145-thread-1-processing-n:127.0.0.1:37276_solr) [n:127.0.0.1:37276_solr ] o.a.s.c.c.ZkStateReader A collections change: [WatchedEvent state:SyncConnected type:NodeChildrenChanged path:/collections], has occurred - updating...
    [junit4] 2> 222559 INFO (zkCallback-150-thread-1) [ ] o.a.s.c.c.ZkStateReader A collections change: [WatchedEvent state:SyncConnected type:NodeChildrenChanged path:/collections], has occurred - updating...
    [junit4] 2> 222559 INFO (zkCallback-146-thread-1-processing-n:127.0.0.1:41153_solr) [n:127.0.0.1:41153_solr ] o.a.s.c.c.ZkStateReader A collections change: [WatchedEvent state:SyncConnected type:NodeChildrenChanged path:/collections], has occurred - updating...
    [junit4] 2> 222561 INFO (OverseerStateUpdate-96090715545993221-127.0.0.1:37276_solr-n_0000000000) [n:127.0.0.1:37276_solr ] o.a.s.c.Overseer processMessage: queueSize: 1, message = {
    [junit4] 2> "name":"testschemaapi",
    [junit4] 2> "fromApi":"true",
    [junit4] 2> "replicationFactor":"2",
    [junit4] 2> "collection.configName":"conf1",
    [junit4] 2> "numShards":"1",
    [junit4] 2> "stateFormat":"2",
    [junit4] 2> "operation":"create"} current state version: 0
    [junit4] 2> 222561 INFO (OverseerStateUpdate-96090715545993221-127.0.0.1:37276_solr-n_0000000000) [n:127.0.0.1:37276_solr ] o.a.s.c.o.ClusterStateMutator building a new cName: testschemaapi
    [junit4] 2> 222562 INFO (OverseerStateUpdate-96090715545993221-127.0.0.1:37276_solr-n_0000000000) [n:127.0.0.1:37276_solr ] o.a.s.c.o.ZkStateWriter going to create_collection /collections/testschemaapi/state.json
    [junit4] 2> 222661 INFO (OverseerThreadFactory-376-thread-1-processing-n:127.0.0.1:37276_solr) [n:127.0.0.1:37276_solr ] o.a.s.c.OverseerCollectionMessageHandler Creating SolrCores for new collection testschemaapi, shardNames [shard1] , replicationFactor : 2
    [junit4] 2> 222661 INFO (OverseerThreadFactory-376-thread-1-processing-n:127.0.0.1:37276_solr) [n:127.0.0.1:37276_solr ] o.a.s.c.OverseerCollectionMessageHandler Creating core testschemaapi_shard1_replica2 as part of shard shard1 of collection testschemaapi on 127.0.0.1:41153_solr
    [junit4] 2> 222662 INFO (OverseerThreadFactory-376-thread-1-processing-n:127.0.0.1:37276_solr) [n:127.0.0.1:37276_solr ] o.a.s.c.OverseerCollectionMessageHandler Creating core testschemaapi_shard1_replica1 as part of shard shard1 of collection testschemaapi on 127.0.0.1:37276_solr
    [junit4] 2> 222666 INFO (qtp1560316757-1133) [n:127.0.0.1:41153_solr ] o.a.s.h.a.CoreAdminOperation core create command collection=testschemaapi&shard=shard1&numShards=1&wt=javabin&qt=/admin/cores&action=CREATE&collection.configName=conf1&version=2&name=testschemaapi_shard1_replica2
    [junit4] 2> 222666 INFO (qtp1560316757-1132) [n:127.0.0.1:37276_solr ] o.a.s.h.a.CoreAdminOperation core create command collection=testschemaapi&shard=shard1&numShards=1&wt=javabin&qt=/admin/cores&action=CREATE&collection.configName=conf1&version=2&name=testschemaapi_shard1_replica1
    [junit4] 2> 222666 INFO (qtp1560316757-1132) [n:127.0.0.1:37276_solr ] o.a.s.c.CoreDescriptor Created CoreDescriptor: {numShards=1, shard=shard1, loadOnStartup=true, config=solrconfig.xml, transient=false, collection.configName=conf1, configSetProperties=configsetprops.json, schema=schema.xml, name=testschemaapi_shard1_replica1, dataDir=data/, collection=testschemaapi}
    [junit4] 2> 222666 INFO (qtp1560316757-1133) [n:127.0.0.1:41153_solr ] o.a.s.c.CoreDescriptor Created CoreDescriptor: {collection=testschemaapi, numShards=1, schema=schema.xml, shard=shard1, configSetProperties=configsetprops.json, transient=false, dataDir=data/, name=testschemaapi_shard1_replica2, collection.configName=conf1, loadOnStartup=true, config=solrconfig.xml}
    [junit4] 2> 222667 INFO (qtp1560316757-1132) [n:127.0.0.1:37276_solr c:testschemaapi s:shard1 x:testschemaapi_shard1_replica1] o.a.s.c.ZkController publishing state=down
    [junit4] 2> 222667 INFO (qtp1560316757-1133) [n:127.0.0.1:41153_solr c:testschemaapi s:shard1 x:testschemaapi_shard1_replica2] o.a.s.c.ZkController publishing state=down
    [junit4] 2> 222668 INFO (qtp1560316757-1132) [n:127.0.0.1:37276_solr c:testschemaapi s:shard1 x:testschemaapi_shard1_replica1] o.a.s.c.ZkController Registering watch for collection testschemaapi
    [junit4] 2> 222668 INFO (qtp1560316757-1132) [n:127.0.0.1:37276_solr c:testschemaapi s:shard1 x:testschemaapi_shard1_replica1] o.a.s.c.c.ZkStateReader addZkWatch [testschemaapi]
    [junit4] 2> 222668 INFO (qtp1560316757-1133) [n:127.0.0.1:41153_solr c:testschemaapi s:shard1 x:testschemaapi_shard1_replica2] o.a.s.c.ZkController Registering watch for collection testschemaapi
    [junit4] 2> 222668 INFO (qtp1560316757-1133) [n:127.0.0.1:41153_solr c:testschemaapi s:shard1 x:testschemaapi_shard1_replica2] o.a.s.c.c.ZkStateReader addZkWatch [testschemaapi]
    [junit4] 2> 222668 INFO (OverseerStateUpdate-96090715545993221-127.0.0.1:37276_solr-n_0000000000) [n:127.0.0.1:37276_solr ] o.a.s.c.Overseer processMessage: queueSize: 2, message = {
    [junit4] 2> "collection":"testschemaapi",
    [junit4] 2> "state":"down",
    [junit4] 2> "shard":"shard1",
    [junit4] 2> "numShards":"1",
    [junit4] 2> "operation":"state",
    [junit4] 2> "roles":null,
    [junit4] 2> "core":"testschemaapi_shard1_replica1",
    [junit4] 2> "base_url":"http://127.0.0.1:37276/solr",
    [junit4] 2> "node_name":"127.0.0.1:37276_solr"} current state version: 0
    [junit4] 2> 222668 INFO (qtp1560316757-1132) [n:127.0.0.1:37276_solr c:testschemaapi s:shard1 x:testschemaapi_shard1_replica1] o.a.s.c.c.ZkStateReader Add data for [testschemaapi] ver [0]
    [junit4] 2> 222668 INFO (qtp1560316757-1132) [n:127.0.0.1:37276_solr c:testschemaapi s:shard1 x:testschemaapi_shard1_replica1] o.a.s.c.ZkController look for our core node name
    [junit4] 2> 222668 INFO (OverseerStateUpdate-96090715545993221-127.0.0.1:37276_solr-n_0000000000) [n:127.0.0.1:37276_solr ] o.a.s.c.o.ReplicaMutator Update state numShards=1 message={
    [junit4] 2> "collection":"testschemaapi",
    [junit4] 2> "state":"down",
    [junit4] 2> "shard":"shard1",
    [junit4] 2> "numShards":"1",
    [junit4] 2> "operation":"state",
    [junit4] 2> "roles":null,
    [junit4] 2> "core":"testschemaapi_shard1_replica1",
    [junit4] 2> "base_url":"http://127.0.0.1:37276/solr",
    [junit4] 2> "node_name":"127.0.0.1:37276_solr"}
    [junit4] 2> 222668 INFO (qtp1560316757-1133) [n:127.0.0.1:41153_solr c:testschemaapi s:shard1 x:testschemaapi_shard1_replica2] o.a.s.c.c.ZkStateReader Add data for [testschemaapi] ver [0]
    [junit4] 2> 222668 INFO (qtp1560316757-1133) [n:127.0.0.1:41153_solr c:testschemaapi s:shard1 x:testschemaapi_shard1_replica2] o.a.s.c.ZkController look for our core node name
    [junit4] 2> 222670 INFO (OverseerStateUpdate-96090715545993221-127.0.0.1:37276_solr-n_0000000000) [n:127.0.0.1:37276_solr ] o.a.s.c.Overseer processMessage: queueSize: 1, message = {
    [junit4] 2> "collection":"testschemaapi",
    [junit4] 2> "state":"down",
    [junit4] 2> "shard":"shard1",
    [junit4] 2> "numShards":"1",
    [junit4] 2> "operation":"state",
    [junit4] 2> "roles":null,
    [junit4] 2> "core":"testschemaapi_shard1_replica2",
    [junit4] 2> "base_url":"http://127.0.0.1:41153/solr",
    [junit4] 2> "node_name":"127.0.0.1:41153_solr"} current state version: 0
    [junit4] 2> 222670 INFO (OverseerStateUpdate-96090715545993221-127.0.0.1:37276_solr-n_0000000000) [n:127.0.0.1:37276_solr ] o.a.s.c.o.ReplicaMutator Update state numShards=1 message={
    [junit4] 2> "collection":"testschemaapi",
    [junit4] 2> "state":"down",
    [junit4] 2> "shard":"shard1",
    [junit4] 2> "numShards":"1",
    [junit4] 2> "operation":"state",
    [junit4] 2> "roles":null,
    [junit4] 2> "core":"testschemaapi_shard1_replica2",
    [junit4] 2> "base_url":"http://127.0.0.1:41153/solr",
    [junit4] 2> "node_name":"127.0.0.1:41153_solr"}
    [junit4] 2> 222772 INFO (OverseerStateUpdate-96090715545993221-127.0.0.1:37276_solr-n_0000000000) [n:127.0.0.1:37276_solr ] o.a.s.c.o.ZkStateWriter going to update_collection /collections/testschemaapi/state.json version: 0
    [junit4] 2> 222772 INFO (zkCallback-145-thread-1-processing-n:127.0.0.1:37276_solr) [n:127.0.0.1:37276_solr ] o.a.s.c.c.ZkStateReader A cluster state change: [WatchedEvent state:SyncConnected type:NodeDataChanged path:/collections/testschemaapi/state.json] for collection [testschemaapi] has occurred - updating... (live nodes size: [2])
    [junit4] 2> 222772 INFO (zkCallback-146-thread-1-processing-n:127.0.0.1:41153_solr) [n:127.0.0.1:41153_solr ] o.a.s.c.c.ZkStateReader A cluster state change: [WatchedEvent state:SyncConnected type:NodeDataChanged path:/collections/testschemaapi/state.json] for collection [testschemaapi] has occurred - updating... (live nodes size: [2])
    [junit4] 2> 222774 INFO (zkCallback-145-thread-1-processing-n:127.0.0.1:37276_solr) [n:127.0.0.1:37276_solr ] o.a.s.c.c.ZkStateReader Updating data for [testschemaapi] from [0] to [1]
    [junit4] 2> 222774 INFO (zkCallback-146-thread-1-processing-n:127.0.0.1:41153_solr) [n:127.0.0.1:41153_solr ] o.a.s.c.c.ZkStateReader Updating data for [testschemaapi] from [0] to [1]
    [junit4] 2> 223668 INFO (qtp1560316757-1132) [n:127.0.0.1:37276_solr c:testschemaapi s:shard1 x:testschemaapi_shard1_replica1] o.a.s.c.ZkController waiting to find shard id in clusterstate for testschemaapi_shard1_replica1
    [junit4] 2> 223668 INFO (qtp1560316757-1132) [n:127.0.0.1:37276_solr c:testschemaapi s:shard1 x:testschemaapi_shard1_replica1] o.a.s.c.ZkController Check for collection zkNode:testschemaapi
    [junit4] 2> 223669 INFO (qtp1560316757-1133) [n:127.0.0.1:41153_solr c:testschemaapi s:shard1 x:testschemaapi_shard1_replica2] o.a.s.c.ZkController waiting to find shard id in clusterstate for testschemaapi_shard1_replica2
    [junit4] 2> 223669 INFO (qtp1560316757-1133) [n:127.0.0.1:41153_solr c:testschemaapi s:shard1 x:testschemaapi_shard1_replica2] o.a.s.c.ZkController Check for collection zkNode:testschemaapi
    [junit4] 2> 223669 INFO (qtp1560316757-1132) [n:127.0.0.1:37276_solr c:testschemaapi s:shard1 x:testschemaapi_shard1_replica1] o.a.s.c.ZkController Collection zkNode exists
    [junit4] 2> 223669 INFO (qtp1560316757-1132) [n:127.0.0.1:37276_solr c:testschemaapi s:shard1 x:testschemaapi_shard1_replica1] o.a.s.c.c.ZkStateReader Load collection config from: [/collections/testschemaapi]
    [junit4] 2> 223669 INFO (qtp1560316757-1133) [n:127.0.0.1:41153_solr c:testschemaapi s:shard1 x:testschemaapi_shard1_replica2] o.a.s.c.ZkController Collection zkNode exists
    [junit4] 2> 223669 INFO (qtp1560316757-1133) [n:127.0.0.1:41153_solr c:testschemaapi s:shard1 x:testschemaapi_shard1_replica2] o.a.s.c.c.ZkStateReader Load collection config from: [/collections/testschemaapi]
    [junit4] 2> 223669 INFO (qtp1560316757-1132) [n:127.0.0.1:37276_solr c:testschemaapi s:shard1 x:testschemaapi_shard1_replica1] o.a.s.c.c.ZkStateReader path=[/collections/testschemaapi] [configName]=[conf1] specified config exists in ZooKeeper
    [junit4] 2> 223669 INFO (qtp1560316757-1133) [n:127.0.0.1:41153_solr c:testschemaapi s:shard1 x:testschemaapi_shard1_replica2] o.a.s.c.c.ZkStateReader path=[/collections/testschemaapi] [configName]=[conf1] specified config exists in ZooKeeper
    [junit4] 2> 223669 INFO (qtp1560316757-1132) [n:127.0.0.1:37276_solr c:testschemaapi s:shard1 x:testschemaapi_shard1_replica1] o.a.s.c.SolrResourceLoader new SolrResourceLoader for directory: '/home/jenkins/workspace/Lucene-Solr-5.5-Linux/solr/build/solr-core/test/J0/temp/solr.schema.TestManagedSchemaAPI_DD7EE446806D56DA-001/tempDir-001/node2/testschemaapi_shard1_replica1'
    [junit4] 2> 223669 INFO (qtp1560316757-1133) [n:127.0.0.1:41153_solr c:testschemaapi s:shard1 x:testschemaapi_shard1_replica2] o.a.s.c.SolrResourceLoader new SolrResourceLoader for directory: '/home/jenkins/workspace/Lucene-Solr-5.5-Linux/solr/build/solr-core/test/J0/temp/solr.schema.TestManagedSchemaAPI_DD7EE446806D56DA-001/tempDir-001/node1/testschemaapi_shard1_replica2'
    [junit4] 2> 223669 INFO (qtp1560316757-1132) [n:127.0.0.1:37276_solr c:testschemaapi s:shard1 x:testschemaapi_shard1_replica1] o.a.s.c.SolrResourceLoader JNDI not configured for solr (NoInitialContextEx)
    [junit4] 2> 223669 INFO (qtp1560316757-1132) [n:127.0.0.1:37276_solr c:testschemaapi s:shard1 x:testschemaapi_shard1_replica1] o.a.s.c.SolrResourceLoader solr home defaulted to 'solr/' (could not find system property or JNDI)
    [junit4] 2> 223669 INFO (qtp1560316757-1133) [n:127.0.0.1:41153_solr c:testschemaapi s:shard1 x:testschemaapi_shard1_replica2] o.a.s.c.SolrResourceLoader JNDI not configured for solr (NoInitialContextEx)
    [junit4] 2> 223670 INFO (qtp1560316757-1133) [n:127.0.0.1:41153_solr c:testschemaapi s:shard1 x:testschemaapi_shard1_replica2] o.a.s.c.SolrResourceLoader solr home defaulted to 'solr/' (could not find system property or JNDI)
    [junit4] 2> 223671 INFO (qtp1560316757-1133) [n:127.0.0.1:41153_solr c:testschemaapi s:shard1 x:testschemaapi_shard1_replica2] o.a.s.c.Config loaded config solrconfig.xml with version 0
    [junit4] 2> 223671 INFO (qtp1560316757-1132) [n:127.0.0.1:37276_solr c:testschemaapi s:shard1 x:testschemaapi_shard1_replica1] o.a.s.c.Config loaded config solrconfig.xml with version 0
    [junit4] 2> 223675 INFO (qtp1560316757-1133) [n:127.0.0.1:41153_solr c:testschemaapi s:shard1 x:testschemaapi_shard1_replica2] o.a.s.c.SolrConfig current version of requestparams : -1
    [junit4] 2> 223675 INFO (qtp1560316757-1132) [n:127.0.0.1:37276_solr c:testschemaapi s:shard1 x:testschemaapi_shard1_replica1] o.a.s.c.SolrConfig current version of requestparams : -1
    [junit4] 2> 223684 INFO (qtp1560316757-1132) [n:127.0.0.1:37276_solr c:testschemaapi s:shard1 x:testschemaapi_shard1_replica1] o.a.s.c.SolrConfig Using Lucene MatchVersion: 5.5.2
    [junit4] 2> 223685 INFO (qtp1560316757-1133) [n:127.0.0.1:41153_solr c:testschemaapi s:shard1 x:testschemaapi_shard1_replica2] o.a.s.c.SolrConfig Using Lucene MatchVersion: 5.5.2
    [junit4] 2> 223756 INFO (qtp1560316757-1132) [n:127.0.0.1:37276_solr c:testschemaapi s:shard1 x:testschemaapi_shard1_replica1] o.a.s.c.SolrConfig Loaded SolrConfig: solrconfig.xml
    [junit4] 2> 223756 INFO (qtp1560316757-1133) [n:127.0.0.1:41153_solr c:testschemaapi s:shard1 x:testschemaapi_shard1_replica2] o.a.s.c.SolrConfig Loaded SolrConfig: solrconfig.xml
    [junit4] 2> 223760 INFO (qtp1560316757-1132) [n:127.0.0.1:37276_solr c:testschemaapi s:shard1 x:testschemaapi_shard1_replica1] o.a.s.s.IndexSchema [testschemaapi_shard1_replica1] Schema name=minimal
    [junit4] 2> 223760 INFO (qtp1560316757-1133) [n:127.0.0.1:41153_solr c:testschemaapi s:shard1 x:testschemaapi_shard1_replica2] o.a.s.s.IndexSchema [testschemaapi_shard1_replica2] Schema name=minimal
    [junit4] 2> 223767 INFO (qtp1560316757-1132) [n:127.0.0.1:37276_solr c:testschemaapi s:shard1 x:testschemaapi_shard1_replica1] o.a.s.s.IndexSchema unique key field: id
    [junit4] 2> 223767 INFO (qtp1560316757-1133) [n:127.0.0.1:41153_solr c:testschemaapi s:shard1 x:testschemaapi_shard1_replica2] o.a.s.s.IndexSchema unique key field: id
    [junit4] 2> 223768 INFO (qtp1560316757-1132) [n:127.0.0.1:37276_solr c:testschemaapi s:shard1 x:testschemaapi_shard1_replica1] o.a.s.c.ConfigSetProperties Did not find ConfigSet properties, assuming default properties: Can't find resource 'configsetprops.json' in classpath or '/configs/conf1', cwd=/home/jenkins/workspace/Lucene-Solr-5.5-Linux/solr/build/solr-core/test/J0
    [junit4] 2> 223768 INFO (qtp1560316757-1133) [n:127.0.0.1:41153_solr c:testschemaapi s:shard1 x:testschemaapi_shard1_replica2] o.a.s.c.ConfigSetProperties Did not find ConfigSet properties, assuming default properties: Can't find resource 'configsetprops.json' in classpath or '/configs/conf1', cwd=/home/jenkins/workspace/Lucene-Solr-5.5-Linux/solr/build/solr-core/test/J0
    [junit4] 2> 223768 INFO (qtp1560316757-1132) [n:127.0.0.1:37276_solr c:testschemaapi s:shard1 x:testschemaapi_shard1_replica1] o.a.s.c.CoreContainer Creating SolrCore 'testschemaapi_shard1_replica1' using configuration from collection testschemaapi
    [junit4] 2> 223768 INFO (qtp1560316757-1133) [n:127.0.0.1:41153_solr c:testschemaapi s:shard1 x:testschemaapi_shard1_replica2] o.a.s.c.CoreContainer Creating SolrCore 'testschemaapi_shard1_replica2' using configuration from collection testschemaapi
    [junit4] 2> 223768 INFO (qtp1560316757-1132) [n:127.0.0.1:37276_solr c:testschemaapi s:shard1 r:core_node1 x:testschemaapi_shard1_replica1] o.a.s.c.SolrCore org.apache.solr.core.MockDirectoryFactory
    [junit4] 2> 223768 INFO (qtp1560316757-1133) [n:127.0.0.1:41153_solr c:testschemaapi s:shard1 r:core_node2 x:testschemaapi_shard1_replica2] o.a.s.c.SolrCore org.apache.solr.core.MockDirectoryFactory
    [junit4] 2> 223768 INFO (qtp1560316757-1132) [n:127.0.0.1:37276_solr c:testschemaapi s:shard1 r:core_node1 x:testschemaapi_shard1_replica1] o.a.s.c.SolrCore [[testschemaapi_shard1_replica1] ] Opening new SolrCore at [/home/jenkins/workspace/Lucene-Solr-5.5-Linux/solr/build/solr-core/test/J0/temp/solr.schema.TestManagedSchemaAPI_DD7EE446806D56DA-001/tempDir-001/node2/testschemaapi_shard1_replica1], dataDir=[/home/jenkins/workspace/Lucene-Solr-5.5-Linux/solr/build/solr-core/test/J0/temp/solr.schema.TestManagedSchemaAPI_DD7EE446806D56DA-001/tempDir-001/node2/./testschemaapi_shard1_replica1/data/]
    [junit4] 2> 223768 INFO (qtp1560316757-1133) [n:127.0.0.1:41153_solr c:testschemaapi s:shard1 r:core_node2 x:testschemaapi_shard1_replica2] o.a.s.c.SolrCore [[testschemaapi_shard1_replica2] ] Opening new SolrCore at [/home/jenkins/workspace/Lucene-Solr-5.5-Linux/solr/build/solr-core/test/J0/temp/solr.schema.TestManagedSchemaAPI_DD7EE446806D56DA-001/tempDir-001/node1/testschemaapi_shard1_replica2], dataDir=[/home/jenkins/workspace/Lucene-Solr-5.5-Linux/solr/build/solr-core/test/J0/temp/solr.schema.TestManagedSchemaAPI_DD7EE446806D56DA-001/tempDir-001/node1/./testschemaapi_shard1_replica2/data/]
    [junit4] 2> 223768 INFO (qtp1560316757-1132) [n:127.0.0.1:37276_solr c:testschemaapi s:shard1 r:core_node1 x:testschemaapi_shard1_replica1] o.a.s.c.SolrCore JMX monitoring not detected for core: testschemaapi_shard1_replica1
    [junit4] 2> 223768 INFO (qtp1560316757-1133) [n:127.0.0.1:41153_solr c:testschemaapi s:shard1 r:core_node2 x:testschemaapi_shard1_replica2] o.a.s.c.SolrCore JMX monitoring not detected for core: testschemaapi_shard1_replica2
    [junit4] 2> 223770 INFO (qtp1560316757-1132) [n:127.0.0.1:37276_solr c:testschemaapi s:shard1 r:core_node1 x:testschemaapi_shard1_replica1] o.a.s.c.CachingDirectoryFactory return new directory for /home/jenkins/workspace/Lucene-Solr-5.5-Linux/solr/build/solr-core/test/J0/temp/solr.schema.TestManagedSchemaAPI_DD7EE446806D56DA-001/tempDir-001/node2/./testschemaapi_shard1_replica1/data
    [junit4] 2> 223770 INFO (qtp1560316757-1133) [n:127.0.0.1:41153_solr c:testschemaapi s:shard1 r:core_node2 x:testschemaapi_shard1_replica2] o.a.s.c.CachingDirectoryFactory return new directory for /home/jenkins/workspace/Lucene-Solr-5.5-Linux/solr/build/solr-core/test/J0/temp/solr.schema.TestManagedSchemaAPI_DD7EE446806D56DA-001/tempDir-001/node1/./testschemaapi_shard1_replica2/data
    [junit4] 2> 223771 INFO (qtp1560316757-1132) [n:127.0.0.1:37276_solr c:testschemaapi s:shard1 r:core_node1 x:testschemaapi_shard1_replica1] o.a.s.c.SolrCore New index directory detected: old=null new=/home/jenkins/workspace/Lucene-Solr-5.5-Linux/solr/build/solr-core/test/J0/temp/solr.schema.TestManagedSchemaAPI_DD7EE446806D56DA-001/tempDir-001/node2/./testschemaapi_shard1_replica1/data/index/
    [junit4] 2> 223771 INFO (qtp1560316757-1133) [n:127.0.0.1:41153_solr c:testschemaapi s:shard1 r:core_node2 x:testschemaapi_shard1_replica2] o.a.s.c.SolrCore New index directory detected: old=null new=/home/jenkins/workspace/Lucene-Solr-5.5-Linux/solr/build/solr-core/test/J0/temp/solr.schema.TestManagedSchemaAPI_DD7EE446806D56DA-001/tempDir-001/node1/./testschemaapi_shard1_replica2/data/index/
    [junit4] 2> 223771 WARN (qtp1560316757-1132) [n:127.0.0.1:37276_solr c:testschemaapi s:shard1 r:core_node1 x:testschemaapi_shard1_replica1] o.a.s.c.SolrCore [testschemaapi_shard1_replica1] Solr index directory '/home/jenkins/workspace/Lucene-Solr-5.5-Linux/solr/build/solr-core/test/J0/temp/solr.schema.TestManagedSchemaAPI_DD7EE446806D56DA-001/tempDir-001/node2/./testschemaapi_shard1_replica1/data/index' doesn't exist. Creating new index...
    [junit4] 2> 223771 WARN (qtp1560316757-1133) [n:127.0.0.1:41153_solr c:testschemaapi s:shard1 r:core_node2 x:testschemaapi_shard1_replica2] o.a.s.c.SolrCore [testschemaapi_shard1_replica2] Solr index directory '/home/jenkins/workspace/Lucene-Solr-5.5-Linux/solr/build/solr-core/test/J0/temp/solr.schema.TestManagedSchemaAPI_DD7EE446806D56DA-001/tempDir-001/node1/./testschemaapi_shard1_replica2/data/index' doesn't exist. Creating new index...
    [junit4] 2> 223771 INFO (qtp1560316757-1132) [n:127.0.0.1:37276_solr c:testschemaapi s:shard1 r:core_node1 x:testschemaapi_shard1_replica1] o.a.s.c.CachingDirectoryFactory return new directory for /home/jenkins/workspace/Lucene-Solr-5.5-Linux/solr/build/solr-core/test/J0/temp/solr.schema.TestManagedSchemaAPI_DD7EE446806D56DA-001/tempDir-001/node2/./testschemaapi_shard1_replica1/data/index
    [junit4] 2> 223771 INFO (qtp1560316757-1133) [n:127.0.0.1:41153_solr c:testschemaapi s:shard1 r:core_node2 x:testschemaapi_shard1_replica2] o.a.s.c.CachingDirectoryFactory return new directory for /home/jenkins/workspace/Lucene-Solr-5.5-Linux/solr/build/solr-core/test/J0/temp/solr.schema.TestManagedSchemaAPI_DD7EE446806D56DA-001/tempDir-001/node1/./testschemaapi_shard1_replica2/data/index
    [junit4] 2> 223772 INFO (qtp1560316757-1132) [n:127.0.0.1:37276_solr c:testschemaapi s:shard1 r:core_node1 x:testschemaapi_shard1_replica1] o.a.s.c.SolrDeletionPolicy SolrDeletionPolicy.onCommit: commits: num=1
    [junit4] 2> commit{dir=MockDirectoryWrapper(RAMDirectory@4a84190a lockFactory=org.apache.lucene.store.SingleInstanceLockFactory@268805be),segFN=segments_1,generation=1}
    [junit4] 2> 223772 INFO (qtp1560316757-1133) [n:127.0.0.1:41153_solr c:testschemaapi s:shard1 r:core_node2 x:testschemaapi_shard1_replica2] o.a.s.c.SolrDeletionPolicy SolrDeletionPolicy.onCommit: commits: num=1
    [junit4] 2> commit{dir=MockDirectoryWrapper(RAMDirectory@2c3110b5 lockFactory=org.apache.lucene.store.SingleInstanceLockFactory@493ff1bd),segFN=segments_1,generation=1}
    [junit4] 2> 223772 INFO (qtp1560316757-1132) [n:127.0.0.1:37276_solr c:testschemaapi s:shard1 r:core_node1 x:testschemaapi_shard1_replica1] o.a.s.c.SolrDeletionPolicy newest commit generation = 1
    [junit4] 2> 223772 INFO (qtp1560316757-1133) [n:127.0.0.1:41153_solr c:testschemaapi s:shard1 r:core_node2 x:testschemaapi_shard1_replica2] o.a.s.c.SolrDeletionPolicy newest commit generation = 1
    [junit4] 2> 223772 INFO (OldIndexDirectoryCleanupThreadForCore-testschemaapi_shard1_replica1) [n:127.0.0.1:37276_solr c:testschemaapi s:shard1 r:core_node1 x:testschemaapi_shard1_replica1] o.a.s.c.SolrCore Looking for old index directories to cleanup for core testschemaapi_shard1_replica1 in /home/jenkins/workspace/Lucene-Solr-5.5-Linux/solr/build/solr-core/test/J0/temp/solr.schema.TestManagedSchemaAPI_DD7EE446806D56DA-001/tempDir-001/node2/./testschemaapi_shard1_replica1/data/
    [junit4] 2> 223772 INFO (OldIndexDirectoryCleanupThreadForCore-testschemaapi_shard1_replica2) [n:127.0.0.1:41153_solr c:testschemaapi s:shard1 r:core_node2 x:testschemaapi_shard1_replica2] o.a.s.c.SolrCore Looking for old index directories to cleanup for core testschemaapi_shard1_replica2 in /home/jenkins/workspace/Lucene-Solr-5.5-Linux/solr/build/solr-core/test/J0/temp/solr.schema.TestManagedSchemaAPI_DD7EE446806D56DA-001/tempDir-001/node1/./testschemaapi_shard1_replica2/data/
    [junit4] 2> 223772 WARN (OldIndexDirectoryCleanupThreadForCore-testschemaapi_shard1_replica2) [n:127.0.0.1:41153_solr c:testschemaapi s:shard1 r:core_node2 x:testschemaapi_shard1_replica2] o.a.s.c.DirectoryFactory /home/jenkins/workspace/Lucene-Solr-5.5-Linux/solr/build/solr-core/test/J0/temp/solr.schema.TestManagedSchemaAPI_DD7EE446806D56DA-001/tempDir-001/node1/./testschemaapi_shard1_replica2/data/ does not point to a valid data directory; skipping clean-up of old index directories.
    [junit4] 2> 223772 WARN (OldIndexDirectoryCleanupThreadForCore-testschemaapi_shard1_replica1) [n:127.0.0.1:37276_solr c:testschemaapi s:shard1 r:core_node1 x:testschemaapi_shard1_replica1] o.a.s.c.DirectoryFactory /home/jenkins/workspace/Lucene-Solr-5.5-Linux/solr/build/solr-core/test/J0/temp/solr.schema.TestManagedSchemaAPI_DD7EE446806D56DA-001/tempDir-001/node2/./testschemaapi_shard1_replica1/data/ does not point to a valid data directory; skipping clean-up of old index directories.
    [junit4] 2> 223774 INFO (qtp1560316757-1132) [n:127.0.0.1:37276_solr c:testschemaapi s:shard1 r:core_node1 x:testschemaapi_shard1_replica1] o.a.s.c.SolrCore no updateRequestProcessorChain defined as default, creating implicit default
    [junit4] 2> 223774 INFO (qtp1560316757-1133) [n:127.0.0.1:41153_solr c:testschemaapi s:shard1 r:core_node2 x:testschemaapi_shard1_replica2] o.a.s.c.SolrCore no updateRequestProcessorChain defined as default, creating implicit default
    [junit4] 2> 223776 INFO (qtp1560316757-1133) [n:127.0.0.1:41153_solr c:testschemaapi s:shard1 r:core_node2 x:testschemaapi_shard1_replica2] o.a.s.h.l.XMLLoader xsltCacheLifetimeSeconds=60
    [junit4] 2> 223776 INFO (qtp1560316757-1132) [n:127.0.0.1:37276_solr c:testschemaapi s:shard1 r:core_node1 x:testschemaapi_shard1_replica1] o.a.s.h.l.XMLLoader xsltCacheLifetimeSeconds=60
    [junit4] 2> 223777 INFO (qtp1560316757-1133) [n:127.0.0.1:41153_solr c:testschemaapi s:shard1 r:core_node2 x:testschemaapi_shard1_replica2] o.a.s.h.l.XMLLoader xsltCacheLifetimeSeconds=60
    [junit4] 2> 223777 INFO (qtp1560316757-1132) [n:127.0.0.1:37276_solr c:testschemaapi s:shard1 r:core_node1 x:testschemaapi_shard1_replica1] o.a.s.h.l.XMLLoader xsltCacheLifetimeSeconds=60
    [junit4] 2> 223778 INFO (qtp1560316757-1133) [n:127.0.0.1:41153_solr c:testschemaapi s:shard1 r:core_node2 x:testschemaapi_shard1_replica2] o.a.s.h.l.XMLLoader xsltCacheLifetimeSeconds=60
    [junit4] 2> 223778 INFO (qtp1560316757-1132) [n:127.0.0.1:37276_solr c:testschemaapi s:shard1 r:core_node1 x:testschemaapi_shard1_replica1] o.a.s.h.l.XMLLoader xsltCacheLifetimeSeconds=60
    [junit4] 2> 223778 INFO (qtp1560316757-1132) [n:127.0.0.1:37276_solr c:testschemaapi s:shard1 r:core_node1 x:testschemaapi_shard1_replica1] o.a.s.h.l.XMLLoader xsltCacheLifetimeSeconds=60
    [junit4] 2> 223778 INFO (qtp1560316757-1133) [n:127.0.0.1:41153_solr c:testschemaapi s:shard1 r:core_node2 x:testschemaapi_shard1_replica2] o.a.s.h.l.XMLLoader xsltCacheLifetimeSeconds=60
    [junit4] 2> 223780 INFO (qtp1560316757-1132) [n:127.0.0.1:37276_solr c:testschemaapi s:shard1 r:core_node1 x:testschemaapi_shard1_replica1] o.a.s.c.RequestHandlers Registered paths: /admin/ping,/admin/file,/schema,/get,/admin/luke,/admin/logging,/admin/properties,/admin/segments,/update,/update/json,/admin/system,/update/json/docs,/config,/admin/threads,/update/csv,/admin/plugins,/select,/admin/mbeans,/replication
    [junit4] 2> 223780 INFO (qtp1560316757-1133) [n:127.0.0.1:41153_solr c:testschemaapi s:shard1 r:core_node2 x:testschemaapi_shard1_replica2] o.a.s.c.RequestHandlers Registered paths: /admin/ping,/admin/file,/schema,/get,/admin/luke,/admin/logging,/admin/properties,/admin/segments,/update,/update/json,/admin/system,/update/json/docs,/config,/admin/threads,/update/csv,/admin/plugins,/select,/admin/mbeans,/replication
    [junit4] 2> 223780 INFO (qtp1560316757-1132) [n:127.0.0.1:37276_solr c:testschemaapi s:shard1 r:core_node1 x:testschemaapi_shard1_replica1] o.a.s.c.SolrCore Using default statsCache cache: org.apache.solr.search.stats.LocalStatsCache
    [junit4] 2> 223780 INFO (qtp1560316757-1133) [n:127.0.0.1:41153_solr c:testschemaapi s:shard1 r:core_node2 x:testschemaapi_shard1_replica2] o.a.s.c.SolrCore Using default statsCache cache: org.apache.solr.search.stats.LocalStatsCache
    [junit4] 2> 223782 INFO (qtp1560316757-1132) [n:127.0.0.1:37276_solr c:testschemaapi s:shard1 r:core_node1 x:testschemaapi_shard1_replica1] o.a.s.u.UpdateHandler Using UpdateLog implementation: org.apache.solr.update.UpdateLog
    [junit4] 2> 223782 INFO (qtp1560316757-1132) [n:127.0.0.1:37276_solr c:testschemaapi s:shard1 r:core_node1 x:testschemaapi_shard1_replica1] o.a.s.u.UpdateLog Initializing UpdateLog: dataDir=null defaultSyncLevel=FLUSH numRecordsToKeep=100 maxNumLogsToKeep=10 numVersionBuckets=65536
    [junit4] 2> 223782 INFO (qtp1560316757-1133) [n:127.0.0.1:41153_solr c:testschemaapi s:shard1 r:core_node2 x:testschemaapi_shard1_replica2] o.a.s.u.UpdateHandler Using UpdateLog implementation: org.apache.solr.update.UpdateLog
    [junit4] 2> 223782 INFO (qtp1560316757-1133) [n:127.0.0.1:41153_solr c:testschemaapi s:shard1 r:core_node2 x:testschemaapi_shard1_replica2] o.a.s.u.UpdateLog Initializing UpdateLog: dataDir=null defaultSyncLevel=FLUSH numRecordsToKeep=100 maxNumLogsToKeep=10 numVersionBuckets=65536
    [junit4] 2> 223783 INFO (qtp1560316757-1132) [n:127.0.0.1:37276_solr c:testschemaapi s:shard1 r:core_node1 x:testschemaapi_shard1_replica1] o.a.s.u.CommitTracker Hard AutoCommit: disabled
    [junit4] 2> 223783 INFO (qtp1560316757-1132) [n:127.0.0.1:37276_solr c:testschemaapi s:shard1 r:core_node1 x:testschemaapi_shard1_replica1] o.a.s.u.CommitTracker Soft AutoCommit: disabled
    [junit4] 2> 223783 INFO (qtp1560316757-1133) [n:127.0.0.1:41153_solr c:testschemaapi s:shard1 r:core_node2 x:testschemaapi_shard1_replica2] o.a.s.u.CommitTracker Hard AutoCommit: disabled
    [junit4] 2> 223784 INFO (qtp1560316757-1133) [n:127.0.0.1:41153_solr c:testschemaapi s:shard1 r:core_node2 x:testschemaapi_shard1_replica2] o.a.s.u.CommitTracker Soft AutoCommit: disabled
    [junit4] 2> 223784 INFO (qtp1560316757-1132) [n:127.0.0.1:37276_solr c:testschemaapi s:shard1 r:core_node1 x:testschemaapi_shard1_replica1] o.a.s.c.SolrDeletionPolicy SolrDeletionPolicy.onInit: commits: num=1
    [junit4] 2> commit{dir=MockDirectoryWrapper(RAMDirectory@4a84190a lockFactory=org.apache.lucene.store.SingleInstanceLockFactory@268805be),segFN=segments_1,generation=1}
    [junit4] 2> 223784 INFO (qtp1560316757-1133) [n:127.0.0.1:41153_solr c:testschemaapi s:shard1 r:core_node2 x:testschemaapi_shard1_replica2] o.a.s.c.SolrDeletionPolicy SolrDeletionPolicy.onInit: commits: num=1
    [junit4] 2> commit{dir=MockDirectoryWrapper(RAMDirectory@2c3110b5 lockFactory=org.apache.lucene.store.SingleInstanceLockFactory@493ff1bd),segFN=segments_1,generation=1}
    [junit4] 2> 223784 INFO (qtp1560316757-1132) [n:127.0.0.1:37276_solr c:testschemaapi s:shard1 r:core_node1 x:testschemaapi_shard1_replica1] o.a.s.c.SolrDeletionPolicy newest commit generation = 1
    [junit4] 2> 223784 INFO (qtp1560316757-1133) [n:127.0.0.1:41153_solr c:testschemaapi s:shard1 r:core_node2 x:testschemaapi_shard1_replica2] o.a.s.c.SolrDeletionPolicy newest commit generation = 1
    [junit4] 2> 223784 INFO (qtp1560316757-1132) [n:127.0.0.1:37276_solr c:testschemaapi s:shard1 r:core_node1 x:testschemaapi_shard1_replica1] o.a.s.s.SolrIndexSearcher Opening Searcher@30e85ca3[testschemaapi_shard1_replica1] main
    [junit4] 2> 223784 INFO (qtp1560316757-1133) [n:127.0.0.1:41153_solr c:testschemaapi s:shard1 r:core_node2 x:testschemaapi_shard1_replica2] o.a.s.s.SolrIndexSearcher Opening Searcher@4abebeeb[testschemaapi_shard1_replica2] main
    [junit4] 2> 223784 INFO (qtp1560316757-1132) [n:127.0.0.1:37276_solr c:testschemaapi s:shard1 r:core_node1 x:testschemaapi_shard1_replica1] o.a.s.c.c.ZkStateReader Load collection config from: [/collections/testschemaapi]
    [junit4] 2> 223784 INFO (qtp1560316757-1133) [n:127.0.0.1:41153_solr c:testschemaapi s:shard1 r:core_node2 x:testschemaapi_shard1_replica2] o.a.s.c.c.ZkStateReader Load collection config from: [/collections/testschemaapi]
    [junit4] 2> 223785 INFO (qtp1560316757-1133) [n:127.0.0.1:41153_solr c:testschemaapi s:shard1 r:core_node2 x:testschemaapi_shard1_replica2] o.a.s.c.c.ZkStateReader path=[/collections/testschemaapi] [configName]=[conf1] specified config exists in ZooKeeper
    [junit4] 2> 223785 INFO (qtp1560316757-1132) [n:127.0.0.1:37276_solr c:testschemaapi s:shard1 r:core_node1 x:testschemaapi_shard1_replica1] o.a.s.c.c.ZkStateReader path=[/collections/testschemaapi] [configName]=[conf1] specified config exists in ZooKeeper
    [junit4] 2> 223785 INFO (qtp1560316757-1133) [n:127.0.0.1:41153_solr c:testschemaapi s:shard1 r:core_node2 x:testschemaapi_shard1_replica2] o.a.s.r.ManagedResourceStorage Setting up ZooKeeper-based storage for the RestManager with znodeBase: /configs/conf1
    [junit4] 2> 223785 INFO (qtp1560316757-1132) [n:127.0.0.1:37276_solr c:testschemaapi s:shard1 r:core_node1 x:testschemaapi_shard1_replica1] o.a.s.r.ManagedResourceStorage Setting up ZooKeeper-based storage for the RestManager with znodeBase: /configs/conf1
    [junit4] 2> 223785 INFO (qtp1560316757-1133) [n:127.0.0.1:41153_solr c:testschemaapi s:shard1 r:core_node2 x:testschemaapi_shard1_replica2] o.a.s.r.ManagedResourceStorage Configured ZooKeeperStorageIO with znodeBase: /configs/conf1
    [junit4] 2> 223785 INFO (qtp1560316757-1132) [n:127.0.0.1:37276_solr c:testschemaapi s:shard1 r:core_node1 x:testschemaapi_shard1_replica1] o.a.s.r.ManagedResourceStorage Configured ZooKeeperStorageIO with znodeBase: /configs/conf1
    [junit4] 2> 223785 INFO (qtp1560316757-1133) [n:127.0.0.1:41153_solr c:testschemaapi s:shard1 r:core_node2 x:testschemaapi_shard1_replica2] o.a.s.r.RestManager Initializing RestManager with initArgs: {}
    [junit4] 2> 223785 INFO (qtp1560316757-1132) [n:127.0.0.1:37276_solr c:testschemaapi s:shard1 r:core_node1 x:testschemaapi_shard1_replica1] o.a.s.r.RestManager Initializing RestManager with initArgs: {}
    [junit4] 2> 223786 INFO (qtp1560316757-1133) [n:127.0.0.1:41153_solr c:testschemaapi s:shard1 r:core_node2 x:testschemaapi_shard1_replica2] o.a.s.r.ManagedResourceStorage Reading _rest_managed.json using ZooKeeperStorageIO:path=/configs/conf1
    [junit4] 2> 223786 INFO (qtp1560316757-1132) [n:127.0.0.1:37276_solr c:testschemaapi s:shard1 r:core_node1 x:testschemaapi_shard1_replica1] o.a.s.r.ManagedResourceStorage Reading _rest_managed.json using ZooKeeperStorageIO:path=/configs/conf1
    [junit4] 2> 223786 INFO (qtp1560316757-1132) [n:127.0.0.1:37276_solr c:testschemaapi s:shard1 r:core_node1 x:testschemaapi_shard1_replica1] o.a.s.r.ManagedResourceStorage No data found for znode /configs/conf1/_rest_managed.json
    [junit4] 2> 223786 INFO (qtp1560316757-1133) [n:127.0.0.1:41153_solr c:testschemaapi s:shard1 r:core_node2 x:testschemaapi_shard1_replica2] o.a.s.r.ManagedResourceStorage No data found for znode /configs/conf1/_rest_managed.json
    [junit4] 2> 223786 INFO (qtp1560316757-1132) [n:127.0.0.1:37276_solr c:testschemaapi s:shard1 r:core_node1 x:testschemaapi_shard1_replica1] o.a.s.r.ManagedResourceStorage Loaded null at path _rest_managed.json using ZooKeeperStorageIO:path=/configs/conf1
    [junit4] 2> 223786 INFO (qtp1560316757-1133) [n:127.0.0.1:41153_solr c:testschemaapi s:shard1 r:core_node2 x:testschemaapi_shard1_replica2] o.a.s.r.ManagedResourceStorage Loaded null at path _rest_managed.json using ZooKeeperStorageIO:path=/configs/conf1
    [junit4] 2> 223786 INFO (qtp1560316757-1132) [n:127.0.0.1:37276_solr c:testschemaapi s:shard1 r:core_node1 x:testschemaapi_shard1_replica1] o.a.s.r.RestManager Initializing 0 registered ManagedResources
    [junit4] 2> 223786 INFO (qtp1560316757-1133) [n:127.0.0.1:41153_solr c:testschemaapi s:shard1 r:core_node2 x:testschemaapi_shard1_replica2] o.a.s.r.RestManager Initializing 0 registered ManagedResources
    [junit4] 2> 223786 INFO (qtp1560316757-1132) [n:127.0.0.1:37276_solr c:testschemaapi s:shard1 r:core_node1 x:testschemaapi_shard1_replica1] o.a.s.s.ZkIndexSchemaReader Creating ZooKeeper watch for the managed schema at /configs/conf1/managed-schema
    [junit4] 2> 223786 INFO (qtp1560316757-1133) [n:127.0.0.1:41153_solr c:testschemaapi s:shard1 r:core_node2 x:testschemaapi_shard1_replica2] o.a.s.s.ZkIndexSchemaReader Creating ZooKeeper watch for the managed schema at /configs/conf1/managed-schema
    [junit4] 2> 223786 INFO (qtp1560316757-1133) [n:127.0.0.1:41153_solr c:testschemaapi s:shard1 r:core_node2 x:testschemaapi_shard1_replica2] o.a.s.c.ZkController Added new OnReconnect listener ZkIndexSchemaReader: /configs/conf1/managed-schema, uniqueCoreId: testschemaapi_shard1_replica2:459702571289240
    [junit4] 2> 223787 INFO (qtp1560316757-1132) [n:127.0.0.1:37276_solr c:testschemaapi s:shard1 r:core_node1 x:testschemaapi_shard1_replica1] o.a.s.c.ZkController Added new OnReconnect listener ZkIndexSchemaReader: /configs/conf1/managed-schema, uniqueCoreId: testschemaapi_shard1_replica1:459702571265987
    [junit4] 2> 223787 INFO (qtp1560316757-1133) [n:127.0.0.1:41153_solr c:testschemaapi s:shard1 r:core_node2 x:testschemaapi_shard1_replica2] o.a.s.h.ReplicationHandler Commits will be reserved for 10000
    [junit4] 2> 223787 INFO (qtp1560316757-1132) [n:127.0.0.1:37276_solr c:testschemaapi s:shard1 r:core_node1 x:testschemaapi_shard1_replica1] o.a.s.h.ReplicationHandler Commits will be reserved for 10000
    [junit4] 2> 223787 INFO (qtp1560316757-1133) [n:127.0.0.1:41153_solr c:testschemaapi s:shard1 r:core_node2 x:testschemaapi_shard1_replica2] o.a.s.u.UpdateLog Looking up max value of version field to seed version buckets
    [junit4] 2> 223787 INFO (qtp1560316757-1132) [n:127.0.0.1:37276_solr c:testschemaapi s:shard1 r:core_node1 x:testschemaapi_shard1_replica1] o.a.s.u.UpdateLog Looking up max value of version field to seed version buckets
    [junit4] 2> 223787 INFO (searcherExecutor-382-thread-1-processing-c:testschemaapi s:shard1 x:testschemaapi_shard1_replica2 n:127.0.0.1:41153_solr r:core_node2) [n:127.0.0.1:41153_solr c:testschemaapi s:shard1 r:core_node2 x:testschemaapi_shard1_replica2] o.a.s.c.SolrCore [testschemaapi_shard1_replica2] Registered new searcher Searcher@4abebeeb[testschemaapi_shard1_replica2] main{ExitableDirectoryReader(UninvertingDirectoryReader())}
    [junit4] 2> 223787 INFO (qtp1560316757-1133) [n:127.0.0.1:41153_solr c:testschemaapi s:shard1 r:core_node2 x:testschemaapi_shard1_replica2] o.a.s.u.VersionInfo Refreshing highest value of _version_ for 65536 version buckets from index
    [junit4] 2> 223787 INFO (qtp1560316757-1132) [n:127.0.0.1:37276_solr c:testschemaapi s:shard1 r:core_node1 x:testschemaapi_shard1_replica1] o.a.s.u.VersionInfo Refreshing highest value of _version_ for 65536 version buckets from index
    [junit4] 2> 223787 INFO (qtp1560316757-1133) [n:127.0.0.1:41153_solr c:testschemaapi s:shard1 r:core_node2 x:testschemaapi_shard1_replica2] o.a.s.u.VersionInfo No terms found for _version_, cannot seed version bucket highest value from index
    [junit4] 2> 223787 INFO (qtp1560316757-1132) [n:127.0.0.1:37276_solr c:testschemaapi s:shard1 r:core_node1 x:testschemaapi_shard1_replica1] o.a.s.u.VersionInfo No terms found for _version_, cannot seed version bucket highest value from index
    [junit4] 2> 223787 INFO (qtp1560316757-1133) [n:127.0.0.1:41153_solr c:testschemaapi s:shard1 r:core_node2 x:testschemaapi_shard1_replica2] o.a.s.u.UpdateLog Could not find max version in index or recent updates, using new clock 1537451450225917952
    [junit4] 2> 223787 INFO (qtp1560316757-1132) [n:127.0.0.1:37276_solr c:testschemaapi s:shard1 r:core_node1 x:testschemaapi_shard1_replica1] o.a.s.u.UpdateLog Could not find max version in index or recent updates, using new clock 1537451450225917952
    [junit4] 2> 223787 INFO (searcherExecutor-381-thread-1-processing-c:testschemaapi s:shard1 x:testschemaapi_shard1_replica1 n:127.0.0.1:37276_solr r:core_node1) [n:127.0.0.1:37276_solr c:testschemaapi s:shard1 r:core_node1 x:testschemaapi_shard1_replica1] o.a.s.c.SolrCore [testschemaapi_shard1_replica1] Registered new searcher Searcher@30e85ca3[testschemaapi_shard1_replica1] main{ExitableDirectoryReader(UninvertingDirectoryReader())}
    [junit4] 2> 223789 INFO (qtp1560316757-1133) [n:127.0.0.1:41153_solr c:testschemaapi s:shard1 r:core_node2 x:testschemaapi_shard1_replica2] o.a.s.u.UpdateLog Took 1.0ms to seed version buckets with highest version 1537451450225917952
    [junit4] 2> 223789 INFO (qtp1560316757-1132) [n:127.0.0.1:37276_solr c:testschemaapi s:shard1 r:core_node1 x:testschemaapi_shard1_replica1] o.a.s.u.UpdateLog Took 1.0ms to seed version buckets with highest version 1537451450225917952
    [junit4] 2> 223789 INFO (qtp1560316757-1133) [n:127.0.0.1:41153_solr c:testschemaapi s:shard1 r:core_node2 x:testschemaapi_shard1_replica2] o.a.s.c.ZkController watch zkdir /configs/conf1
    [junit4] 2> 223789 INFO (qtp1560316757-1132) [n:127.0.0.1:37276_solr c:testschemaapi s:shard1 r:core_node1 x:testschemaapi_shard1_replica1] o.a.s.c.ZkController watch zkdir /configs/conf1
    [junit4] 2> 223789 INFO (qtp1560316757-1133) [n:127.0.0.1:41153_solr c:testschemaapi s:shard1 r:core_node2 x:testschemaapi_shard1_replica2] o.a.s.c.CoreContainer registering core: testschemaapi_shard1_replica2
    [junit4] 2> 223789 INFO (qtp1560316757-1132) [n:127.0.0.1:37276_solr c:testschemaapi s:shard1 r:core_node1 x:testschemaapi_shard1_replica1] o.a.s.c.CoreContainer registering core: testschemaapi_shard1_replica1
    [junit4] 2> 223789 INFO (qtp1560316757-1133) [n:127.0.0.1:41153_solr c:testschemaapi s:shard1 r:core_node2 x:testschemaapi_shard1_replica2] o.a.s.c.ZkController Register replica - core:testschemaapi_shard1_replica2 address:http://127.0.0.1:41153/solr collection:testschemaapi shard:shard1
    [junit4] 2> 223789 INFO (qtp1560316757-1132) [n:127.0.0.1:37276_solr c:testschemaapi s:shard1 r:core_node1 x:testschemaapi_shard1_replica1] o.a.s.c.ZkController Register replica - core:testschemaapi_shard1_replica1 address:http://127.0.0.1:37276/solr collection:testschemaapi shard:shard1
    [junit4] 2> 223790 INFO (qtp1560316757-1133) [n:127.0.0.1:41153_solr c:testschemaapi s:shard1 r:core_node2 x:testschemaapi_shard1_replica2] o.a.s.c.c.SolrZkClient makePath: /collections/testschemaapi/leader_elect/shard1/election
    [junit4] 2> 223790 INFO (qtp1560316757-1132) [n:127.0.0.1:37276_solr c:testschemaapi s:shard1 r:core_node1 x:testschemaapi_shard1_replica1] o.a.s.c.c.SolrZkClient makePath: /collections/testschemaapi/leader_elect/shard1/election
    [junit4] 2> 223792 INFO (qtp1560316757-1132) [n:127.0.0.1:37276_solr c:testschemaapi s:shard1 r:core_node1 x:testschemaapi_shard1_replica1] o.a.s.c.LeaderElector Joined leadership election with path: /collections/testschemaapi/leader_elect/shard1/election/96090715545993221-core_node1-n_0000000000
    [junit4] 2> 223792 INFO (qtp1560316757-1133) [n:127.0.0.1:41153_solr c:testschemaapi s:shard1 r:core_node2 x:testschemaapi_shard1_replica2] o.a.s.c.LeaderElector Joined leadership election with path: /collections/testschemaapi/leader_elect/shard1/election/96090715545993222-core_node2-n_0000000001
    [junit4] 2> 223792 INFO (qtp1560316757-1132) [n:127.0.0.1:37276_solr c:testschemaapi s:shard1 r:core_node1 x:testschemaapi_shard1_replica1] o.a.s.c.ShardLeaderElectionContext Running the leader process for shard=shard1 and weAreReplacement=false and leaderVoteWait=10000
    [junit4] 2> 223792 INFO (qtp1560316757-1133) [n:127.0.0.1:41153_solr c:testschemaapi s:shard1 r:core_node2 x:testschemaapi_shard1_replica2] o.a.s.c.LeaderElector Watching path /collections/testschemaapi/leader_elect/shard1/election/96090715545993221-core_node1-n_0000000000 to know if I could be the leader
    [junit4] 2> 223794 INFO (qtp1560316757-1132) [n:127.0.0.1:37276_solr c:testschemaapi s:shard1 r:core_node1 x:testschemaapi_shard1_replica1] o.a.s.c.ShardLeaderElectionContext Enough replicas found to continue.
    [junit4] 2> 223794 INFO (qtp1560316757-1132) [n:127.0.0.1:37276_solr c:testschemaapi s:shard1 r:core_node1 x:testschemaapi_shard1_replica1] o.a.s.c.ShardLeaderElectionContext I may be the new leader - try and sync
    [junit4] 2> 223794 INFO (qtp1560316757-1132) [n:127.0.0.1:37276_solr c:testschemaapi s:shard1 r:core_node1 x:testschemaapi_shard1_replica1] o.a.s.c.SyncStrategy Sync replicas to http://127.0.0.1:37276/solr/testschemaapi_shard1_replica1/
    [junit4] 2> 223794 INFO (qtp1560316757-1132) [n:127.0.0.1:37276_solr c:testschemaapi s:shard1 r:core_node1 x:testschemaapi_shard1_replica1] o.a.s.u.PeerSync PeerSync: core=testschemaapi_shard1_replica1 url=http://127.0.0.1:37276/solr START replicas=[http://127.0.0.1:41153/solr/testschemaapi_shard1_replica2/] nUpdates=100
    [junit4] 2> 223794 INFO (OverseerStateUpdate-96090715545993221-127.0.0.1:37276_solr-n_0000000000) [n:127.0.0.1:37276_solr ] o.a.s.c.Overseer processMessage: queueSize: 1, message = {
    [junit4] 2> "operation":"leader",
    [junit4] 2> "shard":"shard1",
    [junit4] 2> "collection":"testschemaapi"} current state version: 0
    [junit4] 2> 223795 INFO (qtp1560316757-1132) [n:127.0.0.1:37276_solr c:testschemaapi s:shard1 r:core_node1 x:testschemaapi_shard1_replica1] o.a.s.u.PeerSync PeerSync: core=testschemaapi_shard1_replica1 url=http://127.0.0.1:37276/solr DONE. We have no versions. sync failed.
    [junit4] 2> 223795 INFO (qtp1560316757-1132) [n:127.0.0.1:37276_solr c:testschemaapi s:shard1 r:core_node1 x:testschemaapi_shard1_replica1] o.a.s.c.SyncStrategy Leader's attempt to sync with shard failed, moving to the next candidate
    [junit4] 2> 223795 INFO (qtp1560316757-1132) [n:127.0.0.1:37276_solr c:testschemaapi s:shard1 r:core_node1 x:testschemaapi_shard1_replica1] o.a.s.c.ShardLeaderElectionContext We failed sync, but we have no versions - we can't sync in that case - we were active before, so become leader anyway
    [junit4] 2> 223796 INFO (qtp1560316757-1132) [n:127.0.0.1:37276_solr c:testschemaapi s:shard1 r:core_node1 x:testschemaapi_shard1_replica1] o.a.s.c.c.SolrZkClient makePath: /collections/testschemaapi/leaders/shard1
    [junit4] 2> 223797 INFO (qtp1560316757-1135) [n:127.0.0.1:41153_solr c:testschemaapi s:shard1 r:core_node2 x:testschemaapi_shard1_replica2] o.a.s.c.S.Request [testschemaapi_shard1_replica2] webapp=/solr path=/get params={distrib=false&wt=javabin&getVersions=100&qt=/get&version=2&fingerprint=false} status=0 QTime=1
    [junit4] 2> 223798 INFO (qtp1560316757-1132) [n:127.0.0.1:37276_solr c:testschemaapi s:shard1 r:core_node1 x:testschemaapi_shard1_replica1] o.a.s.c.ShardLeaderElectionContextBase Creating leader registration node /collections/testschemaapi/leaders/shard1/leader after winning as /collections/testschemaapi/leader_elect/shard1/election/96090715545993221-core_node1-n_0000000000
    [junit4] 2> 223799 INFO (qtp1560316757-1132) [n:127.0.0.1:37276_solr c:testschemaapi s:shard1 r:core_node1 x:testschemaapi_shard1_replica1] o.a.s.c.ShardLeaderElectionContext I am the new leader: http://127.0.0.1:37276/solr/testschemaapi_shard1_replica1/ shard1
    [junit4] 2> 223800 INFO (OverseerStateUpdate-96090715545993221-127.0.0.1:37276_solr-n_0000000000) [n:127.0.0.1:37276_solr ] o.a.s.c.Overseer processMessage: queueSize: 1, message = {
    [junit4] 2> "operation":"leader",
    [junit4] 2> "shard":"shard1",
    [junit4] 2> "collection":"testschemaapi",
    [junit4] 2> "base_url":"http://127.0.0.1:37276/solr",
    [junit4] 2> "core":"testschemaapi_shard1_replica1",
    [junit4] 2> "state":"active"} current state version: 0
    [junit4] 2> 223902 INFO (OverseerStateUpdate-96090715545993221-127.0.0.1:37276_solr-n_0000000000) [n:127.0.0.1:37276_solr ] o.a.s.c.o.ZkStateWriter going to update_collection /collections/testschemaapi/state.json version: 1
    [junit4] 2> 223902 INFO (zkCallback-145-thread-1-processing-n:127.0.0.1:37276_solr) [n:127.0.0.1:37276_solr ] o.a.s.c.c.ZkStateReader A cluster state change: [WatchedEvent state:SyncConnected type:NodeDataChanged path:/collections/testschemaapi/state.json] for collection [testschemaapi] has occurred - updating... (live nodes size: [2])
    [junit4] 2> 223902 INFO (zkCallback-146-thread-1-processing-n:127.0.0.1:41153_solr) [n:127.0.0.1:41153_solr ] o.a.s.c.c.ZkStateReader A cluster state change: [WatchedEvent state:SyncConnected type:NodeDataChanged path:/collections/testschemaapi/state.json] for collection [testschemaapi] has occurred - updating... (live nodes size: [2])
    [junit4] 2> 223903 INFO (zkCallback-145-thread-1-processing-n:127.0.0.1:37276_solr) [n:127.0.0.1:37276_solr ] o.a.s.c.c.ZkStateReader Updating data for [testschemaapi] from [1] to [2]
    [junit4] 2> 223903 INFO (zkCallback-146-thread-1-processing-n:127.0.0.1:41153_solr) [n:127.0.0.1:41153_solr ] o.a.s.c.c.ZkStateReader Updating data for [testschemaapi] from [1] to [2]
    [junit4] 2> 223950 INFO (qtp1560316757-1132) [n:127.0.0.1:37276_solr c:testschemaapi s:shard1 r:core_node1 x:testschemaapi_shard1_replica1] o.a.s.c.ZkController We are http://127.0.0.1:37276/solr/testschemaapi_shard1_replica1/ and leader is http://127.0.0.1:37276/solr/testschemaapi_shard1_replica1/
    [junit4] 2> 223950 INFO (qtp1560316757-1132) [n:127.0.0.1:37276_solr c:testschemaapi s:shard1 r:core_node1 x:testschemaapi_shard1_replica1] o.a.s.c.ZkController No LogReplay needed for core=testschemaapi_shard1_replica1 baseURL=http://127.0.0.1:37276/solr
    [junit4] 2> 223950 INFO (qtp1560316757-1132) [n:127.0.0.1:37276_solr c:testschemaapi s:shard1 r:core_node1 x:testschemaapi_shard1_replica1] o.a.s.c.ZkController I am the leader, no recovery necessary
    [junit4] 2> 223950 INFO (qtp1560316757-1132) [n:127.0.0.1:37276_solr c:testschemaapi s:shard1 r:core_node1 x:testschemaapi_shard1_replica1] o.a.s.c.ZkController publishing state=active
    [junit4] 2> 223952 INFO (OverseerStateUpdate-96090715545993221-127.0.0.1:37276_solr-n_0000000000) [n:127.0.0.1:37276_solr ] o.a.s.c.Overseer processMessage: queueSize: 1, message = {
    [junit4] 2> "collection":"testschemaapi",
    [junit4] 2> "state":"active",
    [junit4] 2> "shard":"shard1",
    [junit4] 2> "numShards":"1",
    [junit4] 2> "operation":"state",
    [junit4] 2> "roles":null,
    [junit4] 2> "core":"testschemaapi_shard1_replica1",
    [junit4] 2> "base_url":"http://127.0.0.1:37276/solr",
    [junit4] 2> "core_node_name":"core_node1",
    [junit4] 2> "node_name":"127.0.0.1:37276_solr"} current state version: 0
    [junit4] 2> 223952 INFO (OverseerStateUpdate-96090715545993221-127.0.0.1:37276_solr-n_0000000000) [n:127.0.0.1:37276_solr ] o.a.s.c.o.ReplicaMutator Update state numShards=1 message={
    [junit4] 2> "collection":"testschemaapi",
    [junit4] 2> "state":"active",
    [junit4] 2> "shard":"shard1",
    [junit4] 2> "numShards":"1",
    [junit4] 2> "operation":"state",
    [junit4] 2> "roles":null,
    [junit4] 2> "core":"testschemaapi_shard1_replica1",
    [junit4] 2> "base_url":"http://127.0.0.1:37276/solr",
    [junit4] 2> "core_node_name":"core_node1",
    [junit4] 2> "node_name":"127.0.0.1:37276_solr"}
    [junit4] 2> 223953 INFO (qtp1560316757-1132) [n:127.0.0.1:37276_solr c:testschemaapi s:shard1 r:core_node1 x:testschemaapi_shard1_replica1] o.a.s.s.HttpSolrCall [admin] webapp=null path=/admin/cores params={collection=testschemaapi&shard=shard1&wt=javabin&numShards=1&qt=/admin/cores&action=CREATE&collection.configName=conf1&version=2&name=testschemaapi_shard1_replica1} status=0 QTime=1287
    [junit4] 2> 224054 INFO (OverseerStateUpdate-96090715545993221-127.0.0.1:37276_solr-n_0000000000) [n:127.0.0.1:37276_solr ] o.a.s.c.o.ZkStateWriter going to update_collection /collections/testschemaapi/state.json version: 2
    [junit4] 2> 224055 INFO (zkCallback-145-thread-2-processing-n:127.0.0.1:37276_solr) [n:127.0.0.1:37276_solr ] o.a.s.c.c.ZkStateReader A cluster state change: [WatchedEvent state:SyncConnected type:NodeDataChanged path:/collections/testschemaapi/state.json] for collection [testschemaapi] has occurred - updating... (live nodes size: [2])
    [junit4] 2> 224055 INFO (zkCallback-146-thread-1-processing-n:127.0.0.1:41153_solr) [n:127.0.0.1:41153_solr ] o.a.s.c.c.ZkStateReader A cluster state change: [WatchedEvent state:SyncConnected type:NodeDataChanged path:/collections/testschemaapi/state.json] for collection [testschemaapi] has occurred - updating... (live nodes size: [2])
    [junit4] 2> 224055 INFO (zkCallback-145-thread-2-processing-n:127.0.0.1:37276_solr) [n:127.0.0.1:37276_solr ] o.a.s.c.c.ZkStateReader Updating data for [testschemaapi] from [2] to [3]
    [junit4] 2> 224055 INFO (zkCallback-146-thread-1-processing-n:127.0.0.1:41153_solr) [n:127.0.0.1:41153_solr ] o.a.s.c.c.ZkStateReader Updating data for [testschemaapi] from [2] to [3]
    [junit4] 2> 224794 INFO (qtp1560316757-1133) [n:127.0.0.1:41153_solr c:testschemaapi s:shard1 r:core_node2 x:testschemaapi_shard1_replica2] o.a.s.c.ZkController We are http://127.0.0.1:41153/solr/testschemaapi_shard1_replica2/ and leader is http://127.0.0.1:37276/solr/testschemaapi_shard1_replica1/
    [junit4] 2> 224794 INFO (qtp1560316757-1133) [n:127.0.0.1:41153_solr c:testschemaapi s:shard1 r:core_node2 x:testschemaapi_shard1_replica2] o.a.s.c.ZkController No LogReplay needed for core=testschemaapi_shard1_replica2 baseURL=http://127.0.0.1:41153/solr
    [junit4] 2> 224794 INFO (qtp1560316757-1133) [n:127.0.0.1:41153_solr c:testschemaapi s:shard1 r:core_node2 x:testschemaapi_shard1_replica2] o.a.s.c.ZkController Core needs to recover:testschemaapi_shard1_replica2
    [junit4] 2> 224795 INFO (updateExecutor-140-thread-1-processing-c:testschemaapi s:shard1 x:testschemaapi_shard1_replica2 n:127.0.0.1:41153_solr r:core_node2) [n:127.0.0.1:4

[...truncated too long message...]

1])
    [junit4] 2> 233301 WARN (zkCallback-146-thread-2-processing-n:127.0.0.1:41153_solr) [n:127.0.0.1:41153_solr ] o.a.s.c.c.ZkStateReader ZooKeeper watch triggered, but Solr cannot talk to ZK: [KeeperErrorCode = Session expired for /live_nodes]
    [junit4] 2> 233302 INFO (jetty-launcher-135-thread-2) [ ] o.e.j.s.h.ContextHandler Stopped o.e.j.s.ServletContextHandler@7a6c5d96{/solr,null,UNAVAILABLE}
    [junit4] 2> 233302 INFO (Thread-396) [n:127.0.0.1:41153_solr ] o.a.s.s.IndexSchema unique key field: id
    [junit4] 2> 233305 INFO (TEST-TestManagedSchemaAPI.test-seed#[DD7EE446806D56DA]) [ ] o.a.s.c.ZkTestServer connecting to 127.0.0.1:36828 36828
    [junit4] 2> 233411 INFO (Thread-358) [ ] o.a.s.c.ZkTestServer connecting to 127.0.0.1:36828 36828
    [junit4] 2> 233412 WARN (Thread-358) [ ] o.a.s.c.ZkTestServer Watch limit violations:
    [junit4] 2> Maximum concurrent create/delete watches above limit:
    [junit4] 2>
    [junit4] 2> 6 /solr/configs/conf1/managed-schema
    [junit4] 2> 6 /solr/configs/conf1
    [junit4] 2> 3 /solr/aliases.json
    [junit4] 2> 2 /solr/security.json
    [junit4] 2>
    [junit4] 2> Maximum concurrent data watches above limit:
    [junit4] 2>
    [junit4] 2> 3 /solr/clusterstate.json
    [junit4] 2> 2 /solr/collections/testschemaapi/state.json
    [junit4] 2>
    [junit4] 2> Maximum concurrent children watches above limit:
    [junit4] 2>
    [junit4] 2> 10 /solr/overseer/queue
    [junit4] 2> 10 /solr/overseer/collection-queue-work
    [junit4] 2> 3 /solr/live_nodes
    [junit4] 2> 3 /solr/overseer/queue-work
    [junit4] 2> 3 /solr/collections
    [junit4] 2>
    [junit4] 2> 233412 INFO (TEST-TestManagedSchemaAPI.test-seed#[DD7EE446806D56DA]) [ ] o.a.s.SolrTestCaseJ4 ###Ending test
    [junit4] 2> NOTE: reproduce with: ant test -Dtestcase=TestManagedSchemaAPI -Dtests.method=test -Dtests.seed=DD7EE446806D56DA -Dtests.multiplier=3 -Dtests.slow=true -Dtests.locale=be-BY -Dtests.timezone=America/Caracas -Dtests.asserts=true -Dtests.file.encoding=ISO-8859-1
    [junit4] ERROR 11.1s J0 | TestManagedSchemaAPI.test <<<
    [junit4] > Throwable #1: org.apache.solr.client.solrj.impl.CloudSolrClient$RouteException: Error from server at http://127.0.0.1:37276/solr/testschemaapi_shard1_replica1: ERROR: [doc=2] unknown field 'myNewField1'
    [junit4] > at __randomizedtesting.SeedInfo.seed([DD7EE446806D56DA:552ADB9C2E913B22]:0)
    [junit4] > at org.apache.solr.client.solrj.impl.CloudSolrClient.directUpdate(CloudSolrClient.java:632)
    [junit4] > at org.apache.solr.client.solrj.impl.CloudSolrClient.sendRequest(CloudSolrClient.java:981)
    [junit4] > at org.apache.solr.client.solrj.impl.CloudSolrClient.requestWithRetryOnStaleState(CloudSolrClient.java:870)
    [junit4] > at org.apache.solr.client.solrj.impl.CloudSolrClient.request(CloudSolrClient.java:806)
    [junit4] > at org.apache.solr.schema.TestManagedSchemaAPI.testAddFieldAndDocument(TestManagedSchemaAPI.java:101)
    [junit4] > at org.apache.solr.schema.TestManagedSchemaAPI.test(TestManagedSchemaAPI.java:69)
    [junit4] > at java.lang.Thread.run(Thread.java:745)
    [junit4] > Caused by: org.apache.solr.client.solrj.impl.HttpSolrClient$RemoteSolrException: Error from server at http://127.0.0.1:37276/solr/testschemaapi_shard1_replica1: ERROR: [doc=2] unknown field 'myNewField1'
    [junit4] > at org.apache.solr.client.solrj.impl.HttpSolrClient.executeMethod(HttpSolrClient.java:577)
    [junit4] > at org.apache.solr.client.solrj.impl.HttpSolrClient.request(HttpSolrClient.java:241)
    [junit4] > at org.apache.solr.client.solrj.impl.HttpSolrClient.request(HttpSolrClient.java:230)
    [junit4] > at org.apache.solr.client.solrj.impl.LBHttpSolrClient.doRequest(LBHttpSolrClient.java:372)
    [junit4] > at org.apache.solr.client.solrj.impl.LBHttpSolrClient.request(LBHttpSolrClient.java:325)
    [junit4] > at org.apache.solr.client.solrj.impl.CloudSolrClient$2.call(CloudSolrClient.java:607)
    [junit4] > at org.apache.solr.client.solrj.impl.CloudSolrClient$2.call(CloudSolrClient.java:604)
    [junit4] > at java.util.concurrent.FutureTask.run(FutureTask.java:262)
    [junit4] > at org.apache.solr.common.util.ExecutorUtil$MDCAwareThreadPoolExecutor$1.run(ExecutorUtil.java:231)
    [junit4] > at java.util.concurrent.ThreadPoolExecutor.runWorker(ThreadPoolExecutor.java:1145)
    [junit4] > at java.util.concurrent.ThreadPoolExecutor$Worker.run(ThreadPoolExecutor.java:615)
    [junit4] > ... 1 more
    [junit4] 2> 233415 INFO (SUITE-TestManagedSchemaAPI-seed#[DD7EE446806D56DA]-worker) [ ] o.a.s.SolrTestCaseJ4 ###deleteCore
    [junit4] 2> NOTE: leaving temporary files on disk at: /home/jenkins/workspace/Lucene-Solr-5.5-Linux/solr/build/solr-core/test/J0/temp/solr.schema.TestManagedSchemaAPI_DD7EE446806D56DA-001
    [junit4] 2> Jun 18, 2016 5:32:50 AM com.carrotsearch.randomizedtesting.ThreadLeakControl checkThreadLeaks
    [junit4] 2> WARNING: Will linger awaiting termination of 2 leaked thread(s).
    [junit4] 2> 243304 WARN (Thread-396) [n:127.0.0.1:41153_solr ] o.a.s.c.ZkController listener throws error
    [junit4] 2> org.apache.solr.common.SolrException: Unable to reload core [testschemaapi_shard1_replica2]
    [junit4] 2> at org.apache.solr.core.CoreContainer.reload(CoreContainer.java:921)
    [junit4] 2> at org.apache.solr.core.SolrCore$11.run(SolrCore.java:2623)
    [junit4] 2> at org.apache.solr.cloud.ZkController$5.run(ZkController.java:2480)
    [junit4] 2> Caused by: org.apache.solr.common.SolrException: Could not load conf for core testschemaapi_shard1_replica2: Unable to load reader for ConfigSet properties: configsetprops.json
    [junit4] 2> at org.apache.solr.core.ConfigSetService.getConfig(ConfigSetService.java:84)
    [junit4] 2> at org.apache.solr.core.CoreContainer.reload(CoreContainer.java:914)
    [junit4] 2> ... 2 more
    [junit4] 2> Caused by: org.apache.solr.common.SolrException: Unable to load reader for ConfigSet properties: configsetprops.json
    [junit4] 2> at org.apache.solr.core.ConfigSetProperties.readFromResourceLoader(ConfigSetProperties.java:57)
    [junit4] 2> at org.apache.solr.core.ConfigSetService.createConfigSetProperties(ConfigSetService.java:118)
    [junit4] 2> at org.apache.solr.core.ConfigSetService.getConfig(ConfigSetService.java:80)
    [junit4] 2> ... 3 more
    [junit4] 2> Caused by: java.io.IOException: We re-tried 10 times but was still unable to fetch resource=configsetprops.json from ZK
    [junit4] 2> at org.apache.solr.cloud.ZkSolrResourceLoader.openResource(ZkSolrResourceLoader.java:116)
    [junit4] 2> at org.apache.solr.core.ConfigSetProperties.readFromResourceLoader(ConfigSetProperties.java:52)
    [junit4] 2> ... 5 more
    [junit4] 2> Caused by: org.apache.zookeeper.KeeperException$SessionExpiredException: KeeperErrorCode = Session expired for /configs/conf1/configsetprops.json
    [junit4] 2> at org.apache.zookeeper.KeeperException.create(KeeperException.java:127)
    [junit4] 2> at org.apache.zookeeper.KeeperException.create(KeeperException.java:51)
    [junit4] 2> at org.apache.zookeeper.ZooKeeper.exists(ZooKeeper.java:1045)
    [junit4] 2> at org.apache.solr.common.cloud.SolrZkClient$5.execute(SolrZkClient.java:311)
    [junit4] 2> at org.apache.solr.common.cloud.SolrZkClient$5.execute(SolrZkClient.java:308)
    [junit4] 2> at org.apache.solr.common.cloud.ZkCmdExecutor.retryOperation(ZkCmdExecutor.java:60)
    [junit4] 2> at org.apache.solr.common.cloud.SolrZkClient.exists(SolrZkClient.java:308)
    [junit4] 2> at org.apache.solr.cloud.ZkController.pathExists(ZkController.java:839)
    [junit4] 2> at org.apache.solr.cloud.ZkSolrResourceLoader.openResource(ZkSolrResourceLoader.java:89)
    [junit4] 2> ... 6 more
    [junit4] 2> NOTE: test params are: codec=Asserting(Lucene54): {id=PostingsFormat(name=LuceneFixedGap), myNewField=FST50, _version_=FST50}, docValues:{}, sim=DefaultSimilarity, locale=be-BY, timezone=America/Caracas
    [junit4] 2> NOTE: Linux 4.4.0-24-generic amd64/Oracle Corporation 1.7.0_80 (64-bit)/cpus=12,threads=1,free=270597224,total=536870912
    [junit4] 2> NOTE: All tests run in this JVM: [TestSchemaResource, TestCloudSchemaless, CursorMarkTest, TestPhraseSuggestions, LeaderFailoverAfterPartitionTest, DataDrivenBlockJoinTest, BlockJoinFacetSimpleTest, ZkNodePropsTest, HdfsDirectoryFactoryTest, SignatureUpdateProcessorFactoryTest, IndexSchemaRuntimeFieldTest, DistribDocExpirationUpdateProcessorTest, CachingDirectoryFactoryTest, TestManagedSchemaAPI]
    [junit4] Completed [68/573 (1!)] on J0 in 21.11s, 1 test, 1 error <<< FAILURES!

[...truncated 1596 lines...]
BUILD FAILED
/home/jenkins/workspace/Lucene-Solr-5.5-Linux/build.xml:750: The following error occurred while executing this line:
/home/jenkins/workspace/Lucene-Solr-5.5-Linux/build.xml:694: The following error occurred while executing this line:
/home/jenkins/workspace/Lucene-Solr-5.5-Linux/build.xml:59: The following error occurred while executing this line:
/home/jenkins/workspace/Lucene-Solr-5.5-Linux/solr/build.xml:233: The following error occurred while executing this line:
/home/jenkins/workspace/Lucene-Solr-5.5-Linux/solr/common-build.xml:534: The following error occurred while executing this line:
/home/jenkins/workspace/Lucene-Solr-5.5-Linux/lucene/common-build.xml:1477: The following error occurred while executing this line:
/home/jenkins/workspace/Lucene-Solr-5.5-Linux/lucene/common-build.xml:1033: There were test failures: 573 suites (7 ignored), 2319 tests, 1 error, 84 ignored (39 assumptions) [seed: DD7EE446806D56DA]

Total time: 68 minutes 29 seconds
Build step 'Invoke Ant' marked build as failure
Archiving artifacts
[WARNINGS] Skipping publisher since build result is FAILURE
Recording test results
Email was triggered for: Failure - Any
Sending email for trigger: Failure - Any

Search Discussions

Related Discussions

Discussion Navigation
viewthread | post
posts ‹ prev | 1 of 1 | next ›
Discussion Overview
groupdev @
categorieslucene
postedJun 18, '16 at 6:14a
activeJun 18, '16 at 6:14a
posts1
users1
websitelucene.apache.org

1 user in discussion

Policeman Jenkins Server: 1 post

People

Translate

site design / logo © 2017 Grokbase