Grokbase Groups Lucene dev June 2016
FAQ
Build: http://jenkins.thetaphi.de/job/Lucene-Solr-5.5-Linux/301/
Java: 32bit/jdk1.7.0_80 -server -XX:+UseConcMarkSweepGC

2 tests failed.
FAILED: junit.framework.TestSuite.org.apache.solr.security.BasicAuthIntegrationTest

Error Message:
Suite timeout exceeded (>= 7200000 msec).

Stack Trace:
java.lang.Exception: Suite timeout exceeded (>= 7200000 msec).
  at __randomizedtesting.SeedInfo.seed([995253744E9FA0EF]:0)


FAILED: org.apache.solr.security.BasicAuthIntegrationTest.testBasics

Error Message:
Test abandoned because suite timeout was reached.

Stack Trace:
java.lang.Exception: Test abandoned because suite timeout was reached.
  at __randomizedtesting.SeedInfo.seed([995253744E9FA0EF]:0)




Build Log:
[...truncated 12363 lines...]
    [junit4] Suite: org.apache.solr.security.BasicAuthIntegrationTest
    [junit4] 2> 765132 INFO (TEST-BasicAuthIntegrationTest.testBasics-seed#[995253744E9FA0EF]) [ ] o.a.s.c.ZkTestServer STARTING ZK TEST SERVER
    [junit4] 2> 765132 INFO (Thread-1761) [ ] o.a.s.c.ZkTestServer client port:0.0.0.0/0.0.0.0:0
    [junit4] 2> 765132 INFO (Thread-1761) [ ] o.a.s.c.ZkTestServer Starting server
    [junit4] 2> 765232 INFO (TEST-BasicAuthIntegrationTest.testBasics-seed#[995253744E9FA0EF]) [ ] o.a.s.c.ZkTestServer start zk server on port:37916
    [junit4] 2> 765232 INFO (TEST-BasicAuthIntegrationTest.testBasics-seed#[995253744E9FA0EF]) [ ] o.a.s.c.c.SolrZkClient Using default ZkCredentialsProvider
    [junit4] 2> 765233 INFO (TEST-BasicAuthIntegrationTest.testBasics-seed#[995253744E9FA0EF]) [ ] o.a.s.c.c.ConnectionManager Waiting for client to connect to ZooKeeper
    [junit4] 2> 765255 INFO (zkCallback-538-thread-1) [ ] o.a.s.c.c.ConnectionManager Watcher org.apache.solr.common.cloud.ConnectionManager@a21aa0 name:ZooKeeperConnection Watcher:127.0.0.1:37916 got event WatchedEvent state:SyncConnected type:None path:null path:null type:None
    [junit4] 2> 765255 INFO (TEST-BasicAuthIntegrationTest.testBasics-seed#[995253744E9FA0EF]) [ ] o.a.s.c.c.ConnectionManager Client is connected to ZooKeeper
    [junit4] 2> 765255 INFO (TEST-BasicAuthIntegrationTest.testBasics-seed#[995253744E9FA0EF]) [ ] o.a.s.c.c.SolrZkClient Using default ZkACLProvider
    [junit4] 2> 765255 INFO (TEST-BasicAuthIntegrationTest.testBasics-seed#[995253744E9FA0EF]) [ ] o.a.s.c.c.SolrZkClient makePath: /solr/solr.xml
    [junit4] 2> 765264 INFO (jetty-launcher-537-thread-1) [ ] o.e.j.s.Server jetty-9.2.13.v20150730
    [junit4] 2> 765270 INFO (jetty-launcher-537-thread-2) [ ] o.e.j.s.Server jetty-9.2.13.v20150730
    [junit4] 2> 765270 INFO (jetty-launcher-537-thread-1) [ ] o.e.j.s.h.ContextHandler Started o.e.j.s.ServletContextHandler@12d1e91{/solr,null,AVAILABLE}
    [junit4] 2> 765270 INFO (jetty-launcher-537-thread-3) [ ] o.e.j.s.Server jetty-9.2.13.v20150730
    [junit4] 2> 765271 INFO (jetty-launcher-537-thread-4) [ ] o.e.j.s.Server jetty-9.2.13.v20150730
    [junit4] 2> 765272 INFO (jetty-launcher-537-thread-2) [ ] o.e.j.s.h.ContextHandler Started o.e.j.s.ServletContextHandler@7180ef{/solr,null,AVAILABLE}
    [junit4] 2> 765273 INFO (jetty-launcher-537-thread-5) [ ] o.e.j.s.Server jetty-9.2.13.v20150730
    [junit4] 2> 765273 INFO (jetty-launcher-537-thread-1) [ ] o.e.j.s.ServerConnector Started ServerConnector@e953a1{HTTP/1.1}{127.0.0.1:45665}
    [junit4] 2> 765273 INFO (jetty-launcher-537-thread-1) [ ] o.e.j.s.Server Started @767526ms
    [junit4] 2> 765273 INFO (jetty-launcher-537-thread-1) [ ] o.a.s.c.s.e.JettySolrRunner Jetty properties: {hostContext=/solr, hostPort=45665}
    [junit4] 2> 765273 INFO (jetty-launcher-537-thread-1) [ ] o.a.s.s.SolrDispatchFilter SolrDispatchFilter.init(): sun.misc.Launcher$AppClassLoader@327236
    [junit4] 2> 765273 INFO (jetty-launcher-537-thread-1) [ ] o.a.s.c.SolrResourceLoader new SolrResourceLoader for directory: '/home/jenkins/workspace/Lucene-Solr-5.5-Linux/solr/build/solr-core/test/J1/temp/solr.security.BasicAuthIntegrationTest_995253744E9FA0EF-001/tempDir-001/node1'
    [junit4] 2> 765273 INFO (jetty-launcher-537-thread-1) [ ] o.a.s.c.SolrResourceLoader JNDI not configured for solr (NoInitialContextEx)
    [junit4] 2> 765273 INFO (jetty-launcher-537-thread-1) [ ] o.a.s.c.SolrResourceLoader solr home defaulted to 'solr/' (could not find system property or JNDI)
    [junit4] 2> 765274 INFO (jetty-launcher-537-thread-1) [ ] o.a.s.c.c.SolrZkClient Using default ZkCredentialsProvider
    [junit4] 2> 765274 INFO (jetty-launcher-537-thread-5) [ ] o.e.j.s.h.ContextHandler Started o.e.j.s.ServletContextHandler@31f7e8{/solr,null,AVAILABLE}
    [junit4] 2> 765274 INFO (jetty-launcher-537-thread-1) [ ] o.a.s.c.c.ConnectionManager Waiting for client to connect to ZooKeeper
    [junit4] 2> 765275 INFO (jetty-launcher-537-thread-2) [ ] o.e.j.s.ServerConnector Started ServerConnector@1b3c861{HTTP/1.1}{127.0.0.1:35326}
    [junit4] 2> 765275 INFO (jetty-launcher-537-thread-5) [ ] o.e.j.s.ServerConnector Started ServerConnector@285926{HTTP/1.1}{127.0.0.1:40825}
    [junit4] 2> 765275 INFO (jetty-launcher-537-thread-2) [ ] o.e.j.s.Server Started @767528ms
    [junit4] 2> 765275 INFO (jetty-launcher-537-thread-5) [ ] o.e.j.s.Server Started @767528ms
    [junit4] 2> 765275 INFO (jetty-launcher-537-thread-2) [ ] o.a.s.c.s.e.JettySolrRunner Jetty properties: {hostPort=35326, hostContext=/solr}
    [junit4] 2> 765275 INFO (jetty-launcher-537-thread-5) [ ] o.a.s.c.s.e.JettySolrRunner Jetty properties: {hostContext=/solr, hostPort=40825}
    [junit4] 2> 765275 INFO (jetty-launcher-537-thread-5) [ ] o.a.s.s.SolrDispatchFilter SolrDispatchFilter.init(): sun.misc.Launcher$AppClassLoader@327236
    [junit4] 2> 765275 INFO (jetty-launcher-537-thread-2) [ ] o.a.s.s.SolrDispatchFilter SolrDispatchFilter.init(): sun.misc.Launcher$AppClassLoader@327236
    [junit4] 2> 765275 INFO (jetty-launcher-537-thread-5) [ ] o.a.s.c.SolrResourceLoader new SolrResourceLoader for directory: '/home/jenkins/workspace/Lucene-Solr-5.5-Linux/solr/build/solr-core/test/J1/temp/solr.security.BasicAuthIntegrationTest_995253744E9FA0EF-001/tempDir-001/node5'
    [junit4] 2> 765275 INFO (jetty-launcher-537-thread-2) [ ] o.a.s.c.SolrResourceLoader new SolrResourceLoader for directory: '/home/jenkins/workspace/Lucene-Solr-5.5-Linux/solr/build/solr-core/test/J1/temp/solr.security.BasicAuthIntegrationTest_995253744E9FA0EF-001/tempDir-001/node2'
    [junit4] 2> 765275 INFO (jetty-launcher-537-thread-5) [ ] o.a.s.c.SolrResourceLoader JNDI not configured for solr (NoInitialContextEx)
    [junit4] 2> 765275 INFO (jetty-launcher-537-thread-5) [ ] o.a.s.c.SolrResourceLoader solr home defaulted to 'solr/' (could not find system property or JNDI)
    [junit4] 2> 765275 INFO (jetty-launcher-537-thread-2) [ ] o.a.s.c.SolrResourceLoader JNDI not configured for solr (NoInitialContextEx)
    [junit4] 2> 765275 INFO (jetty-launcher-537-thread-2) [ ] o.a.s.c.SolrResourceLoader solr home defaulted to 'solr/' (could not find system property or JNDI)
    [junit4] 2> 765275 INFO (jetty-launcher-537-thread-5) [ ] o.a.s.c.c.SolrZkClient Using default ZkCredentialsProvider
    [junit4] 2> 765275 INFO (jetty-launcher-537-thread-2) [ ] o.a.s.c.c.SolrZkClient Using default ZkCredentialsProvider
    [junit4] 2> 765276 INFO (jetty-launcher-537-thread-5) [ ] o.a.s.c.c.ConnectionManager Waiting for client to connect to ZooKeeper
    [junit4] 2> 765276 INFO (jetty-launcher-537-thread-2) [ ] o.a.s.c.c.ConnectionManager Waiting for client to connect to ZooKeeper
    [junit4] 2> 765278 INFO (jetty-launcher-537-thread-4) [ ] o.e.j.s.h.ContextHandler Started o.e.j.s.ServletContextHandler@1327c50{/solr,null,AVAILABLE}
    [junit4] 2> 765278 INFO (zkCallback-539-thread-1) [ ] o.a.s.c.c.ConnectionManager Watcher org.apache.solr.common.cloud.ConnectionManager@17fad4d name:ZooKeeperConnection Watcher:127.0.0.1:37916/solr got event WatchedEvent state:SyncConnected type:None path:null path:null type:None
    [junit4] 2> 765278 INFO (jetty-launcher-537-thread-1) [ ] o.a.s.c.c.ConnectionManager Client is connected to ZooKeeper
    [junit4] 2> 765278 INFO (jetty-launcher-537-thread-4) [ ] o.e.j.s.ServerConnector Started ServerConnector@db2ee2{HTTP/1.1}{127.0.0.1:44214}
    [junit4] 2> 765278 INFO (jetty-launcher-537-thread-3) [ ] o.e.j.s.h.ContextHandler Started o.e.j.s.ServletContextHandler@16aaf6e{/solr,null,AVAILABLE}
    [junit4] 2> 765278 INFO (jetty-launcher-537-thread-4) [ ] o.e.j.s.Server Started @767531ms
    [junit4] 2> 765278 INFO (jetty-launcher-537-thread-1) [ ] o.a.s.c.c.SolrZkClient Using default ZkACLProvider
    [junit4] 2> 765278 INFO (jetty-launcher-537-thread-4) [ ] o.a.s.c.s.e.JettySolrRunner Jetty properties: {hostContext=/solr, hostPort=44214}
    [junit4] 2> 765279 INFO (jetty-launcher-537-thread-4) [ ] o.a.s.s.SolrDispatchFilter SolrDispatchFilter.init(): sun.misc.Launcher$AppClassLoader@327236
    [junit4] 2> 765279 INFO (jetty-launcher-537-thread-4) [ ] o.a.s.c.SolrResourceLoader new SolrResourceLoader for directory: '/home/jenkins/workspace/Lucene-Solr-5.5-Linux/solr/build/solr-core/test/J1/temp/solr.security.BasicAuthIntegrationTest_995253744E9FA0EF-001/tempDir-001/node4'
    [junit4] 2> 765279 INFO (jetty-launcher-537-thread-4) [ ] o.a.s.c.SolrResourceLoader JNDI not configured for solr (NoInitialContextEx)
    [junit4] 2> 765279 INFO (jetty-launcher-537-thread-4) [ ] o.a.s.c.SolrResourceLoader solr home defaulted to 'solr/' (could not find system property or JNDI)
    [junit4] 2> 765279 INFO (jetty-launcher-537-thread-3) [ ] o.e.j.s.ServerConnector Started ServerConnector@9e5b6a{HTTP/1.1}{127.0.0.1:39590}
    [junit4] 2> 765279 INFO (jetty-launcher-537-thread-3) [ ] o.e.j.s.Server Started @767532ms
    [junit4] 2> 765279 INFO (jetty-launcher-537-thread-3) [ ] o.a.s.c.s.e.JettySolrRunner Jetty properties: {hostContext=/solr, hostPort=39590}
    [junit4] 2> 765279 INFO (jetty-launcher-537-thread-4) [ ] o.a.s.c.c.SolrZkClient Using default ZkCredentialsProvider
    [junit4] 2> 765279 INFO (jetty-launcher-537-thread-3) [ ] o.a.s.s.SolrDispatchFilter SolrDispatchFilter.init(): sun.misc.Launcher$AppClassLoader@327236
    [junit4] 2> 765279 INFO (jetty-launcher-537-thread-3) [ ] o.a.s.c.SolrResourceLoader new SolrResourceLoader for directory: '/home/jenkins/workspace/Lucene-Solr-5.5-Linux/solr/build/solr-core/test/J1/temp/solr.security.BasicAuthIntegrationTest_995253744E9FA0EF-001/tempDir-001/node3'
    [junit4] 2> 765280 INFO (jetty-launcher-537-thread-3) [ ] o.a.s.c.SolrResourceLoader JNDI not configured for solr (NoInitialContextEx)
    [junit4] 2> 765280 INFO (jetty-launcher-537-thread-3) [ ] o.a.s.c.SolrResourceLoader solr home defaulted to 'solr/' (could not find system property or JNDI)
    [junit4] 2> 765280 INFO (jetty-launcher-537-thread-1) [ ] o.a.s.s.SolrDispatchFilter solr.xml found in ZooKeeper. Loading...
    [junit4] 2> 765280 INFO (jetty-launcher-537-thread-3) [ ] o.a.s.c.c.SolrZkClient Using default ZkCredentialsProvider
    [junit4] 2> 765280 INFO (jetty-launcher-537-thread-4) [ ] o.a.s.c.c.ConnectionManager Waiting for client to connect to ZooKeeper
    [junit4] 2> 765280 INFO (zkCallback-541-thread-1) [ ] o.a.s.c.c.ConnectionManager Watcher org.apache.solr.common.cloud.ConnectionManager@136fc3b name:ZooKeeperConnection Watcher:127.0.0.1:37916/solr got event WatchedEvent state:SyncConnected type:None path:null path:null type:None
    [junit4] 2> 765280 INFO (zkCallback-540-thread-1) [ ] o.a.s.c.c.ConnectionManager Watcher org.apache.solr.common.cloud.ConnectionManager@13ca5a4 name:ZooKeeperConnection Watcher:127.0.0.1:37916/solr got event WatchedEvent state:SyncConnected type:None path:null path:null type:None
    [junit4] 2> 765280 INFO (jetty-launcher-537-thread-2) [ ] o.a.s.c.c.ConnectionManager Client is connected to ZooKeeper
    [junit4] 2> 765280 INFO (jetty-launcher-537-thread-5) [ ] o.a.s.c.c.ConnectionManager Client is connected to ZooKeeper
    [junit4] 2> 765280 INFO (jetty-launcher-537-thread-3) [ ] o.a.s.c.c.ConnectionManager Waiting for client to connect to ZooKeeper
    [junit4] 2> 765280 INFO (jetty-launcher-537-thread-5) [ ] o.a.s.c.c.SolrZkClient Using default ZkACLProvider
    [junit4] 2> 765280 INFO (jetty-launcher-537-thread-2) [ ] o.a.s.c.c.SolrZkClient Using default ZkACLProvider
    [junit4] 2> 765281 INFO (jetty-launcher-537-thread-2) [ ] o.a.s.s.SolrDispatchFilter solr.xml found in ZooKeeper. Loading...
    [junit4] 2> 765281 INFO (jetty-launcher-537-thread-5) [ ] o.a.s.s.SolrDispatchFilter solr.xml found in ZooKeeper. Loading...
    [junit4] 2> 765292 INFO (zkCallback-543-thread-1) [ ] o.a.s.c.c.ConnectionManager Watcher org.apache.solr.common.cloud.ConnectionManager@6e7c7f name:ZooKeeperConnection Watcher:127.0.0.1:37916/solr got event WatchedEvent state:SyncConnected type:None path:null path:null type:None
    [junit4] 2> 765292 INFO (jetty-launcher-537-thread-3) [ ] o.a.s.c.c.ConnectionManager Client is connected to ZooKeeper
    [junit4] 2> 765292 INFO (jetty-launcher-537-thread-3) [ ] o.a.s.c.c.SolrZkClient Using default ZkACLProvider
    [junit4] 2> 765294 INFO (zkCallback-542-thread-1) [ ] o.a.s.c.c.ConnectionManager Watcher org.apache.solr.common.cloud.ConnectionManager@199b291 name:ZooKeeperConnection Watcher:127.0.0.1:37916/solr got event WatchedEvent state:SyncConnected type:None path:null path:null type:None
    [junit4] 2> 765294 INFO (jetty-launcher-537-thread-4) [ ] o.a.s.c.c.ConnectionManager Client is connected to ZooKeeper
    [junit4] 2> 765294 INFO (jetty-launcher-537-thread-4) [ ] o.a.s.c.c.SolrZkClient Using default ZkACLProvider
    [junit4] 2> 765297 WARN (NIOServerCxn.Factory:0.0.0.0/0.0.0.0:0) [ ] o.a.z.s.NIOServerCnxn caught end of stream exception
    [junit4] 2> EndOfStreamException: Unable to read additional data from client sessionid 0x15560f72ace0003, likely client has closed socket
    [junit4] 2> at org.apache.zookeeper.server.NIOServerCnxn.doIO(NIOServerCnxn.java:228)
    [junit4] 2> at org.apache.zookeeper.server.NIOServerCnxnFactory.run(NIOServerCnxnFactory.java:208)
    [junit4] 2> at java.lang.Thread.run(Thread.java:745)
    [junit4] 2> 765297 INFO (jetty-launcher-537-thread-2) [ ] o.a.s.c.CorePropertiesLocator Config-defined core root directory: /home/jenkins/workspace/Lucene-Solr-5.5-Linux/solr/build/solr-core/test/J1/temp/solr.security.BasicAuthIntegrationTest_995253744E9FA0EF-001/tempDir-001/node2/.
    [junit4] 2> 765297 INFO (jetty-launcher-537-thread-2) [ ] o.a.s.c.CoreContainer New CoreContainer 5330566
    [junit4] 2> 765297 INFO (jetty-launcher-537-thread-2) [ ] o.a.s.c.CoreContainer Loading cores into CoreContainer [instanceDir=/home/jenkins/workspace/Lucene-Solr-5.5-Linux/solr/build/solr-core/test/J1/temp/solr.security.BasicAuthIntegrationTest_995253744E9FA0EF-001/tempDir-001/node2]
    [junit4] 2> 765297 WARN (jetty-launcher-537-thread-2) [ ] o.a.s.c.CoreContainer Couldn't add files from /home/jenkins/workspace/Lucene-Solr-5.5-Linux/solr/build/solr-core/test/J1/temp/solr.security.BasicAuthIntegrationTest_995253744E9FA0EF-001/tempDir-001/node2/lib to classpath: /home/jenkins/workspace/Lucene-Solr-5.5-Linux/solr/build/solr-core/test/J1/temp/solr.security.BasicAuthIntegrationTest_995253744E9FA0EF-001/tempDir-001/node2/lib
    [junit4] 2> 765297 INFO (jetty-launcher-537-thread-2) [ ] o.a.s.h.c.HttpShardHandlerFactory created with socketTimeout : 90000,urlScheme : ,connTimeout : 15000,maxConnectionsPerHost : 20,maxConnections : 10000,corePoolSize : 0,maximumPoolSize : 2147483647,maxThreadIdleTime : 5,sizeOfQueue : -1,fairnessPolicy : false,useRetries : false,
    [junit4] 2> 765299 INFO (jetty-launcher-537-thread-1) [ ] o.a.s.c.CorePropertiesLocator Config-defined core root directory: /home/jenkins/workspace/Lucene-Solr-5.5-Linux/solr/build/solr-core/test/J1/temp/solr.security.BasicAuthIntegrationTest_995253744E9FA0EF-001/tempDir-001/node1/.
    [junit4] 2> 765299 INFO (jetty-launcher-537-thread-1) [ ] o.a.s.c.CoreContainer New CoreContainer 3830597
    [junit4] 2> 765299 INFO (jetty-launcher-537-thread-1) [ ] o.a.s.c.CoreContainer Loading cores into CoreContainer [instanceDir=/home/jenkins/workspace/Lucene-Solr-5.5-Linux/solr/build/solr-core/test/J1/temp/solr.security.BasicAuthIntegrationTest_995253744E9FA0EF-001/tempDir-001/node1]
    [junit4] 2> 765299 WARN (jetty-launcher-537-thread-1) [ ] o.a.s.c.CoreContainer Couldn't add files from /home/jenkins/workspace/Lucene-Solr-5.5-Linux/solr/build/solr-core/test/J1/temp/solr.security.BasicAuthIntegrationTest_995253744E9FA0EF-001/tempDir-001/node1/lib to classpath: /home/jenkins/workspace/Lucene-Solr-5.5-Linux/solr/build/solr-core/test/J1/temp/solr.security.BasicAuthIntegrationTest_995253744E9FA0EF-001/tempDir-001/node1/lib
    [junit4] 2> 765299 INFO (jetty-launcher-537-thread-1) [ ] o.a.s.h.c.HttpShardHandlerFactory created with socketTimeout : 90000,urlScheme : ,connTimeout : 15000,maxConnectionsPerHost : 20,maxConnections : 10000,corePoolSize : 0,maximumPoolSize : 2147483647,maxThreadIdleTime : 5,sizeOfQueue : -1,fairnessPolicy : false,useRetries : false,
    [junit4] 2> 765299 INFO (jetty-launcher-537-thread-5) [ ] o.a.s.c.CorePropertiesLocator Config-defined core root directory: /home/jenkins/workspace/Lucene-Solr-5.5-Linux/solr/build/solr-core/test/J1/temp/solr.security.BasicAuthIntegrationTest_995253744E9FA0EF-001/tempDir-001/node5/.
    [junit4] 2> 765299 INFO (jetty-launcher-537-thread-5) [ ] o.a.s.c.CoreContainer New CoreContainer 17838184
    [junit4] 2> 765299 INFO (jetty-launcher-537-thread-5) [ ] o.a.s.c.CoreContainer Loading cores into CoreContainer [instanceDir=/home/jenkins/workspace/Lucene-Solr-5.5-Linux/solr/build/solr-core/test/J1/temp/solr.security.BasicAuthIntegrationTest_995253744E9FA0EF-001/tempDir-001/node5]
    [junit4] 2> 765299 WARN (jetty-launcher-537-thread-5) [ ] o.a.s.c.CoreContainer Couldn't add files from /home/jenkins/workspace/Lucene-Solr-5.5-Linux/solr/build/solr-core/test/J1/temp/solr.security.BasicAuthIntegrationTest_995253744E9FA0EF-001/tempDir-001/node5/lib to classpath: /home/jenkins/workspace/Lucene-Solr-5.5-Linux/solr/build/solr-core/test/J1/temp/solr.security.BasicAuthIntegrationTest_995253744E9FA0EF-001/tempDir-001/node5/lib
    [junit4] 2> 765299 INFO (jetty-launcher-537-thread-2) [ ] o.a.s.u.UpdateShardHandler Creating UpdateShardHandler HTTP client with params: socketTimeout=340000&connTimeout=45000&retry=true
    [junit4] 2> 765299 INFO (jetty-launcher-537-thread-5) [ ] o.a.s.h.c.HttpShardHandlerFactory created with socketTimeout : 90000,urlScheme : ,connTimeout : 15000,maxConnectionsPerHost : 20,maxConnections : 10000,corePoolSize : 0,maximumPoolSize : 2147483647,maxThreadIdleTime : 5,sizeOfQueue : -1,fairnessPolicy : false,useRetries : false,
    [junit4] 2> 765299 INFO (jetty-launcher-537-thread-1) [ ] o.a.s.u.UpdateShardHandler Creating UpdateShardHandler HTTP client with params: socketTimeout=340000&connTimeout=45000&retry=true
    [junit4] 2> 765300 INFO (jetty-launcher-537-thread-2) [ ] o.a.s.l.LogWatcher SLF4J impl is org.slf4j.impl.Log4jLoggerFactory
    [junit4] 2> 765300 INFO (jetty-launcher-537-thread-1) [ ] o.a.s.l.LogWatcher SLF4J impl is org.slf4j.impl.Log4jLoggerFactory
    [junit4] 2> 765300 INFO (jetty-launcher-537-thread-2) [ ] o.a.s.l.LogWatcher Registering Log Listener [Log4j (org.slf4j.impl.Log4jLoggerFactory)]
    [junit4] 2> 765300 INFO (jetty-launcher-537-thread-1) [ ] o.a.s.l.LogWatcher Registering Log Listener [Log4j (org.slf4j.impl.Log4jLoggerFactory)]
    [junit4] 2> 765300 INFO (jetty-launcher-537-thread-2) [ ] o.a.s.c.ZkContainer Zookeeper client=127.0.0.1:37916/solr
    [junit4] 2> 765300 INFO (jetty-launcher-537-thread-1) [ ] o.a.s.c.ZkContainer Zookeeper client=127.0.0.1:37916/solr
    [junit4] 2> 765300 INFO (jetty-launcher-537-thread-2) [ ] o.a.s.c.ZkController zkHost includes chroot
    [junit4] 2> 765301 INFO (jetty-launcher-537-thread-1) [ ] o.a.s.c.ZkController zkHost includes chroot
    [junit4] 2> 765301 INFO (jetty-launcher-537-thread-2) [ ] o.a.s.c.c.SolrZkClient Using default ZkCredentialsProvider
    [junit4] 2> 765301 INFO (jetty-launcher-537-thread-1) [ ] o.a.s.c.c.SolrZkClient Using default ZkCredentialsProvider
    [junit4] 2> 765301 INFO (jetty-launcher-537-thread-5) [ ] o.a.s.u.UpdateShardHandler Creating UpdateShardHandler HTTP client with params: socketTimeout=340000&connTimeout=45000&retry=true
    [junit4] 2> 765301 INFO (jetty-launcher-537-thread-5) [ ] o.a.s.l.LogWatcher SLF4J impl is org.slf4j.impl.Log4jLoggerFactory
    [junit4] 2> 765301 INFO (jetty-launcher-537-thread-5) [ ] o.a.s.l.LogWatcher Registering Log Listener [Log4j (org.slf4j.impl.Log4jLoggerFactory)]
    [junit4] 2> 765301 INFO (jetty-launcher-537-thread-5) [ ] o.a.s.c.ZkContainer Zookeeper client=127.0.0.1:37916/solr
    [junit4] 2> 765301 INFO (jetty-launcher-537-thread-5) [ ] o.a.s.c.ZkController zkHost includes chroot
    [junit4] 2> 765301 INFO (jetty-launcher-537-thread-5) [ ] o.a.s.c.c.SolrZkClient Using default ZkCredentialsProvider
    [junit4] 2> 765302 INFO (jetty-launcher-537-thread-3) [ ] o.a.s.s.SolrDispatchFilter solr.xml found in ZooKeeper. Loading...
    [junit4] 2> 765302 INFO (jetty-launcher-537-thread-5) [ ] o.a.s.c.c.ConnectionManager Waiting for client to connect to ZooKeeper
    [junit4] 2> 765303 INFO (jetty-launcher-537-thread-4) [ ] o.a.s.s.SolrDispatchFilter solr.xml found in ZooKeeper. Loading...
    [junit4] 2> 765305 INFO (zkCallback-552-thread-1) [ ] o.a.s.c.c.ConnectionManager Watcher org.apache.solr.common.cloud.ConnectionManager@213167 name:ZooKeeperConnection Watcher:127.0.0.1:37916 got event WatchedEvent state:SyncConnected type:None path:null path:null type:None
    [junit4] 2> 765305 INFO (jetty-launcher-537-thread-5) [ ] o.a.s.c.c.ConnectionManager Client is connected to ZooKeeper
    [junit4] 2> 765306 INFO (jetty-launcher-537-thread-2) [ ] o.a.s.c.c.ConnectionManager Waiting for client to connect to ZooKeeper
    [junit4] 2> 765306 INFO (jetty-launcher-537-thread-1) [ ] o.a.s.c.c.ConnectionManager Waiting for client to connect to ZooKeeper
    [junit4] 2> 765306 INFO (jetty-launcher-537-thread-5) [ ] o.a.s.c.c.SolrZkClient Using default ZkACLProvider
    [junit4] 2> 765306 INFO (zkCallback-550-thread-1) [ ] o.a.s.c.c.ConnectionManager Watcher org.apache.solr.common.cloud.ConnectionManager@185c05f name:ZooKeeperConnection Watcher:127.0.0.1:37916 got event WatchedEvent state:SyncConnected type:None path:null path:null type:None
    [junit4] 2> 765306 INFO (jetty-launcher-537-thread-2) [ ] o.a.s.c.c.ConnectionManager Client is connected to ZooKeeper
    [junit4] 2> 765306 INFO (zkCallback-551-thread-1) [ ] o.a.s.c.c.ConnectionManager Watcher org.apache.solr.common.cloud.ConnectionManager@c47110 name:ZooKeeperConnection Watcher:127.0.0.1:37916 got event WatchedEvent state:SyncConnected type:None path:null path:null type:None
    [junit4] 2> 765306 INFO (jetty-launcher-537-thread-1) [ ] o.a.s.c.c.ConnectionManager Client is connected to ZooKeeper
    [junit4] 2> 765306 INFO (jetty-launcher-537-thread-2) [ ] o.a.s.c.c.SolrZkClient Using default ZkACLProvider
    [junit4] 2> 765306 INFO (jetty-launcher-537-thread-1) [ ] o.a.s.c.c.SolrZkClient Using default ZkACLProvider
    [junit4] 2> 765313 INFO (jetty-launcher-537-thread-5) [n:127.0.0.1:40825_solr ] o.a.s.c.ZkController Added new OnReconnect listener org.apache.solr.cloud.ZkController$6@279fe5
    [junit4] 2> 765313 INFO (jetty-launcher-537-thread-5) [n:127.0.0.1:40825_solr ] o.a.s.c.c.ConnectionManager Waiting for client to connect to ZooKeeper
    [junit4] 2> 765315 INFO (jetty-launcher-537-thread-1) [n:127.0.0.1:45665_solr ] o.a.s.c.ZkController Added new OnReconnect listener org.apache.solr.cloud.ZkController$6@19f150b
    [junit4] 2> 765315 INFO (jetty-launcher-537-thread-1) [n:127.0.0.1:45665_solr ] o.a.s.c.c.ConnectionManager Waiting for client to connect to ZooKeeper
    [junit4] 2> 765316 INFO (jetty-launcher-537-thread-2) [n:127.0.0.1:35326_solr ] o.a.s.c.ZkController Added new OnReconnect listener org.apache.solr.cloud.ZkController$6@1c9dc02
    [junit4] 2> 765316 INFO (jetty-launcher-537-thread-3) [ ] o.a.s.c.CorePropertiesLocator Config-defined core root directory: /home/jenkins/workspace/Lucene-Solr-5.5-Linux/solr/build/solr-core/test/J1/temp/solr.security.BasicAuthIntegrationTest_995253744E9FA0EF-001/tempDir-001/node3/.
    [junit4] 2> 765316 INFO (jetty-launcher-537-thread-2) [n:127.0.0.1:35326_solr ] o.a.s.c.c.ConnectionManager Waiting for client to connect to ZooKeeper
    [junit4] 2> 765316 INFO (zkCallback-553-thread-1-processing-n:127.0.0.1:40825_solr) [n:127.0.0.1:40825_solr ] o.a.s.c.c.ConnectionManager Watcher org.apache.solr.common.cloud.ConnectionManager@fe7303 name:ZooKeeperConnection Watcher:127.0.0.1:37916/solr got event WatchedEvent state:SyncConnected type:None path:null path:null type:None
    [junit4] 2> 765316 INFO (jetty-launcher-537-thread-3) [ ] o.a.s.c.CoreContainer New CoreContainer 19986067
    [junit4] 2> 765316 INFO (jetty-launcher-537-thread-5) [n:127.0.0.1:40825_solr ] o.a.s.c.c.ConnectionManager Client is connected to ZooKeeper
    [junit4] 2> 765316 INFO (jetty-launcher-537-thread-3) [ ] o.a.s.c.CoreContainer Loading cores into CoreContainer [instanceDir=/home/jenkins/workspace/Lucene-Solr-5.5-Linux/solr/build/solr-core/test/J1/temp/solr.security.BasicAuthIntegrationTest_995253744E9FA0EF-001/tempDir-001/node3]
    [junit4] 2> 765317 WARN (jetty-launcher-537-thread-3) [ ] o.a.s.c.CoreContainer Couldn't add files from /home/jenkins/workspace/Lucene-Solr-5.5-Linux/solr/build/solr-core/test/J1/temp/solr.security.BasicAuthIntegrationTest_995253744E9FA0EF-001/tempDir-001/node3/lib to classpath: /home/jenkins/workspace/Lucene-Solr-5.5-Linux/solr/build/solr-core/test/J1/temp/solr.security.BasicAuthIntegrationTest_995253744E9FA0EF-001/tempDir-001/node3/lib
    [junit4] 2> 765317 INFO (jetty-launcher-537-thread-3) [ ] o.a.s.h.c.HttpShardHandlerFactory created with socketTimeout : 90000,urlScheme : ,connTimeout : 15000,maxConnectionsPerHost : 20,maxConnections : 10000,corePoolSize : 0,maximumPoolSize : 2147483647,maxThreadIdleTime : 5,sizeOfQueue : -1,fairnessPolicy : false,useRetries : false,
    [junit4] 2> 765317 INFO (jetty-launcher-537-thread-3) [ ] o.a.s.u.UpdateShardHandler Creating UpdateShardHandler HTTP client with params: socketTimeout=340000&connTimeout=45000&retry=true
    [junit4] 2> 765318 INFO (zkCallback-554-thread-1-processing-n:127.0.0.1:45665_solr) [n:127.0.0.1:45665_solr ] o.a.s.c.c.ConnectionManager Watcher org.apache.solr.common.cloud.ConnectionManager@1b8d75e name:ZooKeeperConnection Watcher:127.0.0.1:37916/solr got event WatchedEvent state:SyncConnected type:None path:null path:null type:None
    [junit4] 2> 765318 INFO (jetty-launcher-537-thread-3) [ ] o.a.s.l.LogWatcher SLF4J impl is org.slf4j.impl.Log4jLoggerFactory
    [junit4] 2> 765318 INFO (jetty-launcher-537-thread-3) [ ] o.a.s.l.LogWatcher Registering Log Listener [Log4j (org.slf4j.impl.Log4jLoggerFactory)]
    [junit4] 2> 765318 INFO (jetty-launcher-537-thread-1) [n:127.0.0.1:45665_solr ] o.a.s.c.c.ConnectionManager Client is connected to ZooKeeper
    [junit4] 2> 765318 INFO (jetty-launcher-537-thread-4) [ ] o.a.s.c.CorePropertiesLocator Config-defined core root directory: /home/jenkins/workspace/Lucene-Solr-5.5-Linux/solr/build/solr-core/test/J1/temp/solr.security.BasicAuthIntegrationTest_995253744E9FA0EF-001/tempDir-001/node4/.
    [junit4] 2> 765318 INFO (jetty-launcher-537-thread-3) [ ] o.a.s.c.ZkContainer Zookeeper client=127.0.0.1:37916/solr
    [junit4] 2> 765318 INFO (jetty-launcher-537-thread-4) [ ] o.a.s.c.CoreContainer New CoreContainer 213300
    [junit4] 2> 765318 INFO (jetty-launcher-537-thread-3) [ ] o.a.s.c.ZkController zkHost includes chroot
    [junit4] 2> 765318 INFO (jetty-launcher-537-thread-4) [ ] o.a.s.c.CoreContainer Loading cores into CoreContainer [instanceDir=/home/jenkins/workspace/Lucene-Solr-5.5-Linux/solr/build/solr-core/test/J1/temp/solr.security.BasicAuthIntegrationTest_995253744E9FA0EF-001/tempDir-001/node4]
    [junit4] 2> 765319 INFO (jetty-launcher-537-thread-3) [ ] o.a.s.c.c.SolrZkClient Using default ZkCredentialsProvider
    [junit4] 2> 765320 WARN (jetty-launcher-537-thread-4) [ ] o.a.s.c.CoreContainer Couldn't add files from /home/jenkins/workspace/Lucene-Solr-5.5-Linux/solr/build/solr-core/test/J1/temp/solr.security.BasicAuthIntegrationTest_995253744E9FA0EF-001/tempDir-001/node4/lib to classpath: /home/jenkins/workspace/Lucene-Solr-5.5-Linux/solr/build/solr-core/test/J1/temp/solr.security.BasicAuthIntegrationTest_995253744E9FA0EF-001/tempDir-001/node4/lib
    [junit4] 2> 765320 INFO (jetty-launcher-537-thread-3) [ ] o.a.s.c.c.ConnectionManager Waiting for client to connect to ZooKeeper
    [junit4] 2> 765321 INFO (jetty-launcher-537-thread-4) [ ] o.a.s.h.c.HttpShardHandlerFactory created with socketTimeout : 90000,urlScheme : ,connTimeout : 15000,maxConnectionsPerHost : 20,maxConnections : 10000,corePoolSize : 0,maximumPoolSize : 2147483647,maxThreadIdleTime : 5,sizeOfQueue : -1,fairnessPolicy : false,useRetries : false,
    [junit4] 2> 765321 INFO (zkCallback-555-thread-1-processing-n:127.0.0.1:35326_solr) [n:127.0.0.1:35326_solr ] o.a.s.c.c.ConnectionManager Watcher org.apache.solr.common.cloud.ConnectionManager@17f8273 name:ZooKeeperConnection Watcher:127.0.0.1:37916/solr got event WatchedEvent state:SyncConnected type:None path:null path:null type:None
    [junit4] 2> 765321 INFO (jetty-launcher-537-thread-2) [n:127.0.0.1:35326_solr ] o.a.s.c.c.ConnectionManager Client is connected to ZooKeeper
    [junit4] 2> 765321 INFO (jetty-launcher-537-thread-4) [ ] o.a.s.u.UpdateShardHandler Creating UpdateShardHandler HTTP client with params: socketTimeout=340000&connTimeout=45000&retry=true
    [junit4] 2> 765322 INFO (jetty-launcher-537-thread-4) [ ] o.a.s.l.LogWatcher SLF4J impl is org.slf4j.impl.Log4jLoggerFactory
    [junit4] 2> 765322 INFO (jetty-launcher-537-thread-4) [ ] o.a.s.l.LogWatcher Registering Log Listener [Log4j (org.slf4j.impl.Log4jLoggerFactory)]
    [junit4] 2> 765322 INFO (jetty-launcher-537-thread-4) [ ] o.a.s.c.ZkContainer Zookeeper client=127.0.0.1:37916/solr
    [junit4] 2> 765322 INFO (jetty-launcher-537-thread-4) [ ] o.a.s.c.ZkController zkHost includes chroot
    [junit4] 2> 765322 INFO (jetty-launcher-537-thread-4) [ ] o.a.s.c.c.SolrZkClient Using default ZkCredentialsProvider
    [junit4] 2> 765322 INFO (jetty-launcher-537-thread-4) [ ] o.a.s.c.c.ConnectionManager Waiting for client to connect to ZooKeeper
    [junit4] 2> 765322 INFO (jetty-launcher-537-thread-5) [n:127.0.0.1:40825_solr ] o.a.s.c.c.SolrZkClient makePath: /overseer/queue
    [junit4] 2> 765324 INFO (jetty-launcher-537-thread-1) [n:127.0.0.1:45665_solr ] o.a.s.c.c.SolrZkClient makePath: /overseer/queue
    [junit4] 2> 765324 INFO (zkCallback-558-thread-1) [ ] o.a.s.c.c.ConnectionManager Watcher org.apache.solr.common.cloud.ConnectionManager@7cc7ab name:ZooKeeperConnection Watcher:127.0.0.1:37916 got event WatchedEvent state:SyncConnected type:None path:null path:null type:None
    [junit4] 2> 765324 INFO (jetty-launcher-537-thread-3) [ ] o.a.s.c.c.ConnectionManager Client is connected to ZooKeeper
    [junit4] 2> 765324 INFO (jetty-launcher-537-thread-3) [ ] o.a.s.c.c.SolrZkClient Using default ZkACLProvider
    [junit4] 2> 765326 INFO (zkCallback-561-thread-1) [ ] o.a.s.c.c.ConnectionManager Watcher org.apache.solr.common.cloud.ConnectionManager@57767a name:ZooKeeperConnection Watcher:127.0.0.1:37916 got event WatchedEvent state:SyncConnected type:None path:null path:null type:None
    [junit4] 2> 765326 INFO (jetty-launcher-537-thread-2) [n:127.0.0.1:35326_solr ] o.a.s.c.c.SolrZkClient makePath: /overseer/queue
    [junit4] 2> 765326 INFO (jetty-launcher-537-thread-4) [ ] o.a.s.c.c.ConnectionManager Client is connected to ZooKeeper
    [junit4] 2> 765326 INFO (jetty-launcher-537-thread-4) [ ] o.a.s.c.c.SolrZkClient Using default ZkACLProvider
    [junit4] 2> 765329 INFO (jetty-launcher-537-thread-3) [n:127.0.0.1:39590_solr ] o.a.s.c.ZkController Added new OnReconnect listener org.apache.solr.cloud.ZkController$6@1afb00e
    [junit4] 2> 765329 INFO (jetty-launcher-537-thread-3) [n:127.0.0.1:39590_solr ] o.a.s.c.c.ConnectionManager Waiting for client to connect to ZooKeeper
    [junit4] 2> 765341 INFO (jetty-launcher-537-thread-4) [n:127.0.0.1:44214_solr ] o.a.s.c.ZkController Added new OnReconnect listener org.apache.solr.cloud.ZkController$6@1d93d66
    [junit4] 2> 765341 INFO (zkCallback-562-thread-1-processing-n:127.0.0.1:39590_solr) [n:127.0.0.1:39590_solr ] o.a.s.c.c.ConnectionManager Watcher org.apache.solr.common.cloud.ConnectionManager@14e1a71 name:ZooKeeperConnection Watcher:127.0.0.1:37916/solr got event WatchedEvent state:SyncConnected type:None path:null path:null type:None
    [junit4] 2> 765341 INFO (jetty-launcher-537-thread-3) [n:127.0.0.1:39590_solr ] o.a.s.c.c.ConnectionManager Client is connected to ZooKeeper
    [junit4] 2> 765341 INFO (jetty-launcher-537-thread-4) [n:127.0.0.1:44214_solr ] o.a.s.c.c.ConnectionManager Waiting for client to connect to ZooKeeper
    [junit4] 2> 765347 INFO (zkCallback-563-thread-1-processing-n:127.0.0.1:44214_solr) [n:127.0.0.1:44214_solr ] o.a.s.c.c.ConnectionManager Watcher org.apache.solr.common.cloud.ConnectionManager@f5c18e name:ZooKeeperConnection Watcher:127.0.0.1:37916/solr got event WatchedEvent state:SyncConnected type:None path:null path:null type:None
    [junit4] 2> 765347 INFO (jetty-launcher-537-thread-4) [n:127.0.0.1:44214_solr ] o.a.s.c.c.ConnectionManager Client is connected to ZooKeeper
    [junit4] 2> 765349 INFO (jetty-launcher-537-thread-1) [n:127.0.0.1:45665_solr ] o.a.s.c.c.SolrZkClient makePath: /overseer/collection-queue-work
    [junit4] 2> 765349 INFO (jetty-launcher-537-thread-5) [n:127.0.0.1:40825_solr ] o.a.s.c.c.SolrZkClient makePath: /overseer/collection-queue-work
    [junit4] 2> 765350 INFO (jetty-launcher-537-thread-2) [n:127.0.0.1:35326_solr ] o.a.s.c.c.SolrZkClient makePath: /overseer/collection-queue-work
    [junit4] 2> 765350 INFO (jetty-launcher-537-thread-3) [n:127.0.0.1:39590_solr ] o.a.s.c.c.SolrZkClient makePath: /overseer/collection-queue-work
    [junit4] 2> 765400 INFO (jetty-launcher-537-thread-1) [n:127.0.0.1:45665_solr ] o.a.s.c.c.SolrZkClient makePath: /overseer/collection-map-running
    [junit4] 2> 765400 INFO (jetty-launcher-537-thread-2) [n:127.0.0.1:35326_solr ] o.a.s.c.c.SolrZkClient makePath: /overseer/collection-map-running
    [junit4] 2> 765412 INFO (jetty-launcher-537-thread-5) [n:127.0.0.1:40825_solr ] o.a.s.c.c.SolrZkClient makePath: /overseer/collection-map-running
    [junit4] 2> 765412 INFO (jetty-launcher-537-thread-4) [n:127.0.0.1:44214_solr ] o.a.s.c.c.SolrZkClient makePath: /overseer/collection-map-running
    [junit4] 2> 765412 INFO (jetty-launcher-537-thread-3) [n:127.0.0.1:39590_solr ] o.a.s.c.c.SolrZkClient makePath: /overseer/collection-map-running
    [junit4] 2> 765434 INFO (jetty-launcher-537-thread-2) [n:127.0.0.1:35326_solr ] o.a.s.c.c.SolrZkClient makePath: /overseer/collection-map-completed
    [junit4] 2> 765434 INFO (jetty-launcher-537-thread-1) [n:127.0.0.1:45665_solr ] o.a.s.c.c.SolrZkClient makePath: /overseer/collection-map-completed
    [junit4] 2> 765434 INFO (jetty-launcher-537-thread-5) [n:127.0.0.1:40825_solr ] o.a.s.c.c.SolrZkClient makePath: /overseer/collection-map-completed
    [junit4] 2> 765434 INFO (jetty-launcher-537-thread-4) [n:127.0.0.1:44214_solr ] o.a.s.c.c.SolrZkClient makePath: /overseer/collection-map-completed
    [junit4] 2> 765434 INFO (jetty-launcher-537-thread-3) [n:127.0.0.1:39590_solr ] o.a.s.c.c.SolrZkClient makePath: /overseer/collection-map-completed
    [junit4] 2> 765442 INFO (jetty-launcher-537-thread-2) [n:127.0.0.1:35326_solr ] o.a.s.c.c.SolrZkClient makePath: /overseer/collection-map-failure
    [junit4] 2> 765443 INFO (jetty-launcher-537-thread-1) [n:127.0.0.1:45665_solr ] o.a.s.c.c.SolrZkClient makePath: /overseer/collection-map-failure
    [junit4] 2> 765444 INFO (jetty-launcher-537-thread-5) [n:127.0.0.1:40825_solr ] o.a.s.c.c.SolrZkClient makePath: /overseer/collection-map-failure
    [junit4] 2> 765444 INFO (jetty-launcher-537-thread-4) [n:127.0.0.1:44214_solr ] o.a.s.c.c.SolrZkClient makePath: /overseer/collection-map-failure
    [junit4] 2> 765444 INFO (jetty-launcher-537-thread-3) [n:127.0.0.1:39590_solr ] o.a.s.c.c.SolrZkClient makePath: /overseer/collection-map-failure
    [junit4] 2> 765449 INFO (jetty-launcher-537-thread-2) [n:127.0.0.1:35326_solr ] o.a.s.c.c.SolrZkClient makePath: /live_nodes
    [junit4] 2> 765450 INFO (jetty-launcher-537-thread-1) [n:127.0.0.1:45665_solr ] o.a.s.c.c.SolrZkClient makePath: /live_nodes
    [junit4] 2> 765450 INFO (jetty-launcher-537-thread-5) [n:127.0.0.1:40825_solr ] o.a.s.c.c.SolrZkClient makePath: /live_nodes
    [junit4] 2> 765454 INFO (jetty-launcher-537-thread-3) [n:127.0.0.1:39590_solr ] o.a.s.c.c.SolrZkClient makePath: /collections
    [junit4] 2> 765455 INFO (jetty-launcher-537-thread-2) [n:127.0.0.1:35326_solr ] o.a.s.c.c.SolrZkClient makePath: /collections
    [junit4] 2> 765456 INFO (jetty-launcher-537-thread-1) [n:127.0.0.1:45665_solr ] o.a.s.c.c.SolrZkClient makePath: /collections
    [junit4] 2> 765457 INFO (jetty-launcher-537-thread-5) [n:127.0.0.1:40825_solr ] o.a.s.c.c.SolrZkClient makePath: /aliases.json
    [junit4] 2> 765459 INFO (jetty-launcher-537-thread-4) [n:127.0.0.1:44214_solr ] o.a.s.c.c.SolrZkClient makePath: /aliases.json
    [junit4] 2> 765459 INFO (jetty-launcher-537-thread-2) [n:127.0.0.1:35326_solr ] o.a.s.c.c.SolrZkClient makePath: /aliases.json
    [junit4] 2> 765459 INFO (jetty-launcher-537-thread-1) [n:127.0.0.1:45665_solr ] o.a.s.c.c.SolrZkClient makePath: /aliases.json
    [junit4] 2> 765460 INFO (jetty-launcher-537-thread-3) [n:127.0.0.1:39590_solr ] o.a.s.c.c.SolrZkClient makePath: /aliases.json
    [junit4] 2> 765464 INFO (jetty-launcher-537-thread-2) [n:127.0.0.1:35326_solr ] o.a.s.c.c.SolrZkClient makePath: /clusterstate.json
    [junit4] 2> 765464 INFO (jetty-launcher-537-thread-5) [n:127.0.0.1:40825_solr ] o.a.s.c.c.SolrZkClient makePath: /clusterstate.json
    [junit4] 2> 765466 INFO (jetty-launcher-537-thread-4) [n:127.0.0.1:44214_solr ] o.a.s.c.c.SolrZkClient makePath: /clusterstate.json
    [junit4] 2> 765466 INFO (jetty-launcher-537-thread-1) [n:127.0.0.1:45665_solr ] o.a.s.c.c.SolrZkClient makePath: /clusterstate.json
    [junit4] 2> 765469 INFO (jetty-launcher-537-thread-3) [n:127.0.0.1:39590_solr ] o.a.s.c.c.SolrZkClient makePath: /security.json
    [junit4] 2> 765471 INFO (jetty-launcher-537-thread-2) [n:127.0.0.1:35326_solr ] o.a.s.c.c.SolrZkClient makePath: /security.json
    [junit4] 2> 765471 INFO (jetty-launcher-537-thread-5) [n:127.0.0.1:40825_solr ] o.a.s.c.c.SolrZkClient makePath: /security.json
    [junit4] 2> 765476 INFO (jetty-launcher-537-thread-1) [n:127.0.0.1:45665_solr ] o.a.s.c.ZkController Register node as live in ZooKeeper:/live_nodes/127.0.0.1:45665_solr
    [junit4] 2> 765476 INFO (jetty-launcher-537-thread-4) [n:127.0.0.1:44214_solr ] o.a.s.c.ZkController Register node as live in ZooKeeper:/live_nodes/127.0.0.1:44214_solr
    [junit4] 2> 765476 INFO (jetty-launcher-537-thread-5) [n:127.0.0.1:40825_solr ] o.a.s.c.ZkController Register node as live in ZooKeeper:/live_nodes/127.0.0.1:40825_solr
    [junit4] 2> 765478 INFO (jetty-launcher-537-thread-2) [n:127.0.0.1:35326_solr ] o.a.s.c.ZkController Register node as live in ZooKeeper:/live_nodes/127.0.0.1:35326_solr
    [junit4] 2> 765478 INFO (jetty-launcher-537-thread-3) [n:127.0.0.1:39590_solr ] o.a.s.c.ZkController Register node as live in ZooKeeper:/live_nodes/127.0.0.1:39590_solr
    [junit4] 2> 765478 INFO (jetty-launcher-537-thread-4) [n:127.0.0.1:44214_solr ] o.a.s.c.c.SolrZkClient makePath: /live_nodes/127.0.0.1:44214_solr
    [junit4] 2> 765478 INFO (jetty-launcher-537-thread-1) [n:127.0.0.1:45665_solr ] o.a.s.c.c.SolrZkClient makePath: /live_nodes/127.0.0.1:45665_solr
    [junit4] 2> 765480 INFO (jetty-launcher-537-thread-5) [n:127.0.0.1:40825_solr ] o.a.s.c.c.SolrZkClient makePath: /live_nodes/127.0.0.1:40825_solr
    [junit4] 2> 765480 INFO (jetty-launcher-537-thread-2) [n:127.0.0.1:35326_solr ] o.a.s.c.c.SolrZkClient makePath: /live_nodes/127.0.0.1:35326_solr
    [junit4] 2> 765480 INFO (jetty-launcher-537-thread-3) [n:127.0.0.1:39590_solr ] o.a.s.c.c.SolrZkClient makePath: /live_nodes/127.0.0.1:39590_solr
    [junit4] 2> 765485 INFO (jetty-launcher-537-thread-4) [n:127.0.0.1:44214_solr ] o.a.s.c.c.SolrZkClient makePath: /overseer_elect
    [junit4] 2> 765485 INFO (jetty-launcher-537-thread-2) [n:127.0.0.1:35326_solr ] o.a.s.c.c.SolrZkClient makePath: /overseer_elect
    [junit4] 2> 765486 INFO (jetty-launcher-537-thread-5) [n:127.0.0.1:40825_solr ] o.a.s.c.c.SolrZkClient makePath: /overseer_elect
    [junit4] 2> 765486 INFO (jetty-launcher-537-thread-3) [n:127.0.0.1:39590_solr ] o.a.s.c.c.SolrZkClient makePath: /overseer_elect
    [junit4] 2> 765486 INFO (jetty-launcher-537-thread-1) [n:127.0.0.1:45665_solr ] o.a.s.c.c.SolrZkClient makePath: /overseer_elect
    [junit4] 2> 765491 INFO (jetty-launcher-537-thread-4) [n:127.0.0.1:44214_solr ] o.a.s.c.c.SolrZkClient makePath: /overseer_elect/election
    [junit4] 2> 765491 INFO (jetty-launcher-537-thread-3) [n:127.0.0.1:39590_solr ] o.a.s.c.c.SolrZkClient makePath: /overseer_elect/election
    [junit4] 2> 765491 INFO (jetty-launcher-537-thread-5) [n:127.0.0.1:40825_solr ] o.a.s.c.c.SolrZkClient makePath: /overseer_elect/election
    [junit4] 2> 765491 INFO (jetty-launcher-537-thread-1) [n:127.0.0.1:45665_solr ] o.a.s.c.c.SolrZkClient makePath: /overseer_elect/election
    [junit4] 2> 765491 INFO (jetty-launcher-537-thread-2) [n:127.0.0.1:35326_solr ] o.a.s.c.c.SolrZkClient makePath: /overseer_elect/election
    [junit4] 2> 765505 INFO (jetty-launcher-537-thread-2) [n:127.0.0.1:35326_solr ] o.a.s.c.Overseer Overseer (id=null) closing
    [junit4] 2> 765505 INFO (jetty-launcher-537-thread-3) [n:127.0.0.1:39590_solr ] o.a.s.c.Overseer Overseer (id=null) closing
    [junit4] 2> 765505 INFO (jetty-launcher-537-thread-4) [n:127.0.0.1:44214_solr ] o.a.s.c.Overseer Overseer (id=null) closing
    [junit4] 2> 765505 INFO (jetty-launcher-537-thread-5) [n:127.0.0.1:40825_solr ] o.a.s.c.Overseer Overseer (id=null) closing
    [junit4] 2> 765505 INFO (jetty-launcher-537-thread-1) [n:127.0.0.1:45665_solr ] o.a.s.c.Overseer Overseer (id=null) closing
    [junit4] 2> 765507 INFO (jetty-launcher-537-thread-2) [n:127.0.0.1:35326_solr ] o.a.s.c.LeaderElector Joined leadership election with path: /overseer_elect/election/96089581749665803-127.0.0.1:35326_solr-n_0000000000
    [junit4] 2> 765509 INFO (jetty-launcher-537-thread-3) [n:127.0.0.1:39590_solr ] o.a.s.c.LeaderElector Joined leadership election with path: /overseer_elect/election/96089581749665806-127.0.0.1:39590_solr-n_0000000001
    [junit4] 2> 765509 INFO (jetty-launcher-537-thread-4) [n:127.0.0.1:44214_solr ] o.a.s.c.LeaderElector Joined leadership election with path: /overseer_elect/election/96089581749665807-127.0.0.1:44214_solr-n_0000000002
    [junit4] 2> 765509 INFO (jetty-launcher-537-thread-5) [n:127.0.0.1:40825_solr ] o.a.s.c.LeaderElector Joined leadership election with path: /overseer_elect/election/96089581749665801-127.0.0.1:40825_solr-n_0000000003
    [junit4] 2> 765509 INFO (jetty-launcher-537-thread-1) [n:127.0.0.1:45665_solr ] o.a.s.c.LeaderElector Joined leadership election with path: /overseer_elect/election/96089581749665802-127.0.0.1:45665_solr-n_0000000004
    [junit4] 2> 765509 INFO (jetty-launcher-537-thread-2) [n:127.0.0.1:35326_solr ] o.a.s.c.OverseerElectionContext I am going to be the leader 127.0.0.1:35326_solr
    [junit4] 2> 765509 INFO (jetty-launcher-537-thread-2) [n:127.0.0.1:35326_solr ] o.a.s.c.c.SolrZkClient makePath: /overseer_elect/leader
    [junit4] 2> 765509 INFO (jetty-launcher-537-thread-3) [n:127.0.0.1:39590_solr ] o.a.s.c.LeaderElector Watching path /overseer_elect/election/96089581749665803-127.0.0.1:35326_solr-n_0000000000 to know if I could be the leader
    [junit4] 2> 765509 INFO (jetty-launcher-537-thread-3) [n:127.0.0.1:39590_solr ] o.a.s.c.c.ZkStateReader Updating cluster state from ZooKeeper...
    [junit4] 2> 765509 INFO (jetty-launcher-537-thread-5) [n:127.0.0.1:40825_solr ] o.a.s.c.LeaderElector Watching path /overseer_elect/election/96089581749665807-127.0.0.1:44214_solr-n_0000000002 to know if I could be the leader
    [junit4] 2> 765509 INFO (jetty-launcher-537-thread-4) [n:127.0.0.1:44214_solr ] o.a.s.c.LeaderElector Watching path /overseer_elect/election/96089581749665806-127.0.0.1:39590_solr-n_0000000001 to know if I could be the leader
    [junit4] 2> 765509 INFO (jetty-launcher-537-thread-5) [n:127.0.0.1:40825_solr ] o.a.s.c.c.ZkStateReader Updating cluster state from ZooKeeper...
    [junit4] 2> 765509 INFO (jetty-launcher-537-thread-4) [n:127.0.0.1:44214_solr ] o.a.s.c.c.ZkStateReader Updating cluster state from ZooKeeper...
    [junit4] 2> 765509 INFO (jetty-launcher-537-thread-1) [n:127.0.0.1:45665_solr ] o.a.s.c.LeaderElector Watching path /overseer_elect/election/96089581749665801-127.0.0.1:40825_solr-n_0000000003 to know if I could be the leader
    [junit4] 2> 765509 INFO (jetty-launcher-537-thread-1) [n:127.0.0.1:45665_solr ] o.a.s.c.c.ZkStateReader Updating cluster state from ZooKeeper...
    [junit4] 2> 765512 INFO (jetty-launcher-537-thread-2) [n:127.0.0.1:35326_solr ] o.a.s.c.Overseer Overseer (id=96089581749665803-127.0.0.1:35326_solr-n_0000000000) starting
    [junit4] 2> 765519 INFO (jetty-launcher-537-thread-2) [n:127.0.0.1:35326_solr ] o.a.s.c.c.SolrZkClient makePath: /overseer/queue-work
    [junit4] 2> 765536 INFO (jetty-launcher-537-thread-3) [n:127.0.0.1:39590_solr ] o.a.s.c.CoreContainer Security conf doesn't exist. Skipping setup for authorization module.
    [junit4] 2> 765536 INFO (jetty-launcher-537-thread-3) [n:127.0.0.1:39590_solr ] o.a.s.c.CoreContainer No authentication plugin used.
    [junit4] 2> 765536 INFO (jetty-launcher-537-thread-3) [n:127.0.0.1:39590_solr ] o.a.s.c.CorePropertiesLocator Looking for core definitions underneath /home/jenkins/workspace/Lucene-Solr-5.5-Linux/solr/build/solr-core/test/J1/temp/solr.security.BasicAuthIntegrationTest_995253744E9FA0EF-001/tempDir-001/node3/.
    [junit4] 2> 765537 INFO (jetty-launcher-537-thread-3) [n:127.0.0.1:39590_solr ] o.a.s.c.CorePropertiesLocator Found 0 core definitions
    [junit4] 2> 765549 INFO (jetty-launcher-537-thread-3) [n:127.0.0.1:39590_solr ] o.a.s.s.SolrDispatchFilter user.dir=/home/jenkins/workspace/Lucene-Solr-5.5-Linux/solr/build/solr-core/test/J1
    [junit4] 2> 765549 INFO (jetty-launcher-537-thread-3) [n:127.0.0.1:39590_solr ] o.a.s.s.SolrDispatchFilter SolrDispatchFilter.init() done
    [junit4] 2> 765556 INFO (jetty-launcher-537-thread-5) [n:127.0.0.1:40825_solr ] o.a.s.c.CoreContainer Security conf doesn't exist. Skipping setup for authorization module.
    [junit4] 2> 765556 INFO (jetty-launcher-537-thread-5) [n:127.0.0.1:40825_solr ] o.a.s.c.CoreContainer No authentication plugin used.
    [junit4] 2> 765556 INFO (jetty-launcher-537-thread-5) [n:127.0.0.1:40825_solr ] o.a.s.c.CorePropertiesLocator Looking for core definitions underneath /home/jenkins/workspace/Lucene-Solr-5.5-Linux/solr/build/solr-core/test/J1/temp/solr.security.BasicAuthIntegrationTest_995253744E9FA0EF-001/tempDir-001/node5/.
    [junit4] 2> 765556 INFO (jetty-launcher-537-thread-5) [n:127.0.0.1:40825_solr ] o.a.s.c.CorePropertiesLocator Found 0 core definitions
    [junit4] 2> 765558 INFO (jetty-launcher-537-thread-1) [n:127.0.0.1:45665_solr ] o.a.s.c.CoreContainer Security conf doesn't exist. Skipping setup for authorization module.
    [junit4] 2> 765558 INFO (jetty-launcher-537-thread-1) [n:127.0.0.1:45665_solr ] o.a.s.c.CoreContainer No authentication plugin used.
    [junit4] 2> 765559 INFO (jetty-launcher-537-thread-1) [n:127.0.0.1:45665_solr ] o.a.s.c.CorePropertiesLocator Looking for core definitions underneath /home/jenkins/workspace/Lucene-Solr-5.5-Linux/solr/build/solr-core/test/J1/temp/solr.security.BasicAuthIntegrationTest_995253744E9FA0EF-001/tempDir-001/node1/.
    [junit4] 2> 765560 INFO (jetty-launcher-537-thread-1) [n:127.0.0.1:45665_solr ] o.a.s.c.CorePropertiesLocator Found 0 core definitions
    [junit4] 2> 765567 INFO (jetty-launcher-537-thread-4) [n:127.0.0.1:44214_solr ] o.a.s.c.CoreContainer Security conf doesn't exist. Skipping setup for authorization module.
    [junit4] 2> 765567 INFO (jetty-launcher-537-thread-4) [n:127.0.0.1:44214_solr ] o.a.s.c.CoreContainer No authentication plugin used.
    [junit4] 2> 765568 INFO (jetty-launcher-537-thread-4) [n:127.0.0.1:44214_solr ] o.a.s.c.CorePropertiesLocator Looking for core definitions underneath /home/jenkins/workspace/Lucene-Solr-5.5-Linux/solr/build/solr-core/test/J1/temp/solr.security.BasicAuthIntegrationTest_995253744E9FA0EF-001/tempDir-001/node4/.
    [junit4] 2> 765568 INFO (jetty-launcher-537-thread-4) [n:127.0.0.1:44214_solr ] o.a.s.c.CorePropertiesLocator Found 0 core definitions
    [junit4] 2> 765568 INFO (jetty-launcher-537-thread-5) [n:127.0.0.1:40825_solr ] o.a.s.s.SolrDispatchFilter user.dir=/home/jenkins/workspace/Lucene-Solr-5.5-Linux/solr/build/solr-core/test/J1
    [junit4] 2> 765568 INFO (jetty-launcher-537-thread-5) [n:127.0.0.1:40825_solr ] o.a.s.s.SolrDispatchFilter SolrDispatchFilter.init() done
    [junit4] 2> 765570 INFO (jetty-launcher-537-thread-4) [n:127.0.0.1:44214_solr ] o.a.s.s.SolrDispatchFilter user.dir=/home/jenkins/workspace/Lucene-Solr-5.5-Linux/solr/build/solr-core/test/J1
    [junit4] 2> 765570 INFO (jetty-launcher-537-thread-1) [n:127.0.0.1:45665_solr ] o.a.s.s.SolrDispatchFilter user.dir=/home/jenkins/workspace/Lucene-Solr-5.5-Linux/solr/build/solr-core/test/J1
    [junit4] 2> 765570 INFO (jetty-launcher-537-thread-4) [n:127.0.0.1:44214_solr ] o.a.s.s.SolrDispatchFilter SolrDispatchFilter.init() done
    [junit4] 2> 765570 INFO (jetty-launcher-537-thread-1) [n:127.0.0.1:45665_solr ] o.a.s.s.SolrDispatchFilter SolrDispatchFilter.init() done
    [junit4] 2> 765578 INFO (jetty-launcher-537-thread-2) [n:127.0.0.1:35326_solr ] o.a.s.c.OverseerAutoReplicaFailoverThread Starting OverseerAutoReplicaFailoverThread autoReplicaFailoverWorkLoopDelay=10000 autoReplicaFailoverWaitAfterExpiration=30000 autoReplicaFailoverBadNodeExpiration=60000
    [junit4] 2> 765578 INFO (OverseerCollectionConfigSetProcessor-96089581749665803-127.0.0.1:35326_solr-n_0000000000) [n:127.0.0.1:35326_solr ] o.a.s.c.OverseerTaskProcessor Process current queue of overseer operations
    [junit4] 2> 765578 INFO (jetty-launcher-537-thread-2) [n:127.0.0.1:35326_solr ] o.a.s.c.c.ZkStateReader Updating cluster state from ZooKeeper...
    [junit4] 2> 765579 INFO (OverseerStateUpdate-96089581749665803-127.0.0.1:35326_solr-n_0000000000) [n:127.0.0.1:35326_solr ] o.a.s.c.Overseer Starting to work on the main queue
    [junit4] 2> 765592 INFO (jetty-launcher-537-thread-2) [n:127.0.0.1:35326_solr ] o.a.s.c.CoreContainer Security conf doesn't exist. Skipping setup for authorization module.
    [junit4] 2> 765592 INFO (jetty-launcher-537-thread-2) [n:127.0.0.1:35326_solr ] o.a.s.c.CoreContainer No authentication plugin used.
    [junit4] 2> 765593 INFO (jetty-launcher-537-thread-2) [n:127.0.0.1:35326_solr ] o.a.s.c.CorePropertiesLocator Looking for core definitions underneath /home/jenkins/workspace/Lucene-Solr-5.5-Linux/solr/build/solr-core/test/J1/temp/solr.security.BasicAuthIntegrationTest_995253744E9FA0EF-001/tempDir-001/node2/.
    [junit4] 2> 765593 INFO (jetty-launcher-537-thread-2) [n:127.0.0.1:35326_solr ] o.a.s.c.CorePropertiesLocator Found 0 core definitions
    [junit4] 2> 765603 INFO (jetty-launcher-537-thread-2) [n:127.0.0.1:35326_solr ] o.a.s.s.SolrDispatchFilter user.dir=/home/jenkins/workspace/Lucene-Solr-5.5-Linux/solr/build/solr-core/test/J1
    [junit4] 2> 765603 INFO (jetty-launcher-537-thread-2) [n:127.0.0.1:35326_solr ] o.a.s.s.SolrDispatchFilter SolrDispatchFilter.init() done
    [junit4] 2> 765603 INFO (TEST-BasicAuthIntegrationTest.testBasics-seed#[995253744E9FA0EF]) [ ] o.a.s.c.c.SolrZkClient Using default ZkCredentialsProvider
    [junit4] 2> 765604 INFO (TEST-BasicAuthIntegrationTest.testBasics-seed#[995253744E9FA0EF]) [ ] o.a.s.c.c.ConnectionManager Waiting for client to connect to ZooKeeper
    [junit4] 2> 765608 INFO (zkCallback-564-thread-1) [ ] o.a.s.c.c.ConnectionManager Watcher org.apache.solr.common.cloud.ConnectionManager@13f71df name:ZooKeeperConnection Watcher:127.0.0.1:37916 got event WatchedEvent state:SyncConnected type:None path:null path:null type:None
    [junit4] 2> 765608 INFO (TEST-BasicAuthIntegrationTest.testBasics-seed#[995253744E9FA0EF]) [ ] o.a.s.c.c.ConnectionManager Client is connected to ZooKeeper
    [junit4] 2> 765608 INFO (TEST-BasicAuthIntegrationTest.testBasics-seed#[995253744E9FA0EF]) [ ] o.a.s.c.c.SolrZkClient Using default ZkACLProvider
    [junit4] 2> 765612 INFO (TEST-BasicAuthIntegrationTest.testBasics-seed#[995253744E9FA0EF]) [ ] o.e.j.s.ServerConnector Stopped ServerConnector@9e5b6a{HTTP/1.1}{127.0.0.1:0}
    [junit4] 2> 765612 INFO (TEST-BasicAuthIntegrationTest.testBasics-seed#[995253744E9FA0EF]) [ ] o.a.s.c.CoreContainer Shutting down CoreContainer instance=19986067
    [junit4] 2> 765612 INFO (TEST-BasicAuthIntegrationTest.testBasics-seed#[995253744E9FA0EF]) [ ] o.a.s.c.ZkController Publish node=127.0.0.1:39590_solr as DOWN
    [junit4] 2> 765619 INFO (zkCallback-553-thread-1-processing-n:127.0.0.1:40825_solr) [n:127.0.0.1:40825_solr ] o.a.s.c.c.ZkStateReader A live node change: [WatchedEvent state:SyncConnected type:NodeChildrenChanged path:/live_nodes], has occurred - updating... (live nodes size: [5])
    [junit4] 2> 765619 WARN (NIOServerCxn.Factory:0.0.0.0/0.0.0.0:0) [ ] o.a.z.s.NIOServerCnxn caught end of stream exception
    [junit4] 2> EndOfStreamException: Unable to read additional data from client sessionid 0x15560f72ace000e, likely client has closed socket
    [junit4] 2> at org.apache.zookeeper.server.NIOServerCnxn.doIO(NIOServerCnxn.java:228)
    [junit4] 2> at org.apache.zookeeper.server.NIOServerCnxnFactory.run(NIOServerCnxnFactory.java:208)
    [junit4] 2> at java.lang.Thread.run(Thread.java:745)
    [junit4] 2> 765620 INFO (zkCallback-562-thread-1-processing-n:127.0.0.1:39590_solr) [n:127.0.0.1:39590_solr ] o.a.s.c.c.ZkStateReader A live node change: [WatchedEvent state:SyncConnected type:NodeChildrenChanged path:/live_nodes], has occurred - updating... (live nodes size: [5])
    [junit4] 2> 765619 INFO (zkCallback-563-thread-2-processing-n:127.0.0.1:44214_solr) [n:127.0.0.1:44214_solr ] o.a.s.c.c.ZkStateReader A live node change: [WatchedEvent state:SyncConnected type:NodeChildrenChanged path:/live_nodes], has occurred - updating... (live nodes size: [5])
    [junit4] 2> 765620 WARN (zkCallback-562-thread-1-processing-n:127.0.0.1:39590_solr) [n:127.0.0.1:39590_solr ] o.a.s.c.c.ZkStateReader ZooKeeper watch triggered, but Solr cannot talk to ZK: [KeeperErrorCode = Session expired for /live_nodes]
    [junit4] 2> 765619 INFO (zkCallback-554-thread-1-processing-n:127.0.0.1:45665_solr) [n:127.0.0.1:45665_solr ] o.a.s.c.c.ZkStateReader A live node change: [WatchedEvent state:SyncConnected type:NodeChildrenChanged path:/live_nodes], has occurred - updating... (live nodes size: [5])
    [junit4] 2> 765619 INFO (zkCallback-555-thread-1-processing-n:127.0.0.1:35326_solr) [n:127.0.0.1:35326_solr ] o.a.s.c.c.ZkStateReader A live node change: [WatchedEvent state:SyncConnected type:NodeChildrenChanged path:/live_nodes], has occurred - updating... (live nodes size: [5])
    [junit4] 2> 765619 INFO (OverseerStateUpdate-96089581749665803-127.0.0.1:35326_solr-n_0000000000) [n:127.0.0.1:35326_solr ] o.a.s.c.Overseer processMessage: queueSize: 1, message = {
    [junit4] 2> "operation":"downnode",
    [junit4] 2> "node_name":"127.0.0.1:39590_solr"} current state version: 0
    [junit4] 2> 765621 INFO (OverseerStateUpdate-96089581749665803-127.0.0.1:35326_solr-n_0000000000) [n:127.0.0.1:35326_solr ] o.a.s.c.o.NodeMutator DownNode state invoked for node: 127.0.0.1:39590_solr
    [junit4] 2> 765621 INFO (TEST-BasicAuthIntegrationTest.testBasics-seed#[995253744E9FA0EF]) [ ] o.e.j.s.h.ContextHandler Stopped o.e.j.s.ServletContextHandler@16aaf6e{/solr,null,UNAVAILABLE}
    [junit4] 2> 765622 INFO (zkCallback-563-thread-1-processing-n:127.0.0.1:44214_solr) [n:127.0.0.1:44214_solr ] o.a.s.c.LeaderElector Watching path /overseer_elect/election/96089581749665803-127.0.0.1:35326_solr-n_0000000000 to know if I could be the leader
    [junit4] 2> 765624 INFO (TEST-BasicAuthIntegrationTest.testBasics-seed#[995253744E9FA0EF]) [ ] o.e.j.s.Server jetty-9.2.13.v20150730
    [junit4] 2> 765635 INFO (TEST-BasicAuthIntegrationTest.testBasics-seed#[995253744E9FA0EF]) [ ] o.e.j.s.h.ContextHandler Started o.e.j.s.ServletContextHandler@64bf1f{/solr,null,AVAILABLE}
    [junit4] 2> 765636 INFO (TEST-BasicAuthIntegrationTest.testBasics-seed#[995253744E9FA0EF]) [ ] o.e.j.s.ServerConnector Started ServerConnector@951a58{HTTP/1.1}{127.0.0.1:36653}
    [junit4] 2> 765636 INFO (TEST-BasicAuthIntegrationTest.testBasics-seed#[995253744E9FA0EF]) [ ] o.e.j.s.Server Started @767889ms
    [junit4] 2> 765636 INFO (TEST-BasicAuthIntegrationTest.testBasics-seed#[995253744E9FA0EF]) [ ] o.a.s.c.s.e.JettySolrRunner Jetty properties: {hostPort=36653, hostContext=/solr}
    [junit4] 2> 765636 INFO (TEST-BasicAuthIntegrationTest.testBasics-seed#[995253744E9FA0EF]) [ ] o.a.s.s.SolrDispatchFilter SolrDispatchFilter.init(): sun.misc.Launcher$AppClassLoader@327236
    [junit4] 2> 765636 INFO (TEST-BasicAuthIntegrationTest.testBasics-seed#[995253744E9FA0EF]) [ ] o.a.s.c.SolrResourceLoader new SolrResourceLoader for directory: '/home/jenkins/workspace/Lucene-Solr-5.5-Linux/solr/build/solr-core/test/J1/temp/solr.security.BasicAuthIntegrationTest_995253744E9FA0EF-001/tempDir-001/node6'
    [junit4] 2> 765637 INFO (TEST-BasicAuthIntegrationTest.testBasics-seed#[995253744E9FA0EF]) [ ] o.a.s.c.SolrResourceLoader JNDI not configured for solr (NoInitialContextEx)
    [junit4] 2> 765637 INFO (TEST-BasicAuthIntegrationTest.testBasics-seed#[995253744E9FA0EF]) [ ] o.a.s.c.SolrResourceLoader solr home defaulted to 'solr/' (could not find system property or JNDI)
    [junit4] 2> 765637 INFO (TEST-BasicAuthIntegrationTest.testBasics-seed#[995253744E9FA0EF]) [ ] o.a.s.c.c.SolrZkClient Using default ZkCredentialsProvider
    [junit4] 2> 765638 INFO (TEST-BasicAuthIntegrationTest.testBasics-seed#[995253744E9FA0EF]) [ ] o.a.s.c.c.ConnectionManager Waiting for client to connect to ZooKeeper
    [junit4] 2> 765640 INFO (zkCallback-566-thread-1) [ ] o.a.s.c.c.ConnectionManager Watcher org.apache.solr.common.cloud.ConnectionManager@b8ad7 name:ZooKeeperConnection Watcher:127.0.0.1:37916/solr got event WatchedEvent state:SyncConnected type:None path:null path:null type:None
    [junit4] 2> 765640 INFO (TEST-BasicAuthIntegrationTest.testBasics-seed#[995253744E9FA0EF]) [ ] o.a.s.c.c.ConnectionManager Client is connected to ZooKeeper
    [junit4] 2> 765640 INFO (TEST-BasicAuthIntegrationTest.testBasics-seed#[995253744E9FA0EF]) [ ] o.a.s.c.c.SolrZkClient Using default ZkACLProvider
    [junit4] 2> 765640 INFO (TEST-BasicAuthIntegrationTest.testBasics-seed#[995253744E9FA0EF]) [ ] o.a.s.s.SolrDispatchFilter solr.xml found in ZooKeeper. Loading...
    [junit4] 2> 765650 INFO (TEST-BasicAuthIntegrationTest.testBasics-seed#[995253744E9FA0EF]) [ ] o.a.s.c.CorePropertiesLocator Config-defined core root directory: /home/jenkins/workspace/Lucene-Solr-5.5-Linux/solr/build/solr-core/test/J1/temp/solr.security.BasicAuthIntegrationTest_995253744E9FA0EF-001/tempDir-001/node6/.
    [junit4] 2> 765651 INFO (TEST-BasicAuthIntegrationTest.testBasics-seed#[995253744E9FA0EF]) [ ] o.a.s.c.CoreContainer New CoreContainer 5027407
    [junit4] 2> 765651 INFO (TEST-BasicAuthIntegrationTest.testBasics-seed#[995253744E9FA0EF]) [ ] o.a.s.c.CoreContainer Loading cores into CoreContainer [instanceDir=/home/jenkins/workspace/Lucene-Solr-5.5-Linux/solr/build/solr-core/test/J1/temp/solr.security.BasicAuthIntegrationTest_995253744E9FA0EF-001/tempDir-001/node6]
    [junit4] 2> 765651 WARN (TEST-BasicAuthIntegrationTest.testBasics-seed#[995253744E9FA0EF]) [ ] o.a.s.c.CoreContainer Couldn't add files from /home/jenkins/workspace/Lucene-Solr-5.5-Linux/solr/build/solr-core/test/J1/temp/solr.security.BasicAuthIntegrationTest_995253744E9FA0EF-001/tempDir-001/node6/lib to classpath: /home/jenkins/workspace/Lucene-Solr-5.5-Linux/solr/build/solr-core/test/J1/temp/solr.security.BasicAuthIntegrationTest_995253744E9FA0EF-001/tempDir-001/node6/lib
    [junit4] 2> 765651 INFO (TEST-BasicAuthIntegrationTest.testBasics-seed#[995253744E9FA0EF]) [ ] o.a.s.h.c.HttpShardHandlerFactory created with socketTimeout : 90000,urlScheme : ,connTimeout : 15000,maxConnectionsPerHost : 20,maxConnections : 10000,corePoolSize : 0,maximumPoolSize : 2147483647,maxThreadIdleTime : 5,sizeOfQueue : -1,fairnessPolicy : false,useRetries : false,
    [junit4] 2> 765652 INFO (TEST-BasicAuthIntegrationTest.testBasics-seed#[995253744E9FA0EF]) [ ] o.a.s.u.UpdateShardHandler Creating UpdateShardHandler HTTP client with params: socketTimeout=340000&connTimeout=45000&retry=true
    [junit4] 2> 765652 INFO (TEST-BasicAuthIntegrationTest.testBasics-seed#[995253744E9FA0EF]) [ ] o.a.s.l.LogWatcher SLF4J impl is org.slf4j.impl.Log4jLoggerFactory
    [junit4] 2> 765652 INFO (TEST-BasicAuthIntegrationTest.testBasics-seed#[995253744E9FA0EF]) [ ] o.a.s.l.LogWatcher Registering Log Listener [Log4j (org.slf4j.impl.Log4jLoggerFactory)]
    [junit4] 2> 765652 INFO (TEST-BasicAuthIntegrationTest.testBasics-seed#[995253744E9FA0EF]) [ ] o.a.s.c.ZkContainer Zookeeper client=127.0.0.1:37916/solr
    [junit4] 2> 765652 INFO (TEST-BasicAuthIntegrationTest.testBasics-seed#[995253744E9FA0EF]) [ ] o.a.s.c.ZkController zkHost includes chroot
    [junit4] 2> 765652 INFO (TEST-BasicAuthIntegrationTest.testBasics-seed#[995253744E9FA0EF]) [ ] o.a.s.c.c.SolrZkClient Using default ZkCredentialsProvider
    [junit4] 2> 765652 INFO (TEST-BasicAuthIntegrationTest.testBasics-seed#[995253744E9FA0EF]) [ ] o.a.s.c.c.ConnectionManager Waiting for client to connect to ZooKeeper
    [junit4] 2> 765656 INFO (zkCallback-569-thread-1) [ ] o.a.s.c.c.ConnectionManager Watcher org.apache.solr.common.cloud.ConnectionManager@1b20f6b name:ZooKeeperConnection Watcher:127.0.0.1:37916 got event WatchedEvent state:SyncConnected type:None path:null path:null type:None
    [junit4] 2> 765656 INFO (TEST-BasicAuthIntegrationTest.testBasics-seed#[995253744E9FA0EF]) [ ] o.a.s.c.c.ConnectionManager Client is connected to ZooKeeper
    [junit4] 2> 765656 INFO (TEST-BasicAuthIntegrationTest.testBasics-seed#[995253744E9FA0EF]) [ ] o.a.s.c.c.SolrZkClient Using default ZkACLProvider
    [junit4] 2> 765658 INFO (TEST-BasicAuthIntegrationTest.testBasics-seed#[995253744E9FA0EF]) [n:127.0.0.1:36653_solr ] o.a.s.c.ZkController Added new OnReconnect listener org.apache.solr.cloud.ZkController$6@383b53
    [junit4] 2> 765659 INFO (TEST-BasicAuthIntegrationTest.testBasics-seed#[995253744E9FA0EF]) [n:127.0.0.1:36653_solr ] o.a.s.c.c.ConnectionManager Waiting for client to connect to ZooKeeper
    [junit4] 2> 765661 INFO (zkCallback-570-thread-1-processing-n:127.0.0.1:36653_solr) [n:127.0.0.1:36653_solr ] o.a.s.c.c.ConnectionManager Watcher org.apache.solr.common.cloud.ConnectionManager@a26cd5 name:ZooKeeperConnection Watcher:127.0.0.1:37916/solr got event WatchedEvent state:SyncConnected type:None path:null path:null type:None
    [junit4] 2> 765661 INFO (TEST-BasicAuthIntegrationTest.testBasics-seed#[995253744E9FA0EF]) [n:127.0.0.1:36653_solr ] o.a.s.c.c.ConnectionManager Client is connected to ZooKeeper
    [junit4] 2> 765696 INFO (TEST-BasicAuthIntegrationTest.testBasics-seed#[995253744E9FA0EF]) [n:127.0.0.1:36653_solr ] o.a.s.c.c.ZkStateReader Updating cluster state from ZooKeeper...
    [junit4] 2> 766698 INFO (TEST-BasicAuthIntegrationTest.testBasics-seed#[995253744E9FA0EF]) [n:127.0.0.1:36653_solr ] o.a.s.c.ZkController Register node as live in ZooKeeper:/live_nodes/127.0.0.1:36653_solr
    [junit4] 2> 766709 INFO (TEST-BasicAuthIntegrationTest.testBasics-seed#[995253744E9FA0EF]) [n:127.0.0.1:36653_solr ] o.a.s.c.c.SolrZkClient makePath: /live_nodes/127.0.0.1:36653_solr
    [junit4] 2> 766718 INFO (zkCallback-553-thread-1-processing-n:127.0.0.1:40825_solr) [n:127.0.0.1:40825_solr ] o.a.s.c.c.ZkStateReader A live node change: [WatchedEvent state:SyncConnected type:NodeChildrenChanged path:/live_nodes], has occurred - updating... (live nodes size: [4])
    [junit4] 2> 766718 INFO (zkCallback-555-thread-1-processing-n:127.0.0.1:35326_solr) [n:127.0.0.1:35326_solr ] o.a.s.c.c.ZkStateReader A live node change: [WatchedEvent state:SyncConnected type:NodeChildrenChanged path:/live_nodes], has occurred - updating... (live nodes size: [4])
    [junit4] 2> 766718 INFO (zkCallback-563-thread-1-processing-n:127.0.0.1:44214_solr) [n:127.0.0.1:44214_solr ] o.a.s.c.c.ZkStateReader A live node change: [WatchedEvent state:SyncConnected type:NodeChildrenChanged path:/live_nodes], has occurred - updating... (live nodes size: [4])
    [junit4] 2> 766718 INFO (zkCallback-570-thread-1-processing-n:127.0.0.1:36653_solr) [n:127.0.0.1:36653_solr ] o.a.s.c.c.ZkStateReader A live node change: [WatchedEvent state:SyncConnected type:NodeChildrenChanged path:/live_nodes], has occurred - updating... (live nodes size: [4])
    [junit4] 2> 766718 INFO (zkCallback-554-thread-1-processing-n:127.0.0.1:45665_solr) [n:127.0.0.1:45665_solr ] o.a.s.c.c.ZkStateReader A live node change: [WatchedEvent state:SyncConnected type:NodeChildrenChanged path:/live_nodes], has occurred - updating... (live nodes size: [4])
    [junit4] 2> 766719 INFO (TEST-BasicAuthIntegrationTest.testBasics-seed#[995253744E9FA0EF]) [n:127.0.0.1:36653_solr ] o.a.s.c.Overseer Overseer (id=null) closing
    [junit4] 2> 766721 INFO (TEST-BasicAuthIntegrationTest.testBasics-seed#[995253744E9FA0EF]) [n:127.0.0.1:36653_solr ] o.a.s.c.LeaderElector Joined leadership election with path: /overseer_elect/election/96089581749665811-127.0.0.1:36653_solr-n_0000000005
    [junit4] 2> 766721 INFO (TEST-BasicAuthIntegrationTest.testBasics-seed#[995253744E9FA0EF]) [n:127.0.0.1:36653_solr ] o.a.s.c.LeaderElector Watching path /overseer_elect/election/96089581749665802-127.0.0.1:45665_solr-n_0000000004 to know if I could be the leader
    [junit4] 2> 766749 INFO (TEST-BasicAuthIntegrationTest.testBasics-seed#[995253744E9FA0EF]) [n:127.0.0.1:36653_solr ] o.a.s.c.CoreContainer Security conf doesn't exist. Skipping setup for authorization module.
    [junit4] 2> 766749 INFO (TEST-BasicAuthIntegrationTest.testBasics-seed#[995253744E9FA0EF]) [n:127.0.0.1:36653_solr ] o.a.s.c.CoreContainer No authentication plugin used.
    [junit4] 2> 766750 INFO (TEST-BasicAuthIntegrationTest.testBasics-seed#[995253744E9FA0EF]) [n:127.0.0.1:36653_solr ] o.a.s.c.CorePropertiesLocator Looking for core definitions underneath /home/jenkins/workspace/Lucene-Solr-5.5-Linux/solr/build/solr-core/test/J1/temp/solr.security.BasicAuthIntegrationTest_995253744E9FA0EF-001/tempDir-001/node6/.
    [junit4] 2> 766750 INFO (TEST-BasicAuthIntegrationTest.testBasics-seed#[995253744E9FA0EF]) [n:127.0.0.1:36653_solr ] o.a.s.c.CorePropertiesLocator Found 0 core definitions
    [junit4] 2> 766751 INFO (TEST-BasicAuthIntegrationTest.testBasics-seed#[995253744E9FA0EF]) [n:127.0.0.1:36653_solr ] o.a.s.s.SolrDispatchFilter user.dir=/home/jenkins/workspace/Lucene-Solr-5.5-Linux/solr/build/solr-core/test/J1
    [junit4] 2> 766751 INFO (TEST-BasicAuthIntegrationTest.testBasics-seed#[995253744E9FA0EF]) [n:127.0.0.1:36653_solr ] o.a.s.s.SolrDispatchFilter SolrDispatchFilter.init() done
    [junit4] 2> 766751 INFO (TEST-BasicAuthIntegrationTest.testBasics-seed#[995253744E9FA0EF]) [ ] o.a.s.c.c.SolrZkClient Using default ZkCredentialsProvider
    [junit4] 2> 766752 INFO (TEST-BasicAuthIntegrationTest.testBasics-seed#[995253744E9FA0EF]) [ ] o.a.s.c.c.ConnectionManager Waiting for client to connect to ZooKeeper
    [junit4] 2> 766754 INFO (zkCallback-571-thread-1) [ ] o.a.s.c.c.ConnectionManager Watcher org.apache.solr.common.cloud.ConnectionManager@1da62d4 name:ZooKeeperConnection Watcher:127.0.0.1:37916/solr got event WatchedEvent state:SyncConnected type:None path:null path:null type:None
    [junit4] 2> 766754 INFO (TEST-BasicAuthIntegrationTest.testBasics-seed#[995253744E9FA0EF]) [ ] o.a.s.c.c.ConnectionManager Client is connected to ZooKeeper
    [junit4] 2> 766754 INFO (TEST-BasicAuthIntegrationTest.testBasics-seed#[995253744E9FA0EF]) [ ] o.a.s.c.c.SolrZkClient Using default ZkACLProvider
    [junit4] 2> 766756 INFO (TEST-BasicAuthIntegrationTest.testBasics-seed#[995253744E9FA0EF]) [ ] o.a.s.c.c.SolrZkClient makePath: /configs/solrCloudCollectionConfig/protwords.txt
    [junit4] 2> 766785 INFO (TEST-BasicAuthIntegrationTest.testBasics-seed#[995253744E9FA0EF]) [ ] o.a.s.c.c.SolrZkClient makePath: /configs/solrCloudCollectionConfig/solrconfig-delaying-component.xml
    [junit4] 2> 766787 INFO (TEST-BasicAuthIntegrationTest.testBasics-seed#[995253744E9FA0EF]) [ ] o.a.s.c.c.SolrZkClient makePath: /configs/solrCloudCollectionConfig/bad_solrconfig.xml
    [junit4] 2> 766789 INFO (TEST-BasicAuthIntegrationTest.testBasics-seed#[995253744E9FA0EF]) [ ] o.a.s.c.c.SolrZkClient makePath: /configs/solrCloudCollectionConfig/solrconfig-nocache.xml
    [junit4] 2> 766801 INFO (TEST-BasicAuthIntegrationTest.testBasics-seed#[995253744E9FA0EF]) [ ] o.a.s.c.c.SolrZkClient makePath: /configs/solrCloudCollectionConfig/solrconfig-implicitproperties.xml
    [junit4] 2> 766806 INFO (TEST-BasicAuthIntegrationTest.testBasics-seed#[995253744E9FA0EF]) [ ] o.a.s.c.c.SolrZkClient makePath: /configs/solrCloudCollectionConfig/solrconfig-mergepolicy-legacy.xml
    [junit4] 2> 766809 INFO (TEST-BasicAuthIntegrationTest.testBasics-seed#[995253744E9FA0EF]) [ ] o.a.s.c.c.SolrZkClient makePath: /configs/solrCloudCollectionConfig/bad-schema-uniquekey-uses-default.xml
    [junit4] 2> 766811 INFO (TEST-BasicAuthIntegrationTest.testBasics-seed#[995253744E9FA0EF]) [ ] o.a.s.c.c.SolrZkClient makePath: /configs/solrCloudCollectionConfig/bad-schema-sim-default-has-no-explicit-sim.xml
    [junit4] 2> 766822 INFO (TEST-BasicAuthIntegrationTest.testBasics-seed#[995253744E9FA0EF]) [ ] o.a.s.c.c.SolrZkClient makePath: /configs/solrCloudCollectionConfig/bad-schema-uniquekey-multivalued.xml
    [junit4] 2> 766825 INFO (TEST-BasicAuthIntegrationTest.testBasics-seed#[995253744E9FA0EF]) [ ] o.a.s.c.c.SolrZkClient makePath: /configs/solrCloudCollectionConfig/analyzingInfixSuggest.txt
    [junit4] 2> 766827 INFO (TEST-BasicAuthIntegrationTest.testBasics-seed#[995253744E9FA0EF]) [ ] o.a.s.c.c.SolrZkClient makePath: /configs/solrCloudCollectionConfig/missleading.extension.updateprocessor.js.txt
    [junit4] 2> 766829 INFO (TEST-BasicAuthIntegrationTest.testBasics-seed#[995253744E9FA0EF]) [ ] o.a.s.c.c.SolrZkClient makePath: /configs/solrCloudCollectionConfig/bad-schema-multiple-asterisk-copyfield-source-should-fail-test.xml
    [junit4] 2> 766841 INFO (TEST-BasicAuthIntegrationTest.testBasics-seed#[995253744E9FA0EF]) [ ] o.a.s.c.c.SolrZkClient makePath: /configs/solrCloudCollectionConfig/schema-replication2.xml
    [junit4] 2> 766844 INFO (TEST-BasicAuthIntegrationTest.testBasics-seed#[995253744E9FA0EF]) [ ] o.a.s.c.c.SolrZkClient makePath: /configs/solrCloudCollectionConfig/solrconfig-infostream-logging.xml
    [junit4] 2> 766846 INFO (TEST-BasicAuthIntegrationTest.testBasics-seed#[995253744E9FA0EF]) [ ] o.a.s.c.c.SolrZkClient makePath: /configs/solrCloudCollectionConfig/solrconfig-collapseqparser.xml
    [junit4] 2> 766852 INFO (TEST-BasicAuthIntegrationTest.testBasics-seed#[995253744E9FA0EF]) [ ] o.a.s.c.c.SolrZkClient makePath: /configs/solrCloudCollectionConfig/bad-schema-currency-ft-bogus-code-in-xml.xml
    [junit4] 2> 766855 INFO (TEST-BasicAuthIntegrationTest.testBasics-seed#[995253744E9FA0EF]) [ ] o.a.s.c.c.SolrZkClient makePath: /configs/solrCloudCollectionConfig/old_synonyms.txt
    [junit4] 2> 766858 INFO (TEST-BasicAuthIntegrationTest.testBasics-seed#[995253744E9FA0EF]) [ ] o.a.s.c.c.SolrZkClient makePath: /configs/solrCloudCollectionConfig/enumsConfig.xml
    [junit4] 2> 766864 INFO (TEST-BasicAuthIntegrationTest.testBasics-seed#[995253744E9FA0EF]) [ ] o.a.s.c.c.SolrZkClient makePath: /configs/solrCloudCollectionConfig/solrconfig-script-updateprocessor.xml
    [junit4] 2> 766880 INFO (TEST-BasicAuthIntegrationTest.testBasics-seed#[995253744E9FA0EF]) [ ] o.a.s.c.c.SolrZkClient makePath: /configs/solrCloudCollectionConfig/schema-add-schema-fields-update-processor.xml
    [junit4] 2> 766895 INFO (TEST-BasicAuthIntegrationTest.testBasics-seed#[995253744E9FA0EF]) [ ] o.a.s.c.c.SolrZkClient makePath: /configs/solrCloudCollectionConfig/solrconfig-mergepolicyfactory-nocfs.xml
    [junit4] 2> 766898 INFO (TEST-BasicAuthIntegrationTest.testBasics-seed#[995253744E9FA0EF]) [ ] o.a.s.c.c.SolrZkClient makePath: /configs/solrCloudCollectionConfig/bad-schema-sweetspot-both-tf.xml
    [junit4] 2> 766916 INFO (TEST-BasicAuthIntegrationTest.testBasics-seed#[995253744E9FA0EF]) [ ] o.a.s.c.c.SolrZkClient makePath: /configs/solrCloudCollectionConfig/schema-phrasesuggest.xml
    [junit4] 2> 766919 INFO (TEST-BasicAuthIntegrationTest.testBasics-seed#[995253744E9FA0EF]) [ ] o.a.s.c.c.SolrZkClient makePath: /configs/solrCloudCollectionConfig/solrconfig.xml
    [junit4] 2> 766938 INFO (TEST-BasicAuthIntegrationTest.testBasics-seed#[995253744E9FA0EF]) [ ] o.a.s.c.c.SolrZkClient makePath: /configs/solrCloudCollectionConfig/solrconfig-delpolicy1.xml
    [junit4] 2> 766940 INFO (TEST-BasicAuthIntegrationTest.testBasics-seed#[995253744E9FA0EF]) [ ] o.a.s.c.c.SolrZkClient makePath: /configs/solrCloudCollectionConfig/schema-sim.xml
    [junit4] 2> 766973 INFO (TEST-BasicAuthIntegrationTest.testBasics-seed#[995253744E9FA0EF]) [ ] o.a.s.c.c.SolrZkClient makePath: /configs/solrCloudCollectionConfig/schema15.xml
    [junit4] 2> 767006 INFO (TEST-BasicAuthIntegrationTest.testBasics-seed#[995253744E9FA0EF]) [ ] o.a.s.c.c.SolrZkClient makePath: /configs/solrCloudCollectionConfig/bad-schema-misplaced-asterisk-copyfield-source-should-fail-test.xml
    [junit4] 2> 767009 INFO (TEST-BasicAuthIntegrationTest.testBasics-seed#[995253744E9FA0EF]) [ ] o.a.s.c.c.SolrZkClient makePath: /configs/solrCloudCollectionConfig/stemdict.txt
    [junit4] 2> 767014 INFO (TEST-BasicAuthIntegrationTest.testBasics-seed#[995253744E9FA0EF]) [ ] o.a.s.c.c.SolrZkClient makePath: /configs/solrCloudCollectionConfig/hunspell-test.aff
    [junit4] 2> 767017 INFO (TEST-BasicAuthIntegrationTest.testBasics-seed#[995253744E9FA0EF]) [ ] o.a.s.c.c.SolrZkClient makePath: /configs/solrCloudCollectionConfig/solrconfig-spatial.xml
    [junit4] 2> 767019 INFO (TEST-BasicAuthIntegrationTest.testBasics-seed#[995253744E9FA0EF]) [ ] o.a.s.c.c.SolrZkClient makePath: /configs/solrCloudCollectionConfig/solrconfig-slave1.xml
    [junit4] 2> 767025 INFO (TEST-BasicAuthIntegrationTest.testBasics-seed#[995253744E9FA0EF]) [ ] o.a.s.c.c.SolrZkClient makePath: /configs/solrCloudCollectionConfig/bad-schema-dup-fieldType.xml
    [junit4] 2> 767027 INFO (TEST-BasicAuthIntegrationTest.testBasics-seed#[995253744E9FA0EF]) [ ] o.a.s.c.c.SolrZkClient makePath: /configs/solrCloudCollectionConfig/bad-schema-external-filefield.xml
    [junit4] 2> 767029 INFO (TEST-BasicAuthIntegrationTest.testBasics-seed#[995253744E9FA0EF]) [ ] o.a.s.c.c.SolrZkClient makePath: /configs/solrCloudCollectionConfig/solrconfig-query-parser-init.xml
    [junit4] 2> 767035 INFO (TEST-BasicAuthIntegrationTest.testBasics-seed#[995253744E9FA0EF]) [ ] o.a.s.c.c.SolrZkClient makePath: /configs/solrCloudCollectionConfig/schema-complex-phrase.xml
    [junit4] 2> 767037 INFO (TEST-BasicAuthIntegrationTest.testBasics-seed#[995253744E9FA0EF]) [ ] o.a.s.c.c.SolrZkClient makePath: /configs/solrCloudCollectionConfig/conditional.updateprocessor.js
    [junit4] 2> 767040 INFO (TEST-BasicAuthIntegrationTest.testBasics-seed#[995253744E9FA0EF]) [ ] o.a.s.c.c.SolrZkClient makePath: /configs/solrCloudCollectionConfig/bad-schema-analyzer-class-and-nested.xml
    [junit4] 2> 767045 INFO (TEST-BasicAuthIntegrationTest.testBasics-seed#[995253744E9FA0EF]) [ ] o.a.s.c.c.SolrZkClient makePath: /configs/solrCloudCollectionConfig/solrconfig-returnfields.xml
    [junit4] 2> 767067 INFO (TEST-BasicAuthIntegrationTest.testBasics-seed#[995253744E9FA0EF]) [ ] o.a.s.c.c.SolrZkClient makePath: /configs/solrCloudCollectionConfig/schema-eff.xml
    [junit4] 2> 767073 INFO (TEST-BasicAuthIntegrationTest.testBasics-seed#[995253744E9FA0EF]) [ ] o.a.s.c.c.SolrZkClient makePath: /configs/solrCloudCollectionConfig/schema-folding.xml
    [junit4] 2> 767085 INFO (TEST-BasicAuthIntegrationTest.testBasics-seed#[995253744E9FA0EF]) [ ] o.a.s.c.c.SolrZkClient makePath: /configs/solrCloudCollectionConfig/solrconfig-tieredmergepolicyfactory.xml
    [junit4] 2> 767097 INFO (TEST-BasicAuthIntegrationTest.testBasics-seed#[995253744E9FA0EF]) [ ] o.a.s.c.c.SolrZkClient makePath: /configs/solrCloudCollectionConfig/schema-simpleqpplugin.xml
    [junit4] 2> 767102 INFO (TEST-BasicAuthIntegrationTest.testBasics-seed#[995253744E9FA0EF]) [ ] o.a.s.c.c.SolrZkClient makePath: /configs/solrCloudCollectionConfig/solrconfig-hash.xml
    [junit4] 2> 767105 INFO (TEST-BasicAuthIntegrationTest.testBasics-seed#[995253744E9FA0EF]) [ ] o.a.s.c.c.SolrZkClient makePath: /configs/solrCloudCollectionConfig/stopwords.txt
    [junit4] 2> 767107 INFO (TEST-BasicAuthIntegrationTest.testBasics-seed#[995253744E9FA0EF]) [ ] o.a.s.c.c.SolrZkClient makePath: /configs/solrCloudCollectionConfig/bad-schema-dynamicfield-required.xml
    [junit4] 2> 767125 INFO (TEST-BasicAuthIntegrationTest.testBasics-seed#[995253744E9FA0EF]) [ ] o.a.s.c.c.SolrZkClient makePath: /configs/solrCloudCollectionConfig/solrconfig-mergepolicy-nocfs.xml
    [junit4] 2> 767140 INFO (TEST-BasicAuthIntegrationTest.testBasics-seed#[995253744E9FA0EF]) [ ] o.a.s.c.c.SolrZkClient makePath: /configs/solrCloudCollectionConfig/bad-solrconfig-bogus-scriptengine-name.xml
    [junit4] 2> 767155 INFO (TEST-BasicAuthIntegrationTest.testBasics-seed#[995253744E9FA0EF]) [ ] o.a.s.c.c.SolrZkClient makePath: /configs/solrCloudCollectionConfig/throw.error.on.add.updateprocessor.js
    [junit4] 2> 767161 INFO (TEST-BasicAuthIntegrationTest.testBasics-seed#[995253744E9FA0EF]) [ ] o.a.s.c.c.SolrZkClient makePath: /configs/solrCloudCollectionConfig/solrconfig-minimal.xml
    [junit4] 2> 767163 INFO (TEST-BasicAuthIntegrationTest.testBasics-seed#[995253744E9FA0EF]) [ ] o.a.s.c.c.SolrZkClient makePath: /configs/solrCloudCollectionConfig/solrconfig-defaults.xml
    [junit4] 2> 767168 INFO (TEST-BasicAuthIntegrationTest.testBasics-seed#[995253744E9FA0EF]) [ ] o.a.s.c.c.SolrZkClient makePath: /configs/solrCloudCollectionConfig/blendedInfixSuggest.txt
    [junit4] 2> 767171 INFO (TEST-BasicAuthIntegrationTest.testBasics-seed#[995253744E9FA0EF]) [ ] o.a.s.c.c.SolrZkClient makePath: /configs/solrCloudCollectionConfig/solrconfig-postingshighlight.xml
    [junit4] 2> 767173 INFO (TEST-BasicAuthIntegrationTest.testBasics-seed#[995253744E9FA0EF]) [ ] o.a.s.c.c.SolrZkClient makePath: /configs/solrCloudCollectionConfig/schema-docValuesJoin.xml
    [junit4] 2> 767178 INFO (TEST-BasicAuthIntegrationTest.testBasics-seed#[995253744E9FA0EF]) [ ] o.a.s.c.c.SolrZkClient makePath: /configs/solrCloudCollectionConfig/schema-docValues.xml
    [junit4] 2> 767184 INFO (TEST-BasicAuthIntegrationTest.testBasics-seed#[995253744E9FA0EF]) [ ] o.a.s.c.c.SolrZkClient makePath: /configs/solrCloudCollectionConfig/bad-schema-misplaced-asterisk-copyfield-dest-should-fail-test.xml
    [junit4] 2> 767186 INFO (TEST-BasicAuthIntegrationTest.testBasics-seed#[995253744E9FA0EF]) [ ] o.a.s.c.c.SolrZkClient makePath: /configs/solrCloudCollectionConfig/schema-snippet-types.incl
    [junit4] 2> 767188 INFO (TEST-BasicAuthIntegrationTest.testBasics-seed#[995253744E9FA0EF]) [ ] o.a.s.c.c.SolrZkClient makePath: /configs/solrCloudCollectionConfig/schema-minimal.xml
    [junit4] 2> 767194 INFO (TEST-BasicAuthIntegrationTest.testBasics-seed#[995253744E9FA0EF]) [ ] o.a.s.c.c.SolrZkClient makePath: /configs/solrCloudCollectionConfig/solrconfig.snippet.randomindexconfig.xml
    [junit4] 2> 767197 INFO (TEST-BasicAuthIntegrationTest.testBasics-seed#[995253744E9FA0EF]) [ ] o.a.s.c.c.SolrZkClient makePath: /configs/solrCloudCollectionConfig/schema-collate.xml
    [junit4] 2> 767202 INFO (TEST-BasicAuthIntegrationTest.testBasics-seed#[995253744E9FA0EF]) [ ] o.a.s.c.c.SolrZkClient makePath: /configs/solrCloudCollectionConfig/schema-rest.xml
    [junit4] 2> 767218 INFO (TEST-BasicAuthIntegrationTest.testBasics-seed#[995253744E9FA0EF]) [ ] o.a.s.c.c.SolrZkClient makePath: /configs/solrCloudCollectionConfig/bad-schema-codec-global-vs-ft-mismatch.xml
    [junit4] 2> 767221 INFO (TEST-BasicAuthIntegrationTest.testBasics-seed#[995253744E9FA0EF]) [ ] o.a.s.c.c.SolrZkClient makePath: /configs/solrCloudCollectionConfig/bad-schema-not-indexed-but-norms.xml
    [junit4] 2> 767237 INFO (TEST-BasicAuthIntegrationTest.testBasics-seed#[995253744E9FA0EF]) [ ] o.a.s.c.c.SolrZkClient makePath: /configs/solrCloudCollectionConfig/phrasesuggest.txt
    [junit4] 2> 767239 INFO (TEST-BasicAuthIntegrationTest.testBasics-seed#[995253744E9FA0EF]) [ ] o.a.s.c.c.SolrZkClient makePath: /configs/solrCloudCollectionConfig/stopwordsWrongEncoding.txt
    [junit4] 2> 767242 INFO (TEST-BasicAuthIntegrationTest.testBasics-seed#[995253744E9FA0EF]) [ ] o.a.s.c.c.SolrZkClient makePath: /configs/solrCloudCollectionConfig/solrconfig-logmergepolicy.xml
    [junit4] 2> 767244 INFO (TEST-BasicAuthIntegrationTest.testBasics-seed#[995253744E9FA0EF]) [ ] o.a.s.c.c.SolrZkClient makePath: /configs/solrCloudCollectionConfig/solrconfig-plugcollector.xml
    [junit4] 2> 767266 INFO (TEST-BasicAuthIntegrationTest.testBasics-seed#[995253744E9FA0EF]) [ ] o.a.s.c.c.SolrZkClient makePath: /configs/solrCloudCollectionConfig/solrconfig-noopregen.xml
    [junit4] 2> 767269 INFO (TEST-BasicAuthIntegrationTest.testBasics-seed#[995253744E9FA0EF]) [ ] o.a.s.c.c.SolrZkClient makePath: /configs/solrCloudCollectionConfig/solrconfig-analytics-query.xml
    [junit4] 2> 767275 INFO (TEST-BasicAuthIntegrationTest.testBasics-seed#[995253744E9FA0EF]) [ ] o.a.s.c.c.SolrZkClient makePath: /configs/solrCloudCollectionConfig/stoptypes-1.txt
    [junit4] 2> 767287 INFO (TEST-BasicAuthIntegrationTest.testBasics-seed#[995253744E9FA0EF]) [ ] o.a.s.c.c.SolrZkClient makePath: /configs/solrCloudCollectionConfig/solrconfig-warmer-randommergepolicyfactory.xml
    [junit4] 2> 767290 INFO (TEST-BasicAuthIntegrationTest.testBasics-seed#[995253744E9FA0EF]) [ ] o.a.s.c.c.SolrZkClient makePath: /configs/solrCloudCollectionConfig/schema-spatial.xml
    [junit4] 2> 767295 INFO (TEST-BasicAuthIntegrationTest.testBasics-seed#[995253744E9FA0EF]) [ ] o.a.s.c.c.SolrZkClient makePath: /configs/solrCloudCollectionConfig/schema-spellchecker.xml
    [junit4] 2> 767307 INFO (TEST-BasicAuthIntegrationTest.testBasics-seed#[995253744E9FA0EF]) [ ] o.a.s.c.c.SolrZkClient makePath: /configs/solrCloudCollectionConfig/schema-non-stored-docvalues.xml
    [junit4] 2> 767319 INFO (TEST-BasicAuthIntegrationTest.testBasics-seed#[995253744E9FA0EF]) [ ] o.a.s.c.c.SolrZkClient makePath: /configs/solrCloudCollectionConfig/schema-distrib-interval-faceting.xml
    [junit4] 2> 767334 INFO (TEST-BasicAuthIntegrationTest.testBasics-seed#[995253744E9FA0EF]) [ ] o.a.s.c.c.SolrZkClient makePath: /configs/solrCloudCollectionConfig/stop-1.txt
    [junit4] 2> 767347 INFO (TEST-BasicAuthIntegrationTest.testBasics-seed#[995253744E9FA0EF]) [ ] o.a.s.c.c.SolrZkClient makePath: /configs/solrCloudCollectionConfig/schema-docValuesMissing.xml
    [junit4] 2> 767366 INFO (TEST-BasicAuthIntegrationTest.testBasics-seed#[995253744E9FA0EF]) [ ] o.a.s.c.c.SolrZkClient makePath: /configs/solrCloudCollectionConfig/solrconfig-caching.xml
    [junit4] 2> 767368 INFO (TEST-BasicAuthIntegrationTest.testBasics-seed#[995253744E9FA0EF]) [ ] o.a.s.c.c.SolrZkClient makePath: /configs/solrCloudCollectionConfig/solrconfig-doctransformers.xml
    [junit4] 2> 767374 INFO (TEST-BasicAuthIntegrationTest.testBasics-seed#[995253744E9FA0EF]) [ ] o.a.s.c.c.SolrZkClient makePath: /configs/solrCloudCollectionConfig/freeTextSuggest.txt
    [junit4] 2> 767376 INFO (TEST-BasicAuthIntegrationTest.testBasics-seed#[995253744E9FA0EF]) [ ] o.a.s.c.c.SolrZkClient makePath: /configs/solrCloudCollectionConfig/schema.xml
    [junit4] 2> 767395 INFO (TEST-BasicAuthIntegrationTest.testBasics-seed#[995253744E9FA0EF]) [ ] o.a.s.c.c.SolrZkClient makePath: /configs/solrCloudCollectionConfig/solrconfig-querysender-noquery.xml
    [junit4] 2> 767408 INFO (TEST-BasicAuthIntegrationTest.testBasics-seed#[995253744E9FA0EF]) [ ] o.a.s.c.c.SolrZkClient makePath: /configs/solrCloudCollectionConfig/schema-sortingresponse.xml
    [junit4] 2> 767410 INFO (TEST-BasicAuthIntegrationTest.testBasics-seed#[995253744E9FA0EF]) [ ] o.a.s.c.c.SolrZkClient makePath: /configs/solrCloudCollectionConfig/trivial.updateprocessor1.js
    [junit4] 2> 767415 INFO (TEST-BasicAuthIntegrationTest.testBasics-seed#[995253744E9FA0EF]) [ ] o.a.s.c.c.SolrZkClient makePath: /configs/solrCloudCollectionConfig/bad-solrconfig-managed-schema-named-schema.xml.xml
    [junit4] 2> 767417 INFO (TEST-BasicAuthIntegrationTest.testBasics-seed#[995253744E9FA0EF]) [ ] o.a.s.c.c.SolrZkClient makePath: /configs/solrCloudCollectionConfig/solrconfig-paramset.xml
    [junit4] 2> 767423 INFO (TEST-BasicAuthIntegrationTest.testBasics-seed#[995253744E9FA0EF]) [ ] o.a.s.c.c.SolrZkClient makePath: /configs/solrCloudCollectionConfig/schema-lmdirichlet.xml
    [junit4] 2> 767432 INFO (TEST-BasicAuthIntegrationTest.testBasics-seed#[995253744E9FA0EF]) [ ] o.a.s.c.c.SolrZkClient makePath: /configs/solrCloudCollectionConfig/bad-solrconfig-multiple-dirfactory.xml
    [junit4] 2> 767454 INFO (TEST-BasicAuthIntegrationTest.testBasics-seed#[995253744E9FA0EF]) [ ] o.a.s.c.c.SolrZkClient makePath: /configs/solrCloudCollectionConfig/bad-schema-init-error.xml
    [junit4] 2> 767470 INFO (TEST-BasicAuthIntegrationTest.testBasics-seed#[995253744E9FA0EF]) [ ] o.a.s.c.c.SolrZkClient makePath: /configs/solrCloudCollectionConfig/solrconfig-altdirectory.xml
    [junit4] 2> 767485 INFO (TEST-BasicAuthIntegrationTest.testBasics-seed#[995253744E9FA0EF]) [ ] o.a.s.c.c.SolrZkClient makePath: /configs/solrCloudCollectionConfig/solrconfig-tlog.xml
    [junit4] 2> 767497 INFO (TEST-BasicAuthIntegrationTest.testBasics-seed#[995253744E9FA0EF]) [ ] o.a.s.c.c.SolrZkClient makePath: /configs/solrCloudCollectionConfig/hyphenation.dtd
    [junit4] 2> 767499 INFO (TEST-BasicAuthIntegrationTest.testBasics-seed#[995253744E9FA0EF]) [ ] o.a.s.c.c.SolrZkClient makePath: /configs/solrCloudCollectionConfig/schema-sweetspot.xml
    [junit4] 2> 767504 INFO (TEST-BasicAuthIntegrationTest.testBasics-seed#[995253744E9FA0EF]) [ ] o.a.s.c.c.SolrZkClient makePath: /configs/solrCloudCollectionConfig/solrconfig-xinclude.xml
    [junit4] 2> 767510 INFO (TEST-BasicAuthIntegrationTest.testBasics-seed#[995253744E9FA0EF]) [ ] o.a.s.c.c.SolrZkClient makePath: /configs/solrCloudCollectionConfig/solrconfig-schemaless.xml
    [junit4] 2> 767515 INFO (TEST-BasicAuthIntegrationTest.testBasics-seed#[995253744E9FA0EF]) [ ] o.a.s.c.c.SolrZkClient makePath: /configs/solrCloudCollectionConfig/schemasurround.xml
    [junit4] 2> 767545 INFO (TEST-BasicAuthIntegrationTest.testBasics-seed#[995253744E9FA0EF]) [ ] o.a.s.c.c.SolrZ

[...truncated too long message...]

ry: data
    [junit4] 2> 7986183 INFO (jetty-launcher-537-thread-8) [ ] o.e.j.s.h.ContextHandler Stopped o.e.j.s.ServletContextHandler@12d1e91{/solr,null,UNAVAILABLE}
    [junit4] 2> 7986184 INFO (coreCloseExecutor-2124-thread-1) [n:127.0.0.1:36653_solr c:testSolrCloudCollection s:shard2 r:core_node4 x:testSolrCloudCollection_shard2_replica2] o.a.s.c.CachingDirectoryFactory Closing RAMDirectoryFactory - 2 directories currently being tracked
    [junit4] 2> 7986184 INFO (coreCloseExecutor-2124-thread-1) [n:127.0.0.1:36653_solr c:testSolrCloudCollection s:shard2 r:core_node4 x:testSolrCloudCollection_shard2_replica2] o.a.s.c.CachingDirectoryFactory looking to close data/index [CachedDir<<refCount=0;path=data/index;done=false>>]
    [junit4] 2> 7986184 INFO (coreCloseExecutor-2124-thread-1) [n:127.0.0.1:36653_solr c:testSolrCloudCollection s:shard2 r:core_node4 x:testSolrCloudCollection_shard2_replica2] o.a.s.c.CachingDirectoryFactory Closing directory: data/index
    [junit4] 2> 7986184 INFO (coreCloseExecutor-2124-thread-1) [n:127.0.0.1:36653_solr c:testSolrCloudCollection s:shard2 r:core_node4 x:testSolrCloudCollection_shard2_replica2] o.a.s.c.CachingDirectoryFactory looking to close data [CachedDir<<refCount=0;path=data;done=false>>]
    [junit4] 2> 7986184 INFO (coreCloseExecutor-2124-thread-1) [n:127.0.0.1:36653_solr c:testSolrCloudCollection s:shard2 r:core_node4 x:testSolrCloudCollection_shard2_replica2] o.a.s.c.CachingDirectoryFactory Closing directory: data
    [junit4] 2> 7986185 INFO (jetty-launcher-537-thread-9) [ ] o.e.j.s.h.ContextHandler Stopped o.e.j.s.ServletContextHandler@64bf1f{/solr,null,UNAVAILABLE}
    [junit4] 2> 7986186 INFO (coreCloseExecutor-2122-thread-1) [n:127.0.0.1:44214_solr c:testSolrCloudCollection s:shard1 r:core_node3 x:testSolrCloudCollection_shard1_replica2] o.a.s.c.CachingDirectoryFactory Closing RAMDirectoryFactory - 2 directories currently being tracked
    [junit4] 2> 7986186 INFO (coreCloseExecutor-2122-thread-1) [n:127.0.0.1:44214_solr c:testSolrCloudCollection s:shard1 r:core_node3 x:testSolrCloudCollection_shard1_replica2] o.a.s.c.CachingDirectoryFactory looking to close data/index [CachedDir<<refCount=0;path=data/index;done=false>>]
    [junit4] 2> 7986186 INFO (coreCloseExecutor-2122-thread-1) [n:127.0.0.1:44214_solr c:testSolrCloudCollection s:shard1 r:core_node3 x:testSolrCloudCollection_shard1_replica2] o.a.s.c.CachingDirectoryFactory Closing directory: data/index
    [junit4] 2> 7986186 INFO (coreCloseExecutor-2122-thread-1) [n:127.0.0.1:44214_solr c:testSolrCloudCollection s:shard1 r:core_node3 x:testSolrCloudCollection_shard1_replica2] o.a.s.c.CachingDirectoryFactory looking to close data [CachedDir<<refCount=0;path=data;done=false>>]
    [junit4] 2> 7986186 INFO (coreCloseExecutor-2122-thread-1) [n:127.0.0.1:44214_solr c:testSolrCloudCollection s:shard1 r:core_node3 x:testSolrCloudCollection_shard1_replica2] o.a.s.c.CachingDirectoryFactory Closing directory: data
    [junit4] 2> 7986189 INFO (jetty-launcher-537-thread-7) [ ] o.e.j.s.h.ContextHandler Stopped o.e.j.s.ServletContextHandler@d5ef50{/solr,null,UNAVAILABLE}
    [junit4] 2> 7986189 INFO (TEST-BasicAuthIntegrationTest.testBasics-seed#[995253744E9FA0EF]) [ ] o.a.s.c.ZkTestServer connecting to 127.0.0.1:37916 37916
    [junit4] 2> 7986245 ERROR (OverseerExitThread) [n:127.0.0.1:40825_solr ] o.a.s.c.Overseer could not read the data
    [junit4] 2> org.apache.zookeeper.KeeperException$SessionExpiredException: KeeperErrorCode = Session expired for /overseer_elect/leader
    [junit4] 2> at org.apache.zookeeper.KeeperException.create(KeeperException.java:127)
    [junit4] 2> at org.apache.zookeeper.KeeperException.create(KeeperException.java:51)
    [junit4] 2> at org.apache.zookeeper.ZooKeeper.getData(ZooKeeper.java:1155)
    [junit4] 2> at org.apache.solr.common.cloud.SolrZkClient$7.execute(SolrZkClient.java:345)
    [junit4] 2> at org.apache.solr.common.cloud.SolrZkClient$7.execute(SolrZkClient.java:342)
    [junit4] 2> at org.apache.solr.common.cloud.ZkCmdExecutor.retryOperation(ZkCmdExecutor.java:60)
    [junit4] 2> at org.apache.solr.common.cloud.SolrZkClient.getData(SolrZkClient.java:342)
    [junit4] 2> at org.apache.solr.cloud.Overseer$ClusterStateUpdater.checkIfIamStillLeader(Overseer.java:309)
    [junit4] 2> at org.apache.solr.cloud.Overseer$ClusterStateUpdater.access$300(Overseer.java:89)
    [junit4] 2> at org.apache.solr.cloud.Overseer$ClusterStateUpdater$2.run(Overseer.java:268)
    [junit4] 2> NOTE: leaving temporary files on disk at: /home/jenkins/workspace/Lucene-Solr-5.5-Linux/solr/build/solr-core/test/J1/temp/solr.security.BasicAuthIntegrationTest_995253744E9FA0EF-001
    [junit4] 2> 7986644 WARN (jetty-launcher-537-thread-1-SendThread(127.0.0.1:37916)) [n:127.0.0.1:45665_solr ] o.a.z.c.StaticHostProvider Unexpected exception
    [junit4] 2> java.lang.InterruptedException: sleep interrupted
    [junit4] 2> at java.lang.Thread.sleep(Native Method)
    [junit4] 2> at org.apache.zookeeper.client.StaticHostProvider.next(StaticHostProvider.java:101)
    [junit4] 2> at org.apache.zookeeper.ClientCnxn$SendThread.startConnect(ClientCnxn.java:940)
    [junit4] 2> at org.apache.zookeeper.ClientCnxn$SendThread.run(ClientCnxn.java:1003)
    [junit4] 2> 7986644 WARN (TEST-BasicAuthIntegrationTest.testBasics-seed#[995253744E9FA0EF]-SendThread(127.0.0.1:37916)) [n:127.0.0.1:44214_solr ] o.a.z.c.StaticHostProvider Unexpected exception
    [junit4] 2> java.lang.InterruptedException: sleep interrupted
    [junit4] 2> at java.lang.Thread.sleep(Native Method)
    [junit4] 2> at org.apache.zookeeper.client.StaticHostProvider.next(StaticHostProvider.java:101)
    [junit4] 2> at org.apache.zookeeper.ClientCnxn$SendThread.startConnect(ClientCnxn.java:940)
    [junit4] 2> at org.apache.zookeeper.ClientCnxn$SendThread.run(ClientCnxn.java:1003)
    [junit4] 2> Jun 18, 2016 2:44:40 AM com.carrotsearch.randomizedtesting.ThreadLeakControl tryToInterruptAll
    [junit4] 2> INFO: All leaked threads terminated.
    [junit4] 2> NOTE: test params are: codec=Asserting(Lucene54): {id=PostingsFormat(name=Asserting), _version_=FSTOrd50, range_facet_l_dv=PostingsFormat(name=Asserting), range_facet_l=PostingsFormat(name=Memory doPackFST= true), range_facet_i_dv=PostingsFormat(name=Memory doPackFST= true), timestamp=PostingsFormat(name=Memory doPackFST= true), multiDefault=PostingsFormat(name=Memory doPackFST= true), intDefault=FSTOrd50}, docValues:{range_facet_l_dv=DocValuesFormat(name=Lucene54), range_facet_i_dv=DocValuesFormat(name=Asserting), timestamp=DocValuesFormat(name=Asserting)}, sim=RandomSimilarity(queryNorm=true,coord=crazy): {}, locale=sq, timezone=Asia/Nicosia
    [junit4] 2> NOTE: Linux 4.4.0-24-generic i386/Oracle Corporation 1.7.0_80 (32-bit)/cpus=12,threads=1,free=263180512,total=518979584
    [junit4] 2> NOTE: All tests run in this JVM: [ExplicitHLLTest, TermsComponentTest, TestDocBasedVersionConstraints, TestSimpleTrackingShardHandler, TestSolrConfigHandler, MinimalSchemaTest, DistributedMLTComponentTest, HdfsRestartWhileUpdatingTest, OverseerCollectionConfigSetProcessorTest, TestManagedSchemaDynamicFieldResource, CoreAdminRequestStatusTest, TestXmlQParser, ShardRoutingCustomTest, TestUpdate, CollectionsAPIDistributedZkTest, CollectionTooManyReplicasTest, ConcurrentDeleteAndCreateCollectionTest, SSLMigrationTest, BasicFunctionalityTest, HdfsChaosMonkeyNothingIsSafeTest, ForceLeaderTest, MultiTermTest, TestSimpleQParserPlugin, MergeStrategyTest, SuggesterFSTTest, CloneFieldUpdateProcessorFactoryTest, MoreLikeThisHandlerTest, LoggingHandlerTest, TestDynamicFieldCollectionResource, NumericFieldsTest, ConvertedLegacyTest, SpellCheckComponentTest, LeaderInitiatedRecoveryOnCommitTest, CloudExitableDirectoryReaderTest, DirectoryFactoryTest, TestPivotHelperCode, TestEmbeddedSolrServerConstructors, SharedFSAutoReplicaFailoverTest, DeleteStatusTest, AsyncMigrateRouteKeyTest, AddBlockUpdateTest, HighlighterMaxOffsetTest, HdfsUnloadDistributedZkTest, TestHighFrequencyDictionaryFactory, BasicAuthIntegrationTest]
    [junit4] 2> NOTE: reproduce with: ant test -Dtestcase=BasicAuthIntegrationTest -Dtests.seed=995253744E9FA0EF -Dtests.multiplier=3 -Dtests.slow=true -Dtests.locale=sq -Dtests.timezone=Asia/Nicosia -Dtests.asserts=true -Dtests.file.encoding=ISO-8859-1
    [junit4] ERROR 0.00s J1 | BasicAuthIntegrationTest (suite) <<<
    [junit4] > Throwable #1: java.lang.Exception: Suite timeout exceeded (>= 7200000 msec).
    [junit4] > at __randomizedtesting.SeedInfo.seed([995253744E9FA0EF]:0)
    [junit4] Completed [525/573 (1!)] on J1 in 7221.63s, 1 test, 2 errors <<< FAILURES!

[...truncated 165 lines...]
BUILD FAILED
/home/jenkins/workspace/Lucene-Solr-5.5-Linux/build.xml:750: The following error occurred while executing this line:
/home/jenkins/workspace/Lucene-Solr-5.5-Linux/build.xml:694: The following error occurred while executing this line:
/home/jenkins/workspace/Lucene-Solr-5.5-Linux/build.xml:59: The following error occurred while executing this line:
/home/jenkins/workspace/Lucene-Solr-5.5-Linux/solr/build.xml:233: The following error occurred while executing this line:
/home/jenkins/workspace/Lucene-Solr-5.5-Linux/solr/common-build.xml:534: The following error occurred while executing this line:
/home/jenkins/workspace/Lucene-Solr-5.5-Linux/lucene/common-build.xml:1477: The following error occurred while executing this line:
/home/jenkins/workspace/Lucene-Solr-5.5-Linux/lucene/common-build.xml:1033: There were test failures: 573 suites (7 ignored), 2317 tests, 1 suite-level error, 1 error, 84 ignored (39 assumptions) [seed: 995253744E9FA0EF]

Total time: 169 minutes 54 seconds
Build step 'Invoke Ant' marked build as failure
Archiving artifacts
[WARNINGS] Skipping publisher since build result is FAILURE
Recording test results
Email was triggered for: Failure - Any
Sending email for trigger: Failure - Any

Search Discussions

Discussion Posts

Previous

Related Discussions

Discussion Navigation
viewthread | post
posts ‹ prev | 4 of 4 | next ›
Discussion Overview
groupdev @
categorieslucene
postedJun 17, '16 at 3:38p
activeJun 18, '16 at 2:52a
posts4
users1
websitelucene.apache.org

1 user in discussion

Policeman Jenkins Server: 4 posts

People

Translate

site design / logo © 2017 Grokbase