Grokbase Groups Lucene dev June 2016
FAQ
Build: http://jenkins.thetaphi.de/job/Lucene-Solr-5.5-Windows/87/
Java: 64bit/jdk1.8.0_92 -XX:+UseCompressedOops -XX:+UseG1GC

1 tests failed.
FAILED: org.apache.solr.handler.TestReplicationHandlerBackup.doTestBackup

Error Message:
Failed to create backup

Stack Trace:
java.lang.AssertionError: Failed to create backup
  at __randomizedtesting.SeedInfo.seed([AABF9F6EB5B189AE:EB34BF0B920F7AE1]:0)
  at org.junit.Assert.fail(Assert.java:93)
  at org.apache.solr.handler.CheckBackupStatus.fetchStatus(CheckBackupStatus.java:50)
  at org.apache.solr.handler.TestReplicationHandlerBackup.doTestBackup(TestReplicationHandlerBackup.java:196)
  at sun.reflect.NativeMethodAccessorImpl.invoke0(Native Method)
  at sun.reflect.NativeMethodAccessorImpl.invoke(NativeMethodAccessorImpl.java:62)
  at sun.reflect.DelegatingMethodAccessorImpl.invoke(DelegatingMethodAccessorImpl.java:43)
  at java.lang.reflect.Method.invoke(Method.java:498)
  at com.carrotsearch.randomizedtesting.RandomizedRunner.invoke(RandomizedRunner.java:1764)
  at com.carrotsearch.randomizedtesting.RandomizedRunner$8.evaluate(RandomizedRunner.java:871)
  at com.carrotsearch.randomizedtesting.RandomizedRunner$9.evaluate(RandomizedRunner.java:907)
  at com.carrotsearch.randomizedtesting.RandomizedRunner$10.evaluate(RandomizedRunner.java:921)
  at com.carrotsearch.randomizedtesting.rules.SystemPropertiesRestoreRule$1.evaluate(SystemPropertiesRestoreRule.java:57)
  at org.apache.lucene.util.TestRuleSetupTeardownChained$1.evaluate(TestRuleSetupTeardownChained.java:49)
  at org.apache.lucene.util.AbstractBeforeAfterRule$1.evaluate(AbstractBeforeAfterRule.java:45)
  at org.apache.lucene.util.TestRuleThreadAndTestName$1.evaluate(TestRuleThreadAndTestName.java:48)
  at org.apache.lucene.util.TestRuleIgnoreAfterMaxFailures$1.evaluate(TestRuleIgnoreAfterMaxFailures.java:64)
  at org.apache.lucene.util.TestRuleMarkFailure$1.evaluate(TestRuleMarkFailure.java:47)
  at com.carrotsearch.randomizedtesting.rules.StatementAdapter.evaluate(StatementAdapter.java:36)
  at com.carrotsearch.randomizedtesting.ThreadLeakControl$StatementRunner.run(ThreadLeakControl.java:367)
  at com.carrotsearch.randomizedtesting.ThreadLeakControl.forkTimeoutingTask(ThreadLeakControl.java:809)
  at com.carrotsearch.randomizedtesting.ThreadLeakControl$3.evaluate(ThreadLeakControl.java:460)
  at com.carrotsearch.randomizedtesting.RandomizedRunner.runSingleTest(RandomizedRunner.java:880)
  at com.carrotsearch.randomizedtesting.RandomizedRunner$5.evaluate(RandomizedRunner.java:781)
  at com.carrotsearch.randomizedtesting.RandomizedRunner$6.evaluate(RandomizedRunner.java:816)
  at com.carrotsearch.randomizedtesting.RandomizedRunner$7.evaluate(RandomizedRunner.java:827)
  at com.carrotsearch.randomizedtesting.rules.StatementAdapter.evaluate(StatementAdapter.java:36)
  at com.carrotsearch.randomizedtesting.rules.SystemPropertiesRestoreRule$1.evaluate(SystemPropertiesRestoreRule.java:57)
  at org.apache.lucene.util.AbstractBeforeAfterRule$1.evaluate(AbstractBeforeAfterRule.java:45)
  at com.carrotsearch.randomizedtesting.rules.StatementAdapter.evaluate(StatementAdapter.java:36)
  at org.apache.lucene.util.TestRuleStoreClassName$1.evaluate(TestRuleStoreClassName.java:41)
  at com.carrotsearch.randomizedtesting.rules.NoShadowingOrOverridesOnMethodsRule$1.evaluate(NoShadowingOrOverridesOnMethodsRule.java:40)
  at com.carrotsearch.randomizedtesting.rules.NoShadowingOrOverridesOnMethodsRule$1.evaluate(NoShadowingOrOverridesOnMethodsRule.java:40)
  at com.carrotsearch.randomizedtesting.rules.StatementAdapter.evaluate(StatementAdapter.java:36)
  at com.carrotsearch.randomizedtesting.rules.StatementAdapter.evaluate(StatementAdapter.java:36)
  at com.carrotsearch.randomizedtesting.rules.StatementAdapter.evaluate(StatementAdapter.java:36)
  at org.apache.lucene.util.TestRuleAssertionsRequired$1.evaluate(TestRuleAssertionsRequired.java:53)
  at org.apache.lucene.util.TestRuleMarkFailure$1.evaluate(TestRuleMarkFailure.java:47)
  at org.apache.lucene.util.TestRuleIgnoreAfterMaxFailures$1.evaluate(TestRuleIgnoreAfterMaxFailures.java:64)
  at org.apache.lucene.util.TestRuleIgnoreTestSuites$1.evaluate(TestRuleIgnoreTestSuites.java:54)
  at com.carrotsearch.randomizedtesting.rules.StatementAdapter.evaluate(StatementAdapter.java:36)
  at com.carrotsearch.randomizedtesting.ThreadLeakControl$StatementRunner.run(ThreadLeakControl.java:367)
  at java.lang.Thread.run(Thread.java:745)




Build Log:
[...truncated 12161 lines...]
    [junit4] Suite: org.apache.solr.handler.TestReplicationHandlerBackup
    [junit4] 2> Creating dataDir: C:\Users\jenkins\workspace\Lucene-Solr-5.5-Windows\solr\build\solr-core\test\J0\temp\solr.handler.TestReplicationHandlerBackup_AABF9F6EB5B189AE-001\init-core-data-001
    [junit4] 2> 2633539 INFO (TEST-TestReplicationHandlerBackup.doTestBackup-seed#[AABF9F6EB5B189AE]) [ ] o.a.s.SolrTestCaseJ4 ###Starting doTestBackup
    [junit4] 2> 2633540 INFO (TEST-TestReplicationHandlerBackup.doTestBackup-seed#[AABF9F6EB5B189AE]) [ ] o.a.s.SolrTestCaseJ4 Writing core.properties file to C:\Users\jenkins\workspace\Lucene-Solr-5.5-Windows\solr\build\solr-core\test\J0\temp\solr.handler.TestReplicationHandlerBackup_AABF9F6EB5B189AE-001\solr-instance-001\collection1
    [junit4] 2> 2633558 INFO (TEST-TestReplicationHandlerBackup.doTestBackup-seed#[AABF9F6EB5B189AE]) [ ] o.e.j.s.Server jetty-9.2.13.v20150730
    [junit4] 2> 2633559 INFO (TEST-TestReplicationHandlerBackup.doTestBackup-seed#[AABF9F6EB5B189AE]) [ ] o.e.j.s.h.ContextHandler Started o.e.j.s.ServletContextHandler@414d8695{/solr,null,AVAILABLE}
    [junit4] 2> 2633560 INFO (TEST-TestReplicationHandlerBackup.doTestBackup-seed#[AABF9F6EB5B189AE]) [ ] o.e.j.s.ServerConnector Started ServerConnector@32999cc5{HTTP/1.1}{127.0.0.1:60092}
    [junit4] 2> 2633560 INFO (TEST-TestReplicationHandlerBackup.doTestBackup-seed#[AABF9F6EB5B189AE]) [ ] o.e.j.s.Server Started @2638057ms
    [junit4] 2> 2633560 INFO (TEST-TestReplicationHandlerBackup.doTestBackup-seed#[AABF9F6EB5B189AE]) [ ] o.a.s.c.s.e.JettySolrRunner Jetty properties: {solr.data.dir=C:\Users\jenkins\workspace\Lucene-Solr-5.5-Windows\solr\build\solr-core\test\J0\temp\solr.handler.TestReplicationHandlerBackup_AABF9F6EB5B189AE-001\solr-instance-001\collection1\data, hostContext=/solr, hostPort=60092}
    [junit4] 2> 2633560 INFO (TEST-TestReplicationHandlerBackup.doTestBackup-seed#[AABF9F6EB5B189AE]) [ ] o.a.s.s.SolrDispatchFilter SolrDispatchFilter.init(): sun.misc.Launcher$AppClassLoader@73d16e93
    [junit4] 2> 2633560 INFO (TEST-TestReplicationHandlerBackup.doTestBackup-seed#[AABF9F6EB5B189AE]) [ ] o.a.s.c.SolrResourceLoader new SolrResourceLoader for directory: 'C:\Users\jenkins\workspace\Lucene-Solr-5.5-Windows\solr\build\solr-core\test\J0\temp\solr.handler.TestReplicationHandlerBackup_AABF9F6EB5B189AE-001\solr-instance-001'
    [junit4] 2> 2633560 INFO (TEST-TestReplicationHandlerBackup.doTestBackup-seed#[AABF9F6EB5B189AE]) [ ] o.a.s.c.SolrResourceLoader JNDI not configured for solr (NoInitialContextEx)
    [junit4] 2> 2633560 INFO (TEST-TestReplicationHandlerBackup.doTestBackup-seed#[AABF9F6EB5B189AE]) [ ] o.a.s.c.SolrResourceLoader solr home defaulted to 'solr/' (could not find system property or JNDI)
    [junit4] 2> 2633561 INFO (TEST-TestReplicationHandlerBackup.doTestBackup-seed#[AABF9F6EB5B189AE]) [ ] o.a.s.c.SolrXmlConfig Loading container configuration from C:\Users\jenkins\workspace\Lucene-Solr-5.5-Windows\solr\build\solr-core\test\J0\temp\solr.handler.TestReplicationHandlerBackup_AABF9F6EB5B189AE-001\solr-instance-001\solr.xml
    [junit4] 2> 2633574 INFO (TEST-TestReplicationHandlerBackup.doTestBackup-seed#[AABF9F6EB5B189AE]) [ ] o.a.s.c.CorePropertiesLocator Config-defined core root directory: C:\Users\jenkins\workspace\Lucene-Solr-5.5-Windows\solr\build\solr-core\test\J0\temp\solr.handler.TestReplicationHandlerBackup_AABF9F6EB5B189AE-001\solr-instance-001\.
    [junit4] 2> 2633574 INFO (TEST-TestReplicationHandlerBackup.doTestBackup-seed#[AABF9F6EB5B189AE]) [ ] o.a.s.c.CoreContainer New CoreContainer 538875560
    [junit4] 2> 2633574 INFO (TEST-TestReplicationHandlerBackup.doTestBackup-seed#[AABF9F6EB5B189AE]) [ ] o.a.s.c.CoreContainer Loading cores into CoreContainer [instanceDir=C:\Users\jenkins\workspace\Lucene-Solr-5.5-Windows\solr\build\solr-core\test\J0\temp\solr.handler.TestReplicationHandlerBackup_AABF9F6EB5B189AE-001\solr-instance-001]
    [junit4] 2> 2633574 WARN (TEST-TestReplicationHandlerBackup.doTestBackup-seed#[AABF9F6EB5B189AE]) [ ] o.a.s.c.CoreContainer Couldn't add files from C:\Users\jenkins\workspace\Lucene-Solr-5.5-Windows\solr\build\solr-core\test\J0\temp\solr.handler.TestReplicationHandlerBackup_AABF9F6EB5B189AE-001\solr-instance-001\lib to classpath: C:\Users\jenkins\workspace\Lucene-Solr-5.5-Windows\solr\build\solr-core\test\J0\temp\solr.handler.TestReplicationHandlerBackup_AABF9F6EB5B189AE-001\solr-instance-001\lib
    [junit4] 2> 2633575 INFO (TEST-TestReplicationHandlerBackup.doTestBackup-seed#[AABF9F6EB5B189AE]) [ ] o.a.s.h.c.HttpShardHandlerFactory created with socketTimeout : 90000,urlScheme : ,connTimeout : 15000,maxConnectionsPerHost : 20,maxConnections : 10000,corePoolSize : 0,maximumPoolSize : 2147483647,maxThreadIdleTime : 5,sizeOfQueue : -1,fairnessPolicy : false,useRetries : false,
    [junit4] 2> 2633580 INFO (TEST-TestReplicationHandlerBackup.doTestBackup-seed#[AABF9F6EB5B189AE]) [ ] o.a.s.u.UpdateShardHandler Creating UpdateShardHandler HTTP client with params: socketTimeout=340000&connTimeout=45000&retry=true
    [junit4] 2> 2633580 INFO (TEST-TestReplicationHandlerBackup.doTestBackup-seed#[AABF9F6EB5B189AE]) [ ] o.a.s.l.LogWatcher SLF4J impl is org.slf4j.impl.Log4jLoggerFactory
    [junit4] 2> 2633580 INFO (TEST-TestReplicationHandlerBackup.doTestBackup-seed#[AABF9F6EB5B189AE]) [ ] o.a.s.l.LogWatcher Registering Log Listener [Log4j (org.slf4j.impl.Log4jLoggerFactory)]
    [junit4] 2> 2633580 INFO (TEST-TestReplicationHandlerBackup.doTestBackup-seed#[AABF9F6EB5B189AE]) [ ] o.a.s.c.CoreContainer Security conf doesn't exist. Skipping setup for authorization module.
    [junit4] 2> 2633581 INFO (TEST-TestReplicationHandlerBackup.doTestBackup-seed#[AABF9F6EB5B189AE]) [ ] o.a.s.c.CoreContainer No authentication plugin used.
    [junit4] 2> 2633582 INFO (TEST-TestReplicationHandlerBackup.doTestBackup-seed#[AABF9F6EB5B189AE]) [ ] o.a.s.c.CorePropertiesLocator Looking for core definitions underneath C:\Users\jenkins\workspace\Lucene-Solr-5.5-Windows\solr\build\solr-core\test\J0\temp\solr.handler.TestReplicationHandlerBackup_AABF9F6EB5B189AE-001\solr-instance-001\.
    [junit4] 2> 2633586 INFO (TEST-TestReplicationHandlerBackup.doTestBackup-seed#[AABF9F6EB5B189AE]) [ ] o.a.s.c.CoreDescriptor Created CoreDescriptor: {name=collection1, config=solrconfig.xml, loadOnStartup=true, schema=schema.xml, configSetProperties=configsetprops.json, transient=false, dataDir=data\}
    [junit4] 2> 2633586 INFO (TEST-TestReplicationHandlerBackup.doTestBackup-seed#[AABF9F6EB5B189AE]) [ ] o.a.s.c.CorePropertiesLocator Found core collection1 in C:\Users\jenkins\workspace\Lucene-Solr-5.5-Windows\solr\build\solr-core\test\J0\temp\solr.handler.TestReplicationHandlerBackup_AABF9F6EB5B189AE-001\solr-instance-001\.\collection1
    [junit4] 2> 2633587 INFO (TEST-TestReplicationHandlerBackup.doTestBackup-seed#[AABF9F6EB5B189AE]) [ ] o.a.s.c.CorePropertiesLocator Found 1 core definitions
    [junit4] 2> 2633588 INFO (TEST-TestReplicationHandlerBackup.doTestBackup-seed#[AABF9F6EB5B189AE]) [ ] o.a.s.s.SolrDispatchFilter user.dir=C:\Users\jenkins\workspace\Lucene-Solr-5.5-Windows\solr\build\solr-core\test\J0
    [junit4] 2> 2633588 INFO (TEST-TestReplicationHandlerBackup.doTestBackup-seed#[AABF9F6EB5B189AE]) [ ] o.a.s.s.SolrDispatchFilter SolrDispatchFilter.init() done
    [junit4] 2> 2633590 INFO (coreLoadExecutor-8973-thread-1) [ ] o.a.s.c.SolrResourceLoader new SolrResourceLoader for directory: 'C:\Users\jenkins\workspace\Lucene-Solr-5.5-Windows\solr\build\solr-core\test\J0\temp\solr.handler.TestReplicationHandlerBackup_AABF9F6EB5B189AE-001\solr-instance-001\collection1'
    [junit4] 2> 2633590 INFO (coreLoadExecutor-8973-thread-1) [ ] o.a.s.c.SolrResourceLoader JNDI not configured for solr (NoInitialContextEx)
    [junit4] 2> 2633590 INFO (coreLoadExecutor-8973-thread-1) [ ] o.a.s.c.SolrResourceLoader solr home defaulted to 'solr/' (could not find system property or JNDI)
    [junit4] 2> 2633612 INFO (coreLoadExecutor-8973-thread-1) [ ] o.a.s.c.SolrConfig current version of requestparams : -1
    [junit4] 2> 2633614 INFO (coreLoadExecutor-8973-thread-1) [ ] o.a.s.c.SolrConfig Using Lucene MatchVersion: 5.5.2
    [junit4] 2> 2633667 INFO (coreLoadExecutor-8973-thread-1) [ ] o.a.s.c.SolrConfig Loaded SolrConfig: solrconfig.xml
    [junit4] 2> 2633671 INFO (coreLoadExecutor-8973-thread-1) [ ] o.a.s.s.IndexSchema [collection1] Schema name=test
    [junit4] 2> 2633679 INFO (coreLoadExecutor-8973-thread-1) [ ] o.a.s.s.IndexSchema unique key field: id
    [junit4] 2> 2633692 INFO (coreLoadExecutor-8973-thread-1) [ ] o.a.s.c.ConfigSetProperties Did not find ConfigSet properties, assuming default properties: Can't find resource 'configsetprops.json' in classpath or 'C:\Users\jenkins\workspace\Lucene-Solr-5.5-Windows\solr\build\solr-core\test\J0\temp\solr.handler.TestReplicationHandlerBackup_AABF9F6EB5B189AE-001\solr-instance-001\collection1'
    [junit4] 2> 2633692 INFO (coreLoadExecutor-8973-thread-1) [ ] o.a.s.c.CoreContainer Creating SolrCore 'collection1' using configuration from instancedir C:\Users\jenkins\workspace\Lucene-Solr-5.5-Windows\solr\build\solr-core\test\J0\temp\solr.handler.TestReplicationHandlerBackup_AABF9F6EB5B189AE-001\solr-instance-001\.\collection1
    [junit4] 2> 2633693 INFO (coreLoadExecutor-8973-thread-1) [ x:collection1] o.a.s.c.SolrCore org.apache.solr.core.MockDirectoryFactory
    [junit4] 2> 2633693 INFO (coreLoadExecutor-8973-thread-1) [ x:collection1] o.a.s.c.SolrCore [[collection1] ] Opening new SolrCore at [C:\Users\jenkins\workspace\Lucene-Solr-5.5-Windows\solr\build\solr-core\test\J0\temp\solr.handler.TestReplicationHandlerBackup_AABF9F6EB5B189AE-001\solr-instance-001\collection1], dataDir=[C:\Users\jenkins\workspace\Lucene-Solr-5.5-Windows\solr\build\solr-core\test\J0\temp\solr.handler.TestReplicationHandlerBackup_AABF9F6EB5B189AE-001\solr-instance-001\.\collection1\data\]
    [junit4] 2> 2633693 INFO (coreLoadExecutor-8973-thread-1) [ x:collection1] o.a.s.c.SolrCore JMX monitoring not detected for core: collection1
    [junit4] 2> 2633693 INFO (coreLoadExecutor-8973-thread-1) [ x:collection1] o.a.s.c.CachingDirectoryFactory return new directory for C:\Users\jenkins\workspace\Lucene-Solr-5.5-Windows\solr\build\solr-core\test\J0\temp\solr.handler.TestReplicationHandlerBackup_AABF9F6EB5B189AE-001\solr-instance-001\.\collection1\data\
    [junit4] 2> 2633694 INFO (coreLoadExecutor-8973-thread-1) [ x:collection1] o.a.s.c.SolrCore New index directory detected: old=null new=C:\Users\jenkins\workspace\Lucene-Solr-5.5-Windows\solr\build\solr-core\test\J0\temp\solr.handler.TestReplicationHandlerBackup_AABF9F6EB5B189AE-001\solr-instance-001\.\collection1\data\index/
    [junit4] 2> 2633694 WARN (coreLoadExecutor-8973-thread-1) [ x:collection1] o.a.s.c.SolrCore [collection1] Solr index directory 'C:\Users\jenkins\workspace\Lucene-Solr-5.5-Windows\solr\build\solr-core\test\J0\temp\solr.handler.TestReplicationHandlerBackup_AABF9F6EB5B189AE-001\solr-instance-001\.\collection1\data\index' doesn't exist. Creating new index...
    [junit4] 2> 2633694 INFO (coreLoadExecutor-8973-thread-1) [ x:collection1] o.a.s.c.CachingDirectoryFactory return new directory for C:\Users\jenkins\workspace\Lucene-Solr-5.5-Windows\solr\build\solr-core\test\J0\temp\solr.handler.TestReplicationHandlerBackup_AABF9F6EB5B189AE-001\solr-instance-001\.\collection1\data\index
    [junit4] 2> 2633694 INFO (coreLoadExecutor-8973-thread-1) [ x:collection1] o.a.s.u.RandomMergePolicy RandomMergePolicy wrapping class org.apache.lucene.index.LogDocMergePolicy: [LogDocMergePolicy: minMergeSize=1000, mergeFactor=43, maxMergeSize=9223372036854775807, maxMergeSizeForForcedMerge=9223372036854775807, calibrateSizeByDeletes=true, maxMergeDocs=2147483647, maxCFSSegmentSizeMB=8.796093022207999E12, noCFSRatio=1.0]
    [junit4] 2> 2633695 INFO (coreLoadExecutor-8973-thread-1) [ x:collection1] o.a.s.c.SolrDeletionPolicy SolrDeletionPolicy.onCommit: commits: num=1
    [junit4] 2> commit{dir=MockDirectoryWrapper(RAMDirectory@54b80fad lockFactory=org.apache.lucene.store.SingleInstanceLockFactory@17c72186),segFN=segments_1,generation=1}
    [junit4] 2> 2633695 INFO (coreLoadExecutor-8973-thread-1) [ x:collection1] o.a.s.c.SolrDeletionPolicy newest commit generation = 1
    [junit4] 2> 2633695 INFO (OldIndexDirectoryCleanupThreadForCore-collection1) [ x:collection1] o.a.s.c.SolrCore Looking for old index directories to cleanup for core collection1 in C:\Users\jenkins\workspace\Lucene-Solr-5.5-Windows\solr\build\solr-core\test\J0\temp\solr.handler.TestReplicationHandlerBackup_AABF9F6EB5B189AE-001\solr-instance-001\.\collection1\data\
    [junit4] 2> 2633697 INFO (coreLoadExecutor-8973-thread-1) [ x:collection1] o.a.s.c.SolrCore no updateRequestProcessorChain defined as default, creating implicit default
    [junit4] 2> 2633708 INFO (coreLoadExecutor-8973-thread-1) [ x:collection1] o.a.s.h.l.XMLLoader xsltCacheLifetimeSeconds=60
    [junit4] 2> 2633710 INFO (coreLoadExecutor-8973-thread-1) [ x:collection1] o.a.s.h.l.XMLLoader xsltCacheLifetimeSeconds=60
    [junit4] 2> 2633712 INFO (coreLoadExecutor-8973-thread-1) [ x:collection1] o.a.s.h.l.XMLLoader xsltCacheLifetimeSeconds=60
    [junit4] 2> 2633713 INFO (coreLoadExecutor-8973-thread-1) [ x:collection1] o.a.s.h.l.XMLLoader xsltCacheLifetimeSeconds=60
    [junit4] 2> 2633715 INFO (coreLoadExecutor-8973-thread-1) [ x:collection1] o.a.s.c.RequestHandlers Registered paths: /admin/mbeans,standard,/update/csv,/update/json/docs,/admin/luke,/admin/segments,/get,/admin/system,/replication,/admin/properties,/config,/schema,/admin/plugins,/admin/logging,/update/json,/admin/threads,/admin/ping,/update,/admin/file
    [junit4] 2> 2633715 INFO (coreLoadExecutor-8973-thread-1) [ x:collection1] o.a.s.c.SolrCore Using default statsCache cache: org.apache.solr.search.stats.LocalStatsCache
    [junit4] 2> 2633715 INFO (coreLoadExecutor-8973-thread-1) [ x:collection1] o.a.s.u.CommitTracker Hard AutoCommit: disabled
    [junit4] 2> 2633715 INFO (coreLoadExecutor-8973-thread-1) [ x:collection1] o.a.s.u.CommitTracker Soft AutoCommit: disabled
    [junit4] 2> 2633715 INFO (coreLoadExecutor-8973-thread-1) [ x:collection1] o.a.s.u.RandomMergePolicy RandomMergePolicy wrapping class org.apache.lucene.index.LogDocMergePolicy: [LogDocMergePolicy: minMergeSize=1000, mergeFactor=14, maxMergeSize=9223372036854775807, maxMergeSizeForForcedMerge=9223372036854775807, calibrateSizeByDeletes=false, maxMergeDocs=2147483647, maxCFSSegmentSizeMB=8.796093022207999E12, noCFSRatio=0.6509493962552758]
    [junit4] 2> 2633717 INFO (coreLoadExecutor-8973-thread-1) [ x:collection1] o.a.s.c.SolrDeletionPolicy SolrDeletionPolicy.onInit: commits: num=1
    [junit4] 2> commit{dir=MockDirectoryWrapper(RAMDirectory@54b80fad lockFactory=org.apache.lucene.store.SingleInstanceLockFactory@17c72186),segFN=segments_1,generation=1}
    [junit4] 2> 2633717 INFO (coreLoadExecutor-8973-thread-1) [ x:collection1] o.a.s.c.SolrDeletionPolicy newest commit generation = 1
    [junit4] 2> 2633717 INFO (coreLoadExecutor-8973-thread-1) [ x:collection1] o.a.s.s.SolrIndexSearcher Opening Searcher@67dc053f[collection1] main
    [junit4] 2> 2633717 INFO (coreLoadExecutor-8973-thread-1) [ x:collection1] o.a.s.r.ManagedResourceStorage File-based storage initialized to use dir: C:\Users\jenkins\workspace\Lucene-Solr-5.5-Windows\solr\build\solr-core\test\J0\temp\solr.handler.TestReplicationHandlerBackup_AABF9F6EB5B189AE-001\solr-instance-001\collection1\conf
    [junit4] 2> 2633717 INFO (coreLoadExecutor-8973-thread-1) [ x:collection1] o.a.s.r.RestManager Initializing RestManager with initArgs: {storageDir=C:\Users\jenkins\workspace\Lucene-Solr-5.5-Windows\solr\build\solr-core\test\J0\temp\solr.handler.TestReplicationHandlerBackup_AABF9F6EB5B189AE-001\solr-instance-001\collection1\conf}
    [junit4] 2> 2633717 INFO (coreLoadExecutor-8973-thread-1) [ x:collection1] o.a.s.r.ManagedResourceStorage Reading _rest_managed.json using file:dir=C:\Users\jenkins\workspace\Lucene-Solr-5.5-Windows\solr\build\solr-core\test\J0\temp\solr.handler.TestReplicationHandlerBackup_AABF9F6EB5B189AE-001\solr-instance-001\collection1\conf
    [junit4] 2> 2633717 INFO (coreLoadExecutor-8973-thread-1) [ x:collection1] o.a.s.r.RestManager Initializing 0 registered ManagedResources
    [junit4] 2> 2633717 INFO (coreLoadExecutor-8973-thread-1) [ x:collection1] o.a.s.h.ReplicationHandler Replication enabled for following config files: schema-replication2.xml:schema.xml
    [junit4] 2> 2633717 INFO (coreLoadExecutor-8973-thread-1) [ x:collection1] o.a.s.h.ReplicationHandler Commits will be reserved for 10000
    [junit4] 2> 2633717 INFO (coreLoadExecutor-8973-thread-1) [ x:collection1] o.a.s.c.CoreContainer registering core: collection1
    [junit4] 2> 2633717 INFO (searcherExecutor-8974-thread-1-processing-x:collection1) [ x:collection1] o.a.s.c.SolrCore [collection1] Registered new searcher Searcher@67dc053f[collection1] main{ExitableDirectoryReader(UninvertingDirectoryReader())}
    [junit4] 2> 2634097 INFO (qtp1232216858-18971) [ x:collection1] o.a.s.u.DirectUpdateHandler2 [collection1] REMOVING ALL DOCUMENTS FROM INDEX
    [junit4] 2> 2634097 INFO (qtp1232216858-18971) [ x:collection1] o.a.s.u.p.LogUpdateProcessorFactory [collection1] webapp=/solr path=/update params={wt=javabin&version=2}{deleteByQuery=*:*} 0 0
    [junit4] 2> 2634104 INFO (qtp1232216858-18973) [ x:collection1] o.a.s.u.p.LogUpdateProcessorFactory [collection1] webapp=/solr path=/update params={wt=javabin&version=2}{add=[0]} 0 4
    [junit4] 2> 2634107 INFO (qtp1232216858-18974) [ x:collection1] o.a.s.u.p.LogUpdateProcessorFactory [collection1] webapp=/solr path=/update params={wt=javabin&version=2}{add=[1]} 0 0
    [junit4] 2> 2634110 INFO (qtp1232216858-18975) [ x:collection1] o.a.s.u.p.LogUpdateProcessorFactory [collection1] webapp=/solr path=/update params={wt=javabin&version=2}{add=[2]} 0 0
    [junit4] 2> 2634113 INFO (qtp1232216858-18972) [ x:collection1] o.a.s.u.p.LogUpdateProcessorFactory [collection1] webapp=/solr path=/update params={wt=javabin&version=2}{add=[3]} 0 0
    [junit4] 2> 2634117 INFO (qtp1232216858-18982) [ x:collection1] o.a.s.u.p.LogUpdateProcessorFactory [collection1] webapp=/solr path=/update params={wt=javabin&version=2}{add=[4]} 0 0
    [junit4] 2> 2634120 INFO (qtp1232216858-18983) [ x:collection1] o.a.s.u.p.LogUpdateProcessorFactory [collection1] webapp=/solr path=/update params={wt=javabin&version=2}{add=[5]} 0 0
    [junit4] 2> 2634122 INFO (qtp1232216858-18984) [ x:collection1] o.a.s.u.p.LogUpdateProcessorFactory [collection1] webapp=/solr path=/update params={wt=javabin&version=2}{add=[6]} 0 0
    [junit4] 2> 2634125 INFO (qtp1232216858-18971) [ x:collection1] o.a.s.u.p.LogUpdateProcessorFactory [collection1] webapp=/solr path=/update params={wt=javabin&version=2}{add=[7]} 0 0
    [junit4] 2> 2634127 INFO (qtp1232216858-18973) [ x:collection1] o.a.s.u.p.LogUpdateProcessorFactory [collection1] webapp=/solr path=/update params={wt=javabin&version=2}{add=[8]} 0 0
    [junit4] 2> 2634130 INFO (qtp1232216858-18974) [ x:collection1] o.a.s.u.p.LogUpdateProcessorFactory [collection1] webapp=/solr path=/update params={wt=javabin&version=2}{add=[9]} 0 0
    [junit4] 2> 2634132 INFO (qtp1232216858-18975) [ x:collection1] o.a.s.u.p.LogUpdateProcessorFactory [collection1] webapp=/solr path=/update params={wt=javabin&version=2}{add=[10]} 0 0
    [junit4] 2> 2634135 INFO (qtp1232216858-18972) [ x:collection1] o.a.s.u.p.LogUpdateProcessorFactory [collection1] webapp=/solr path=/update params={wt=javabin&version=2}{add=[11]} 0 0
    [junit4] 2> 2634138 INFO (qtp1232216858-18982) [ x:collection1] o.a.s.u.p.LogUpdateProcessorFactory [collection1] webapp=/solr path=/update params={wt=javabin&version=2}{add=[12]} 0 0
    [junit4] 2> 2634140 INFO (qtp1232216858-18983) [ x:collection1] o.a.s.u.p.LogUpdateProcessorFactory [collection1] webapp=/solr path=/update params={wt=javabin&version=2}{add=[13]} 0 0
    [junit4] 2> 2634143 INFO (qtp1232216858-18984) [ x:collection1] o.a.s.u.p.LogUpdateProcessorFactory [collection1] webapp=/solr path=/update params={wt=javabin&version=2}{add=[14]} 0 0
    [junit4] 2> 2634145 INFO (qtp1232216858-18971) [ x:collection1] o.a.s.u.p.LogUpdateProcessorFactory [collection1] webapp=/solr path=/update params={wt=javabin&version=2}{add=[15]} 0 0
    [junit4] 2> 2634151 INFO (qtp1232216858-18973) [ x:collection1] o.a.s.u.p.LogUpdateProcessorFactory [collection1] webapp=/solr path=/update params={wt=javabin&version=2}{add=[16]} 0 0
    [junit4] 2> 2634153 INFO (qtp1232216858-18974) [ x:collection1] o.a.s.u.p.LogUpdateProcessorFactory [collection1] webapp=/solr path=/update params={wt=javabin&version=2}{add=[17]} 0 0
    [junit4] 2> 2634157 INFO (qtp1232216858-18975) [ x:collection1] o.a.s.u.p.LogUpdateProcessorFactory [collection1] webapp=/solr path=/update params={wt=javabin&version=2}{add=[18]} 0 0
    [junit4] 2> 2634158 INFO (qtp1232216858-18972) [ x:collection1] o.a.s.u.p.LogUpdateProcessorFactory [collection1] webapp=/solr path=/update params={wt=javabin&version=2}{add=[19]} 0 0
    [junit4] 2> 2634163 INFO (qtp1232216858-18982) [ x:collection1] o.a.s.u.p.LogUpdateProcessorFactory [collection1] webapp=/solr path=/update params={wt=javabin&version=2}{add=[20]} 0 0
    [junit4] 2> 2634167 INFO (qtp1232216858-18983) [ x:collection1] o.a.s.u.p.LogUpdateProcessorFactory [collection1] webapp=/solr path=/update params={wt=javabin&version=2}{add=[21]} 0 0
    [junit4] 2> 2634168 INFO (qtp1232216858-18984) [ x:collection1] o.a.s.u.p.LogUpdateProcessorFactory [collection1] webapp=/solr path=/update params={wt=javabin&version=2}{add=[22]} 0 0
    [junit4] 2> 2634171 INFO (qtp1232216858-18971) [ x:collection1] o.a.s.u.p.LogUpdateProcessorFactory [collection1] webapp=/solr path=/update params={wt=javabin&version=2}{add=[23]} 0 0
    [junit4] 2> 2634180 INFO (qtp1232216858-18973) [ x:collection1] o.a.s.u.p.LogUpdateProcessorFactory [collection1] webapp=/solr path=/update params={wt=javabin&version=2}{add=[24]} 0 0
    [junit4] 2> 2634182 INFO (qtp1232216858-18974) [ x:collection1] o.a.s.u.p.LogUpdateProcessorFactory [collection1] webapp=/solr path=/update params={wt=javabin&version=2}{add=[25]} 0 0
    [junit4] 2> 2634190 INFO (qtp1232216858-18975) [ x:collection1] o.a.s.u.p.LogUpdateProcessorFactory [collection1] webapp=/solr path=/update params={wt=javabin&version=2}{add=[26]} 0 0
    [junit4] 2> 2634192 INFO (qtp1232216858-18972) [ x:collection1] o.a.s.u.p.LogUpdateProcessorFactory [collection1] webapp=/solr path=/update params={wt=javabin&version=2}{add=[27]} 0 0
    [junit4] 2> 2634195 INFO (qtp1232216858-18982) [ x:collection1] o.a.s.u.p.LogUpdateProcessorFactory [collection1] webapp=/solr path=/update params={wt=javabin&version=2}{add=[28]} 0 0
    [junit4] 2> 2634199 INFO (qtp1232216858-18983) [ x:collection1] o.a.s.u.p.LogUpdateProcessorFactory [collection1] webapp=/solr path=/update params={wt=javabin&version=2}{add=[29]} 0 0
    [junit4] 2> 2634207 INFO (qtp1232216858-18984) [ x:collection1] o.a.s.u.p.LogUpdateProcessorFactory [collection1] webapp=/solr path=/update params={wt=javabin&version=2}{add=[30]} 0 0
    [junit4] 2> 2634210 INFO (qtp1232216858-18984) [ x:collection1] o.a.s.u.p.LogUpdateProcessorFactory [collection1] webapp=/solr path=/update params={wt=javabin&version=2}{add=[31]} 0 0
    [junit4] 2> 2634225 INFO (qtp1232216858-18971) [ x:collection1] o.a.s.u.p.LogUpdateProcessorFactory [collection1] webapp=/solr path=/update params={wt=javabin&version=2}{add=[32]} 0 0
    [junit4] 2> 2634245 INFO (qtp1232216858-18973) [ x:collection1] o.a.s.u.p.LogUpdateProcessorFactory [collection1] webapp=/solr path=/update params={wt=javabin&version=2}{add=[33]} 0 0
    [junit4] 2> 2634249 INFO (qtp1232216858-18974) [ x:collection1] o.a.s.u.p.LogUpdateProcessorFactory [collection1] webapp=/solr path=/update params={wt=javabin&version=2}{add=[34]} 0 0
    [junit4] 2> 2634268 INFO (qtp1232216858-18975) [ x:collection1] o.a.s.u.p.LogUpdateProcessorFactory [collection1] webapp=/solr path=/update params={wt=javabin&version=2}{add=[35]} 0 0
    [junit4] 2> 2634288 INFO (qtp1232216858-18972) [ x:collection1] o.a.s.u.DirectUpdateHandler2 start commit{,optimize=false,openSearcher=true,waitSearcher=true,expungeDeletes=false,softCommit=false,prepareCommit=false}
    [junit4] 2> 2634502 INFO (qtp1232216858-18972) [ x:collection1] o.a.s.c.SolrDeletionPolicy SolrDeletionPolicy.onCommit: commits: num=2
    [junit4] 2> commit{dir=MockDirectoryWrapper(RAMDirectory@54b80fad lockFactory=org.apache.lucene.store.SingleInstanceLockFactory@17c72186),segFN=segments_1,generation=1}
    [junit4] 2> commit{dir=MockDirectoryWrapper(RAMDirectory@54b80fad lockFactory=org.apache.lucene.store.SingleInstanceLockFactory@17c72186),segFN=segments_2,generation=2}
    [junit4] 2> 2634503 INFO (qtp1232216858-18972) [ x:collection1] o.a.s.c.SolrDeletionPolicy newest commit generation = 2
    [junit4] 2> 2634513 INFO (qtp1232216858-18972) [ x:collection1] o.a.s.s.SolrIndexSearcher Opening Searcher@69f45795[collection1] main
    [junit4] 2> 2634515 INFO (searcherExecutor-8974-thread-1-processing-x:collection1) [ x:collection1] o.a.s.c.SolrCore [collection1] Registered new searcher Searcher@69f45795[collection1] main{ExitableDirectoryReader(UninvertingDirectoryReader(Uninverting(_0(5.5.2):c36)))}
    [junit4] 2> 2634515 INFO (qtp1232216858-18972) [ x:collection1] o.a.s.u.DirectUpdateHandler2 end_commit_flush
    [junit4] 2> 2634515 INFO (qtp1232216858-18972) [ x:collection1] o.a.s.u.p.LogUpdateProcessorFactory [collection1] webapp=/solr path=/update params={waitSearcher=true&commit=true&softCommit=false&wt=javabin&version=2}{commit=} 0 227
    [junit4] 2> 2634522 INFO (Thread-6876) [ x:collection1] o.a.s.h.SnapShooter Creating backup snapshot <not named> at C:\Users\jenkins\workspace\Lucene-Solr-5.5-Windows\solr\build\solr-core\test\J0\temp\solr.handler.TestReplicationHandlerBackup_AABF9F6EB5B189AE-001\solr-instance-001\.\collection1\data\
    [junit4] 2> 2634523 INFO (qtp1232216858-18982) [ x:collection1] o.a.s.c.S.Request [collection1] webapp=/solr path=/replication params={command=backup} status=0 QTime=4
    [junit4] 2> 2634527 INFO (Thread-6877) [ x:collection1] o.a.s.h.SnapShooter Creating backup snapshot <not named> at C:\Users\jenkins\workspace\Lucene-Solr-5.5-Windows\solr\build\solr-core\test\J0\temp\solr.handler.TestReplicationHandlerBackup_AABF9F6EB5B189AE-001\solr-instance-001\.\collection1\data\
    [junit4] 2> 2634527 INFO (qtp1232216858-18983) [ x:collection1] o.a.s.c.S.Request [collection1] webapp=/solr path=/replication params={command=details} status=0 QTime=2
    [junit4] 2> 2634539 INFO (Thread-6877) [ x:collection1] o.a.s.h.SnapShooter Done creating backup snapshot: <not named> at C:\Users\jenkins\workspace\Lucene-Solr-5.5-Windows\solr\build\solr-core\test\J0\temp\solr.handler.TestReplicationHandlerBackup_AABF9F6EB5B189AE-001\solr-instance-001\.\collection1\data\
    [junit4] 2> 2634551 ERROR (Thread-6876) [ x:collection1] o.a.s.h.SnapShooter Exception while creating snapshot
    [junit4] 2> java.nio.file.NoSuchFileException: C:\Users\jenkins\workspace\Lucene-Solr-5.5-Windows\solr\build\solr-core\test\J0\temp\solr.handler.TestReplicationHandlerBackup_AABF9F6EB5B189AE-001\solr-instance-001\collection1\data\snapshot.20160618183038024\segments_2
    [junit4] 2> at sun.nio.fs.WindowsException.translateToIOException(WindowsException.java:79)
    [junit4] 2> at sun.nio.fs.WindowsException.rethrowAsIOException(WindowsException.java:97)
    [junit4] 2> at sun.nio.fs.WindowsException.rethrowAsIOException(WindowsException.java:102)
    [junit4] 2> at sun.nio.fs.WindowsFileSystemProvider.newByteChannel(WindowsFileSystemProvider.java:230)
    [junit4] 2> at java.nio.file.spi.FileSystemProvider.newOutputStream(FileSystemProvider.java:434)
    [junit4] 2> at java.nio.file.Files.newOutputStream(Files.java:216)
    [junit4] 2> at org.apache.lucene.store.FSDirectory$FSIndexOutput.<init>(FSDirectory.java:271)
    [junit4] 2> at org.apache.lucene.store.FSDirectory.createOutput(FSDirectory.java:224)
    [junit4] 2> at org.apache.lucene.store.Directory.copyFrom(Directory.java:151)
    [junit4] 2> at org.apache.solr.handler.SnapShooter.copyFiles(SnapShooter.java:203)
    [junit4] 2> at org.apache.solr.handler.SnapShooter.createSnapshot(SnapShooter.java:136)
    [junit4] 2> at org.apache.solr.handler.SnapShooter$1.run(SnapShooter.java:85)
    [junit4] 2> 2635538 INFO (qtp1232216858-18984) [ x:collection1] o.a.s.c.S.Request [collection1] webapp=/solr path=/replication params={command=details} status=0 QTime=0
    [junit4] 2> 2635539 INFO (TEST-TestReplicationHandlerBackup.doTestBackup-seed#[AABF9F6EB5B189AE]) [ ] o.a.s.SolrTestCaseJ4 ###Ending doTestBackup
    [junit4] 2> 2635541 INFO (TEST-TestReplicationHandlerBackup.doTestBackup-seed#[AABF9F6EB5B189AE]) [ ] o.e.j.s.ServerConnector Stopped ServerConnector@32999cc5{HTTP/1.1}{127.0.0.1:0}
    [junit4] 2> 2635541 INFO (TEST-TestReplicationHandlerBackup.doTestBackup-seed#[AABF9F6EB5B189AE]) [ ] o.a.s.c.CoreContainer Shutting down CoreContainer instance=538875560
    [junit4] 2> 2635543 INFO (coreCloseExecutor-8978-thread-1) [ x:collection1] o.a.s.c.SolrCore [collection1] CLOSING SolrCore org.apache.solr.core.SolrCore@473382d5
    [junit4] 2> 2635543 INFO (coreCloseExecutor-8978-thread-1) [ x:collection1] o.a.s.u.DirectUpdateHandler2 closing DirectUpdateHandler2{commits=1,autocommits=0,soft autocommits=0,optimizes=0,rollbacks=0,expungeDeletes=0,docsPending=0,adds=0,deletesById=0,deletesByQuery=0,errors=0,cumulative_adds=36,cumulative_deletesById=0,cumulative_deletesByQuery=1,cumulative_errors=0}
    [junit4] 2> 2635543 INFO (coreCloseExecutor-8978-thread-1) [ x:collection1] o.a.s.u.SolrCoreState Closing SolrCoreState
    [junit4] 2> 2635543 INFO (coreCloseExecutor-8978-thread-1) [ x:collection1] o.a.s.u.DefaultSolrCoreState SolrCoreState ref count has reached 0 - closing IndexWriter
    [junit4] 2> 2635543 INFO (coreCloseExecutor-8978-thread-1) [ x:collection1] o.a.s.u.DefaultSolrCoreState closing IndexWriter with IndexWriterCloser
    [junit4] 2> 2635543 INFO (coreCloseExecutor-8978-thread-1) [ x:collection1] o.a.s.c.SolrCore [collection1] Closing main searcher on request.
    [junit4] 2> 2635544 INFO (coreCloseExecutor-8978-thread-1) [ x:collection1] o.a.s.c.CachingDirectoryFactory Closing MockDirectoryFactory - 2 directories currently being tracked
    [junit4] 2> 2635544 INFO (coreCloseExecutor-8978-thread-1) [ x:collection1] o.a.s.c.CachingDirectoryFactory looking to close C:\Users\jenkins\workspace\Lucene-Solr-5.5-Windows\solr\build\solr-core\test\J0\temp\solr.handler.TestReplicationHandlerBackup_AABF9F6EB5B189AE-001\solr-instance-001\.\collection1\data\ [CachedDir<<refCount=0;path=C:\Users\jenkins\workspace\Lucene-Solr-5.5-Windows\solr\build\solr-core\test\J0\temp\solr.handler.TestReplicationHandlerBackup_AABF9F6EB5B189AE-001\solr-instance-001\.\collection1\data\;done=false>>]
    [junit4] 2> 2635544 INFO (coreCloseExecutor-8978-thread-1) [ x:collection1] o.a.s.c.CachingDirectoryFactory Closing directory: C:\Users\jenkins\workspace\Lucene-Solr-5.5-Windows\solr\build\solr-core\test\J0\temp\solr.handler.TestReplicationHandlerBackup_AABF9F6EB5B189AE-001\solr-instance-001\.\collection1\data\
    [junit4] 2> 2635544 INFO (coreCloseExecutor-8978-thread-1) [ x:collection1] o.a.s.c.CachingDirectoryFactory looking to close C:\Users\jenkins\workspace\Lucene-Solr-5.5-Windows\solr\build\solr-core\test\J0\temp\solr.handler.TestReplicationHandlerBackup_AABF9F6EB5B189AE-001\solr-instance-001\.\collection1\data\index [CachedDir<<refCount=0;path=C:\Users\jenkins\workspace\Lucene-Solr-5.5-Windows\solr\build\solr-core\test\J0\temp\solr.handler.TestReplicationHandlerBackup_AABF9F6EB5B189AE-001\solr-instance-001\.\collection1\data\index;done=false>>]
    [junit4] 2> 2635544 INFO (coreCloseExecutor-8978-thread-1) [ x:collection1] o.a.s.c.CachingDirectoryFactory Closing directory: C:\Users\jenkins\workspace\Lucene-Solr-5.5-Windows\solr\build\solr-core\test\J0\temp\solr.handler.TestReplicationHandlerBackup_AABF9F6EB5B189AE-001\solr-instance-001\.\collection1\data\index
    [junit4] 2> 2635545 INFO (TEST-TestReplicationHandlerBackup.doTestBackup-seed#[AABF9F6EB5B189AE]) [ ] o.e.j.s.h.ContextHandler Stopped o.e.j.s.ServletContextHandler@414d8695{/solr,null,UNAVAILABLE}
    [junit4] 2> NOTE: reproduce with: ant test -Dtestcase=TestReplicationHandlerBackup -Dtests.method=doTestBackup -Dtests.seed=AABF9F6EB5B189AE -Dtests.slow=true -Dtests.locale=lt-LT -Dtests.timezone=Asia/Samarkand -Dtests.asserts=true -Dtests.file.encoding=UTF-8
    [junit4] FAILURE 2.02s J0 | TestReplicationHandlerBackup.doTestBackup <<<
    [junit4] > Throwable #1: java.lang.AssertionError: Failed to create backup
    [junit4] > at __randomizedtesting.SeedInfo.seed([AABF9F6EB5B189AE:EB34BF0B920F7AE1]:0)
    [junit4] > at org.apache.solr.handler.CheckBackupStatus.fetchStatus(CheckBackupStatus.java:50)
    [junit4] > at org.apache.solr.handler.TestReplicationHandlerBackup.doTestBackup(TestReplicationHandlerBackup.java:196)
    [junit4] > at java.lang.Thread.run(Thread.java:745)
    [junit4] 2> 2635562 INFO (TEST-TestReplicationHandlerBackup.testBackupOnCommit-seed#[AABF9F6EB5B189AE]) [ ] o.a.s.SolrTestCaseJ4 ###Starting testBackupOnCommit
    [junit4] 2> 2635565 INFO (TEST-TestReplicationHandlerBackup.testBackupOnCommit-seed#[AABF9F6EB5B189AE]) [ ] o.a.s.SolrTestCaseJ4 Writing core.properties file to C:\Users\jenkins\workspace\Lucene-Solr-5.5-Windows\solr\build\solr-core\test\J0\temp\solr.handler.TestReplicationHandlerBackup_AABF9F6EB5B189AE-001\solr-instance-002\collection1
    [junit4] 2> 2635582 INFO (TEST-TestReplicationHandlerBackup.testBackupOnCommit-seed#[AABF9F6EB5B189AE]) [ ] o.e.j.s.Server jetty-9.2.13.v20150730
    [junit4] 2> 2635584 INFO (TEST-TestReplicationHandlerBackup.testBackupOnCommit-seed#[AABF9F6EB5B189AE]) [ ] o.e.j.s.h.ContextHandler Started o.e.j.s.ServletContextHandler@70a9eb92{/solr,null,AVAILABLE}
    [junit4] 2> 2635586 INFO (TEST-TestReplicationHandlerBackup.testBackupOnCommit-seed#[AABF9F6EB5B189AE]) [ ] o.e.j.s.ServerConnector Started ServerConnector@2449881a{HTTP/1.1}{127.0.0.1:60133}
    [junit4] 2> 2635586 INFO (TEST-TestReplicationHandlerBackup.testBackupOnCommit-seed#[AABF9F6EB5B189AE]) [ ] o.e.j.s.Server Started @2640083ms
    [junit4] 2> 2635586 INFO (TEST-TestReplicationHandlerBackup.testBackupOnCommit-seed#[AABF9F6EB5B189AE]) [ ] o.a.s.c.s.e.JettySolrRunner Jetty properties: {solr.data.dir=C:\Users\jenkins\workspace\Lucene-Solr-5.5-Windows\solr\build\solr-core\test\J0\temp\solr.handler.TestReplicationHandlerBackup_AABF9F6EB5B189AE-001\solr-instance-002\collection1\data, hostContext=/solr, hostPort=60133}
    [junit4] 2> 2635587 INFO (TEST-TestReplicationHandlerBackup.testBackupOnCommit-seed#[AABF9F6EB5B189AE]) [ ] o.a.s.s.SolrDispatchFilter SolrDispatchFilter.init(): sun.misc.Launcher$AppClassLoader@73d16e93
    [junit4] 2> 2635587 INFO (TEST-TestReplicationHandlerBackup.testBackupOnCommit-seed#[AABF9F6EB5B189AE]) [ ] o.a.s.c.SolrResourceLoader new SolrResourceLoader for directory: 'C:\Users\jenkins\workspace\Lucene-Solr-5.5-Windows\solr\build\solr-core\test\J0\temp\solr.handler.TestReplicationHandlerBackup_AABF9F6EB5B189AE-001\solr-instance-002'
    [junit4] 2> 2635587 INFO (TEST-TestReplicationHandlerBackup.testBackupOnCommit-seed#[AABF9F6EB5B189AE]) [ ] o.a.s.c.SolrResourceLoader JNDI not configured for solr (NoInitialContextEx)
    [junit4] 2> 2635588 INFO (TEST-TestReplicationHandlerBackup.testBackupOnCommit-seed#[AABF9F6EB5B189AE]) [ ] o.a.s.c.SolrResourceLoader solr home defaulted to 'solr/' (could not find system property or JNDI)
    [junit4] 2> 2635588 INFO (TEST-TestReplicationHandlerBackup.testBackupOnCommit-seed#[AABF9F6EB5B189AE]) [ ] o.a.s.c.SolrXmlConfig Loading container configuration from C:\Users\jenkins\workspace\Lucene-Solr-5.5-Windows\solr\build\solr-core\test\J0\temp\solr.handler.TestReplicationHandlerBackup_AABF9F6EB5B189AE-001\solr-instance-002\solr.xml
    [junit4] 2> 2635595 INFO (TEST-TestReplicationHandlerBackup.testBackupOnCommit-seed#[AABF9F6EB5B189AE]) [ ] o.a.s.c.CorePropertiesLocator Config-defined core root directory: C:\Users\jenkins\workspace\Lucene-Solr-5.5-Windows\solr\build\solr-core\test\J0\temp\solr.handler.TestReplicationHandlerBackup_AABF9F6EB5B189AE-001\solr-instance-002\.
    [junit4] 2> 2635595 INFO (TEST-TestReplicationHandlerBackup.testBackupOnCommit-seed#[AABF9F6EB5B189AE]) [ ] o.a.s.c.CoreContainer New CoreContainer 1144975320
    [junit4] 2> 2635596 INFO (TEST-TestReplicationHandlerBackup.testBackupOnCommit-seed#[AABF9F6EB5B189AE]) [ ] o.a.s.c.CoreContainer Loading cores into CoreContainer [instanceDir=C:\Users\jenkins\workspace\Lucene-Solr-5.5-Windows\solr\build\solr-core\test\J0\temp\solr.handler.TestReplicationHandlerBackup_AABF9F6EB5B189AE-001\solr-instance-002]
    [junit4] 2> 2635596 WARN (TEST-TestReplicationHandlerBackup.testBackupOnCommit-seed#[AABF9F6EB5B189AE]) [ ] o.a.s.c.CoreContainer Couldn't add files from C:\Users\jenkins\workspace\Lucene-Solr-5.5-Windows\solr\build\solr-core\test\J0\temp\solr.handler.TestReplicationHandlerBackup_AABF9F6EB5B189AE-001\solr-instance-002\lib to classpath: C:\Users\jenkins\workspace\Lucene-Solr-5.5-Windows\solr\build\solr-core\test\J0\temp\solr.handler.TestReplicationHandlerBackup_AABF9F6EB5B189AE-001\solr-instance-002\lib
    [junit4] 2> 2635596 INFO (TEST-TestReplicationHandlerBackup.testBackupOnCommit-seed#[AABF9F6EB5B189AE]) [ ] o.a.s.h.c.HttpShardHandlerFactory created with socketTimeout : 90000,urlScheme : ,connTimeout : 15000,maxConnectionsPerHost : 20,maxConnections : 10000,corePoolSize : 0,maximumPoolSize : 2147483647,maxThreadIdleTime : 5,sizeOfQueue : -1,fairnessPolicy : false,useRetries : false,
    [junit4] 2> 2635598 INFO (TEST-TestReplicationHandlerBackup.testBackupOnCommit-seed#[AABF9F6EB5B189AE]) [ ] o.a.s.u.UpdateShardHandler Creating UpdateShardHandler HTTP client with params: socketTimeout=340000&connTimeout=45000&retry=true
    [junit4] 2> 2635599 INFO (TEST-TestReplicationHandlerBackup.testBackupOnCommit-seed#[AABF9F6EB5B189AE]) [ ] o.a.s.l.LogWatcher SLF4J impl is org.slf4j.impl.Log4jLoggerFactory
    [junit4] 2> 2635599 INFO (TEST-TestReplicationHandlerBackup.testBackupOnCommit-seed#[AABF9F6EB5B189AE]) [ ] o.a.s.l.LogWatcher Registering Log Listener [Log4j (org.slf4j.impl.Log4jLoggerFactory)]
    [junit4] 2> 2635599 INFO (TEST-TestReplicationHandlerBackup.testBackupOnCommit-seed#[AABF9F6EB5B189AE]) [ ] o.a.s.c.CoreContainer Security conf doesn't exist. Skipping setup for authorization module.
    [junit4] 2> 2635600 INFO (TEST-TestReplicationHandlerBackup.testBackupOnCommit-seed#[AABF9F6EB5B189AE]) [ ] o.a.s.c.CoreContainer No authentication plugin used.
    [junit4] 2> 2635600 INFO (TEST-TestReplicationHandlerBackup.testBackupOnCommit-seed#[AABF9F6EB5B189AE]) [ ] o.a.s.c.CorePropertiesLocator Looking for core definitions underneath C:\Users\jenkins\workspace\Lucene-Solr-5.5-Windows\solr\build\solr-core\test\J0\temp\solr.handler.TestReplicationHandlerBackup_AABF9F6EB5B189AE-001\solr-instance-002\.
    [junit4] 2> 2635607 INFO (TEST-TestReplicationHandlerBackup.testBackupOnCommit-seed#[AABF9F6EB5B189AE]) [ ] o.a.s.c.CoreDescriptor Created CoreDescriptor: {name=collection1, config=solrconfig.xml, loadOnStartup=true, schema=schema.xml, configSetProperties=configsetprops.json, transient=false, dataDir=data\}
    [junit4] 2> 2635607 INFO (TEST-TestReplicationHandlerBackup.testBackupOnCommit-seed#[AABF9F6EB5B189AE]) [ ] o.a.s.c.CorePropertiesLocator Found core collection1 in C:\Users\jenkins\workspace\Lucene-Solr-5.5-Windows\solr\build\solr-core\test\J0\temp\solr.handler.TestReplicationHandlerBackup_AABF9F6EB5B189AE-001\solr-instance-002\.\collection1
    [junit4] 2> 2635607 INFO (TEST-TestReplicationHandlerBackup.testBackupOnCommit-seed#[AABF9F6EB5B189AE]) [ ] o.a.s.c.CorePropertiesLocator Found 1 core definitions
    [junit4] 2> 2635608 INFO (TEST-TestReplicationHandlerBackup.testBackupOnCommit-seed#[AABF9F6EB5B189AE]) [ ] o.a.s.s.SolrDispatchFilter user.dir=C:\Users\jenkins\workspace\Lucene-Solr-5.5-Windows\solr\build\solr-core\test\J0
    [junit4] 2> 2635608 INFO (TEST-TestReplicationHandlerBackup.testBackupOnCommit-seed#[AABF9F6EB5B189AE]) [ ] o.a.s.s.SolrDispatchFilter SolrDispatchFilter.init() done
    [junit4] 2> 2635608 INFO (coreLoadExecutor-8985-thread-1) [ ] o.a.s.c.SolrResourceLoader new SolrResourceLoader for directory: 'C:\Users\jenkins\workspace\Lucene-Solr-5.5-Windows\solr\build\solr-core\test\J0\temp\solr.handler.TestReplicationHandlerBackup_AABF9F6EB5B189AE-001\solr-instance-002\collection1'
    [junit4] 2> 2635608 INFO (coreLoadExecutor-8985-thread-1) [ ] o.a.s.c.SolrResourceLoader JNDI not configured for solr (NoInitialContextEx)
    [junit4] 2> 2635608 INFO (coreLoadExecutor-8985-thread-1) [ ] o.a.s.c.SolrResourceLoader solr home defaulted to 'solr/' (could not find system property or JNDI)
    [junit4] 2> 2635623 INFO (coreLoadExecutor-8985-thread-1) [ ] o.a.s.c.SolrConfig current version of requestparams : -1
    [junit4] 2> 2635628 INFO (coreLoadExecutor-8985-thread-1) [ ] o.a.s.c.SolrConfig Using Lucene MatchVersion: 5.5.2
    [junit4] 2> 2635634 INFO (coreLoadExecutor-8985-thread-1) [ ] o.a.s.c.SolrConfig Loaded SolrConfig: solrconfig.xml
    [junit4] 2> 2635639 INFO (coreLoadExecutor-8985-thread-1) [ ] o.a.s.s.IndexSchema [collection1] Schema name=test
    [junit4] 2> 2635643 INFO (coreLoadExecutor-8985-thread-1) [ ] o.a.s.s.IndexSchema unique key field: id
    [junit4] 2> 2635646 INFO (coreLoadExecutor-8985-thread-1) [ ] o.a.s.c.ConfigSetProperties Did not find ConfigSet properties, assuming default properties: Can't find resource 'configsetprops.json' in classpath or 'C:\Users\jenkins\workspace\Lucene-Solr-5.5-Windows\solr\build\solr-core\test\J0\temp\solr.handler.TestReplicationHandlerBackup_AABF9F6EB5B189AE-001\solr-instance-002\collection1'
    [junit4] 2> 2635646 INFO (coreLoadExecutor-8985-thread-1) [ ] o.a.s.c.CoreContainer Creating SolrCore 'collection1' using configuration from instancedir C:\Users\jenkins\workspace\Lucene-Solr-5.5-Windows\solr\build\solr-core\test\J0\temp\solr.handler.TestReplicationHandlerBackup_AABF9F6EB5B189AE-001\solr-instance-002\.\collection1
    [junit4] 2> 2635646 INFO (coreLoadExecutor-8985-thread-1) [ x:collection1] o.a.s.c.SolrCore org.apache.solr.core.MockDirectoryFactory
    [junit4] 2> 2635646 INFO (coreLoadExecutor-8985-thread-1) [ x:collection1] o.a.s.c.SolrCore [[collection1] ] Opening new SolrCore at [C:\Users\jenkins\workspace\Lucene-Solr-5.5-Windows\solr\build\solr-core\test\J0\temp\solr.handler.TestReplicationHandlerBackup_AABF9F6EB5B189AE-001\solr-instance-002\collection1], dataDir=[C:\Users\jenkins\workspace\Lucene-Solr-5.5-Windows\solr\build\solr-core\test\J0\temp\solr.handler.TestReplicationHandlerBackup_AABF9F6EB5B189AE-001\solr-instance-002\.\collection1\data\]
    [junit4] 2> 2635647 INFO (coreLoadExecutor-8985-thread-1) [ x:collection1] o.a.s.c.SolrCore JMX monitoring not detected for core: collection1
    [junit4] 2> 2635647 INFO (coreLoadExecutor-8985-thread-1) [ x:collection1] o.a.s.c.CachingDirectoryFactory return new directory for C:\Users\jenkins\workspace\Lucene-Solr-5.5-Windows\solr\build\solr-core\test\J0\temp\solr.handler.TestReplicationHandlerBackup_AABF9F6EB5B189AE-001\solr-instance-002\.\collection1\data\
    [junit4] 2> 2635647 INFO (coreLoadExecutor-8985-thread-1) [ x:collection1] o.a.s.c.SolrCore New index directory detected: old=null new=C:\Users\jenkins\workspace\Lucene-Solr-5.5-Windows\solr\build\solr-core\test\J0\temp\solr.handler.TestReplicationHandlerBackup_AABF9F6EB5B189AE-001\solr-instance-002\.\collection1\data\index/
    [junit4] 2> 2635647 WARN (coreLoadExecutor-8985-thread-1) [ x:collection1] o.a.s.c.SolrCore [collection1] Solr index directory 'C:\Users\jenkins\workspace\Lucene-Solr-5.5-Windows\solr\build\solr-core\test\J0\temp\solr.handler.TestReplicationHandlerBackup_AABF9F6EB5B189AE-001\solr-instance-002\.\collection1\data\index' doesn't exist. Creating new index...
    [junit4] 2> 2635647 INFO (coreLoadExecutor-8985-thread-1) [ x:collection1] o.a.s.c.CachingDirectoryFactory return new directory for C:\Users\jenkins\workspace\Lucene-Solr-5.5-Windows\solr\build\solr-core\test\J0\temp\solr.handler.TestReplicationHandlerBackup_AABF9F6EB5B189AE-001\solr-instance-002\.\collection1\data\index
    [junit4] 2> 2635648 INFO (coreLoadExecutor-8985-thread-1) [ x:collection1] o.a.s.u.RandomMergePolicy RandomMergePolicy wrapping class org.apache.lucene.index.LogDocMergePolicy: [LogDocMergePolicy: minMergeSize=1000, mergeFactor=43, maxMergeSize=9223372036854775807, maxMergeSizeForForcedMerge=9223372036854775807, calibrateSizeByDeletes=true, maxMergeDocs=2147483647, maxCFSSegmentSizeMB=8.796093022207999E12, noCFSRatio=1.0]
    [junit4] 2> 2635648 INFO (coreLoadExecutor-8985-thread-1) [ x:collection1] o.a.s.c.SolrDeletionPolicy SolrDeletionPolicy.onCommit: commits: num=1
    [junit4] 2> commit{dir=MockDirectoryWrapper(RAMDirectory@674e0e0c lockFactory=org.apache.lucene.store.SingleInstanceLockFactory@223bfba9),segFN=segments_1,generation=1}
    [junit4] 2> 2635648 INFO (coreLoadExecutor-8985-thread-1) [ x:collection1] o.a.s.c.SolrDeletionPolicy newest commit generation = 1
    [junit4] 2> 2635649 INFO (coreLoadExecutor-8985-thread-1) [ x:collection1] o.a.s.c.SolrCore no updateRequestProcessorChain defined as default, creating implicit default
    [junit4] 2> 2635650 INFO (OldIndexDirectoryCleanupThreadForCore-collection1) [ x:collection1] o.a.s.c.SolrCore Looking for old index directories to cleanup for core collection1 in C:\Users\jenkins\workspace\Lucene-Solr-5.5-Windows\solr\build\solr-core\test\J0\temp\solr.handler.TestReplicationHandlerBackup_AABF9F6EB5B189AE-001\solr-instance-002\.\collection1\data\
    [junit4] 2> 2635650 INFO (coreLoadExecutor-8985-thread-1) [ x:collection1] o.a.s.h.l.XMLLoader xsltCacheLifetimeSeconds=60
    [junit4] 2> 2635652 INFO (coreLoadExecutor-8985-thread-1) [ x:collection1] o.a.s.h.l.XMLLoader xsltCacheLifetimeSeconds=60
    [junit4] 2> 2635652 INFO (coreLoadExecutor-8985-thread-1) [ x:collection1] o.a.s.h.l.XMLLoader xsltCacheLifetimeSeconds=60
    [junit4] 2> 2635656 INFO (coreLoadExecutor-8985-thread-1) [ x:collection1] o.a.s.h.l.XMLLoader xsltCacheLifetimeSeconds=60
    [junit4] 2> 2635657 INFO (coreLoadExecutor-8985-thread-1) [ x:collection1] o.a.s.c.PluginBag requestHandler : 'lazy' created with startup=lazy
    [junit4] 2> 2635657 INFO (coreLoadExecutor-8985-thread-1) [ x:collection1] o.a.s.c.RequestHandlers Registered paths: /admin/mbeans,standard,lazy,/update/csv,/update/json/docs,/admin/luke,/admin/segments,/get,/admin/system,/replication,/admin/properties,defaults,/config,/schema,/admin/plugins,/admin/logging,/update/json,/admin/threads,/admin/ping,/update,/admin/file
    [junit4] 2> 2635659 INFO (coreLoadExecutor-8985-thread-1) [ x:collection1] o.a.s.c.SolrCore Using default statsCache cache: org.apache.solr.search.stats.LocalStatsCache
    [junit4] 2> 2635659 INFO (coreLoadExecutor-8985-thread-1) [ x:collection1] o.a.s.u.CommitTracker Hard AutoCommit: disabled
    [junit4] 2> 2635659 INFO (coreLoadExecutor-8985-thread-1) [ x:collection1] o.a.s.u.CommitTracker Soft AutoCommit: disabled
    [junit4] 2> 2635659 INFO (coreLoadExecutor-8985-thread-1) [ x:collection1] o.a.s.u.RandomMergePolicy RandomMergePolicy wrapping class org.apache.lucene.index.LogDocMergePolicy: [LogDocMergePolicy: minMergeSize=1000, mergeFactor=14, maxMergeSize=9223372036854775807, maxMergeSizeForForcedMerge=9223372036854775807, calibrateSizeByDeletes=false, maxMergeDocs=2147483647, maxCFSSegmentSizeMB=8.796093022207999E12, noCFSRatio=0.6509493962552758]
    [junit4] 2> 2635659 INFO (coreLoadExecutor-8985-thread-1) [ x:collection1] o.a.s.c.SolrDeletionPolicy SolrDeletionPolicy.onInit: commits: num=1
    [junit4] 2> commit{dir=MockDirectoryWrapper(RAMDirectory@674e0e0c lockFactory=org.apache.lucene.store.SingleInstanceLockFactory@223bfba9),segFN=segments_1,generation=1}
    [junit4] 2> 2635659 INFO (coreLoadExecutor-8985-thread-1) [ x:collection1] o.a.s.c.SolrDeletionPolicy newest commit generation = 1
    [junit4] 2> 2635660 INFO (coreLoadExecutor-8985-thread-1) [ x:collection1] o.a.s.s.SolrIndexSearcher Opening Searcher@1a078275[collection1] main
    [junit4] 2> 2635660 INFO (coreLoadExecutor-8985-thread-1) [ x:collection1] o.a.s.r.ManagedResourceStorage File-based storage initialized to use dir: C:\Users\jenkins\workspace\Lucene-Solr-5.5-Windows\solr\build\solr-core\test\J0\temp\solr.handler.TestReplicationHandlerBackup_AABF9F6EB5B189AE-001\solr-instance-002\collection1\conf
    [junit4] 2> 2635660 INFO (coreLoadExecutor-8985-thread-1) [ x:collection1] o.a.s.r.RestManager Initializing RestManager with initArgs: {storageDir=C:\Users\jenkins\workspace\Lucene-Solr-5.5-Windows\solr\build\solr-core\test\J0\temp\solr.handler.TestReplicationHandlerBackup_AABF9F6EB5B189AE-001\solr-instance-002\collection1\conf}
    [junit4] 2> 2635660 INFO (coreLoadExecutor-8985-thread-1) [ x:collection1] o.a.s.r.ManagedResourceStorage Reading _rest_managed.json using file:dir=C:\Users\jenkins\workspace\Lucene-Solr-5.5-Windows\solr\build\solr-core\test\J0\temp\solr.handler.TestReplicationHandlerBackup_AABF9F6EB5B189AE-001\solr-instance-002\collection1\conf
    [junit4] 2> 2635660 INFO (coreLoadExecutor-8985-thread-1) [ x:collection1] o.a.s.r.RestManager Initializing 0 registered ManagedResources
    [junit4] 2> 2635660 INFO (coreLoadExecutor-8985-thread-1) [ x:collection1] o.a.s.h.ReplicationHandler Replication enabled for following config files: schema-replication2.xml:schema.xml
    [junit4] 2> 2635662 INFO (coreLoadExecutor-8985-thread-1) [ x:collection1] o.a.s.h.ReplicationHandler Commits will be reserved for 10000
    [junit4] 2> 2635662 INFO (searcherExecutor-8986-thread-1-processing-x:collection1) [ x:collection1] o.a.s.c.SolrCore [collection1] Registered new searcher Searcher@1a078275[collection1] main{ExitableDirectoryReader(UninvertingDirectoryReader())}
    [junit4] 2> 2635662 INFO (coreLoadExecutor-8985-thread-1) [ x:collection1] o.a.s.c.CoreContainer registering core: collection1
    [junit4] 2> 2636114 INFO (qtp1037677818-18996) [ x:collection1] o.a.s.u.DirectUpdateHandler2 [collection1] REMOVING ALL DOCUMENTS FROM INDEX
    [junit4] 2> 2636114 INFO (qtp1037677818-18996) [ x:collection1] o.a.s.u.p.LogUpdateProcessorFactory [collection1] webapp=/solr path=/update params={wt=javabin&version=2}{deleteByQuery=*:*} 0 0
    [junit4] 2> 2636119 INFO (qtp1037677818-18995) [ x:collection1] o.a.s.u.p.LogUpdateProcessorFactory [collection1] webapp=/solr path=/update params={wt=javabin&version=2}{add=[0]} 0 1
    [junit4] 2> 2636123 INFO (qtp1037677818-18998) [ x:collection1] o.a.s.u.p.LogUpdateProcessorFactory [collection1] webapp=/solr path=/update params={wt=javabin&version=2}{add=[1]} 0 0
    [junit4] 2> 2636127 INFO (qtp1037677818-18999) [ x:collection1] o.a.s.u.p.LogUpdateProcessorFactory [collection1] webapp=/solr path=/update params={wt=javabin&version=2}{add=[2]} 0 0
    [junit4] 2> 2636129 INFO (qtp1037677818-19000) [ x:collection1] o.a.s.u.p.LogUpdateProcessorFactory [collection1] webapp=/solr path=/update params={wt=javabin&version=2}{add=[3]} 0 0
    [junit4] 2> 2636132 INFO (qtp1037677818-19001) [ x:collection1] o.a.s.u.p.LogUpdateProcessorFactory [collection1] webapp=/solr path=/update params={wt=javabin&version=2}{add=[4]} 0 0
    [junit4] 2> 2636134 INFO (qtp1037677818-18996) [ x:collection1] o.a.s.u.p.LogUpdateProcessorFactory [collection1] webapp=/solr path=/update params={wt=javabin&version=2}{add=[5]} 0 0
    [junit4] 2> 2636136 INFO (qtp1037677818-18995) [ x:collection1] o.a.s.u.p.LogUpdateProcessorFactory [collection1] webapp=/solr path=/update params={wt=javabin&version=2}{add=[6]} 0 0
    [junit4] 2> 2636138 INFO (qtp1037677818-18998) [ x:collection1] o.a.s.u.p.LogUpdateProcessorFactory [collection1] webapp=/solr path=/update params={wt=javabin&version=2}{add=[7]} 0 0
    [junit4] 2> 2636141 INFO (qtp1037677818-18999) [ x:collection1] o.a.s.u.p.LogUpdateProcessorFactory [collection1] webapp=/solr path=/update params={wt=javabin&version=2}{add=[8]} 0 0
    [junit4] 2> 2636143 INFO (qtp1037677818-19000) [ x:collection1] o.a.s.u.p.LogUpdateProcessorFactory [collection1] webapp=/solr path=/update params={wt=javabin&version=2}{add=[9]} 0 0
    [junit4] 2> 2636145 INFO (qtp1037677818-19001) [ x:collection1] o.a.s.u.p.LogUpdateProcessorFactory [collection1] webapp=/solr path=/update params={wt=javabin&version=2}{add=[10]} 0 0
    [junit4] 2> 2636147 INFO (qtp1037677818-18996) [ x:collection1] o.a.s.u.p.LogUpdateProcessorFactory [collection1] webapp=/solr path=/update params={wt=javabin&version=2}{add=[11]} 0 0
    [junit4] 2> 2636149 INFO (qtp1037677818-18995) [ x:collection1] o.a.s.u.p.LogUpdateProcessorFactory [collection1] webapp=/solr path=/update params={wt=javabin&version=2}{add=[12]} 0 0
    [junit4] 2> 2636152 INFO (qtp1037677818-18998) [ x:collection1] o.a.s.u.p.LogUpdateProcessorFactory [collection1] webapp=/solr path=/update params={wt=javabin&version=2}{add=[13]} 0 0
    [junit4] 2> 2636154 INFO (qtp1037677818-18999) [ x:collection1] o.a.s.u.p.LogUpdateProcessorFactory [collection1] webapp=/solr path=/update params={wt=javabin&version=2}{add=[14]} 0 0
    [junit4] 2> 2636156 INFO (qtp1037677818-19000) [ x:collection1] o.a.s.u.p.LogUpdateProcessorFactory [collection1] webapp=/solr path=/update params={wt=javabin&version=2}{add=[15]} 0 0
    [junit4] 2> 2636158 INFO (qtp1037677818-19001) [ x:collection1] o.a.s.u.p.LogUpdateProcessorFactory [collection1] webapp=/solr path=/update params={wt=javabin&version=2}{add=[16]} 0 0
    [junit4] 2> 2636162 INFO (qtp1037677818-18996) [ x:collection1] o.a.s.u.p.LogUpdateProcessorFactory [collection1] webapp=/solr path=/update params={wt=javabin&version=2}{add=[17]} 0 0
    [junit4] 2> 2636163 INFO (qtp1037677818-18995) [ x:collection1] o.a.s.u.p.LogUpdateProcessorFactory [collection1] webapp=/solr path=/update params={wt=javabin&version=2}{add=[18]} 0 0
    [junit4] 2> 2636167 INFO (qtp1037677818-18998) [ x:collection1] o.a.s.u.p.LogUpdateProcessorFactory [collection1] webapp=/solr path=/update params={wt=javabin&version=2}{add=[19]} 0 0
    [junit4] 2> 2636169 INFO (qtp1037677818-18999) [ x:collection1] o.a.s.u.p.LogUpdateProcessorFactory [collection1] webapp=/solr path=/update params={wt=javabin&version=2}{add=[20]} 0 0
    [junit4] 2> 2636175 INFO (qtp1037677818-19000) [ x:collection1] o.a.s.u.p.LogUpdateProcessorFactory [collection1] webapp=/solr path=/update params={wt=javabin&version=2}{add=[21]} 0 0
    [junit4] 2> 2636178 INFO (qtp1037677818-19001) [ x:collection1] o.a.s.u.p.LogUpdateProcessorFactory [collection1] webapp=/solr path=/update params={wt=javabin&version=2}{add=[22]} 0 0
    [junit4] 2> 2636180 INFO (qtp1037677818-18996) [ x:collection1] o.a.s.u.p.LogUpdateProcessorFactory [collection1] webapp=/solr path=/update params={wt=javabin&version=2}{add=[23]} 0 0
    [junit4] 2> 2636182 INFO (qtp1037677818-18995) [ x:collection1] o.a.s.u.p.LogUpdateProcessorFactory [collection1] webapp=/solr path=/update params={wt=javabin&version=2}{add=[24]} 0 0
    [junit4] 2> 2636185 INFO (qtp1037677818-18998) [ x:collection1] o.a.s.u.p.LogUpdateProcessorFactory [collection1] webapp=/solr path=/update params={wt=javabin&version=2}{add=[25]} 0 0
    [junit4] 2> 2636187 INFO (qtp1037677818-18999) [ x:collection1] o.a.s.u.p.LogUpdateProcessorFactory [collection1] webapp=/solr path=/update params={wt=javabin&version=2}{add=[26]} 0 0
    [junit4] 2> 2636191 INFO (qtp1037677818-19000) [ x:collection1] o.a.s.u.p.LogUpdateProcessorFactory [collection1] webapp=/solr path=/update params={wt=javabin&version=2}{add=[27]} 0 0
    [junit4] 2> 2636196 INFO (qtp1037677818-19001) [ x:collection1] o.a.s.u.p.LogUpdateProcessorFactory [collection1] webapp=/solr path=/update params={wt=javabin&version=2}{add=[28]} 0 0
    [junit4] 2> 2636197 INFO (qtp1037677818-18996) [ x:collection1] o.a.s.u.p.LogUpdateProcessorFactory [collection1] webapp=/solr path=/update params={wt=javabin&version=2}{add=[29]} 0 0
    [junit4] 2> 2636201 INFO (qtp1037677818-18995) [ x:collection1] o.a.s.u.p.LogUpdateProcessorFactory [collection1] webapp=/solr path=/update params={wt=javabin&version=2}{add=[30]} 0 0
    [junit4] 2> 2636203 INFO (qtp1037677818-18998) [ x:collection1] o.a.s.u.p.LogUpdateProcessorFactory [collection1] webapp=/solr path=/update params={wt=javabin&version=2}{add=[31]} 0 0
    [junit4] 2> 2636205 INFO (qtp1037677818-18999) [ x:collection1] o.a.s.u.p.LogUpdateProcessorFactory [collection1] webapp=/solr path=/update params={wt=javabin&version=2}{add=[32]} 0 0
    [junit4] 2> 2636208 INFO (qtp1037677818-19000) [ x:collection1] o.a.s.u.DirectUpdateHandler2 start commit{,optimize=false,openSearcher=true,waitSearcher=true,expungeDeletes=false,softCommit=false,prepareCommit=false}
    [junit4] 2> 2636220 INFO (qtp1037677818-19000) [ x:collection1] o.a.s.c.SolrDeletionPolicy SolrDeletionPolicy.onCommit: commits: num=2
    [junit4] 2> commit{dir=MockDirectoryWrapper(RAMDirectory@674e0e0c lockFactory=org.apache.lucene.store.SingleInstanceLockFactory@223bfba9),segFN=segments_1,generation=1}
    [junit4] 2> commit{dir=MockDirectoryWrapper(RAMDirectory@674e0e0c lockFactory=org.apache.lucene.store.SingleInstanceLockFactory@223bfba9),segFN=segments_2,generation=2}
    [junit4] 2> 2636220 INFO (qtp1037677818-19000) [ x:collection1] o.a.s.c.SolrDeletionPolicy newest commit generation = 2
    [junit4] 2> 2636224 INFO (Thread-6892) [ x:collection1] o.a.s.h.SnapShooter Creating backup snapshot <not named> at C:\Users\jenkins\workspace\Lucene-Solr-5.5-Windows\solr\build\solr-core\test\J0\temp\solr.handler.TestReplicationHandlerBackup_AABF9F6EB5B189AE-001\solr-instance-002\.\collection1\data\
    [junit4] 2> 2636226 INFO (qtp1037677818-19000) [ x:collection1] o.a.s.s.SolrIndexSearcher Opening Searcher@564e7e13[collection1] main
    [junit4] 2> 2636227 INFO (qtp1037677818-19000) [ x:collection1] o.a.s.u.DirectUpdateHandler2 end_commit_flush
    [junit4] 2> 2636227 INFO (searcherExecutor-8986-thread-1-processing-x:collection1) [ x:collection1] o.a.s.c.SolrCore [collection1] Registered new searcher Searcher@564e7e13[collection1] main{ExitableDirectoryReader(UninvertingDirectoryReader(Uninverting(_0(5.5.2):c33)))}
    [junit4] 2> 2636227 INFO (qtp1037677818-19000) [ x:collection1] o.a.s.u.p.LogUpdateProcessorFactory [collection1] webapp=/solr path=/update params={waitSearcher=true&commit=true&softCommit=false&wt=javabin&version=2}{commit=} 0 18
    [junit4] 2> 2636231 INFO (qtp1037677818-19001) [ x:collection1] o.a.s.c.S.Request [collection1] webapp=/solr path=/replication params={command=details} status=0 QTime=0
    [junit4] 2> 2636236 INFO (Thread-6892) [ x:collection1] o.a.s.h.SnapShooter Done creating backup snapshot: <not named> at C:\Users\jenkins\workspace\Lucene-Solr-5.5-Windows\solr\build\solr-core\test\J0\temp\solr.handler.TestReplicationHandlerBackup_AABF9F6EB5B189AE-001\solr-instance-002\.\collection1\data\
    [junit4] 2> 2637233 INFO (qtp1037677818-18996) [ x:collection1] o.a.s.c.S.Request [collection1] webapp=/solr path=/replication params={command=details} status=0 QTime=0
    [junit4] 2> 2638240 INFO (TEST-TestReplicationHandlerBackup.testBackupOnCommit-seed#[AABF9F6EB5B189AE]) [ ] o.a.s.SolrTestCaseJ4 ###Ending testBackupOnCommit
    [junit4] 2> 2638242 INFO (TEST-TestReplicationHandlerBackup.testBackupOnCommit-seed#[AABF9F6EB5B189AE]) [ ] o.e.j.s.ServerConnector Stopped ServerConnector@2449881a{HTTP/1.1}{127.0.0.1:0}
    [junit4] 2> 2638242 INFO (TEST-TestReplicationHandlerBackup.testBackupOnCommit-seed#[AABF9F6EB5B189AE]) [ ] o.a.s.c.CoreContainer Shutting down CoreContainer instance=1144975320
    [junit4] 2> 2638243 INFO (coreCloseExecutor-8990-thread-1) [ x:collection1] o.a.s.c.SolrCore [collection1] CLOSING SolrCore org.apache.solr.core.SolrCore@19e1e1
    [junit4] 2> 2638243 INFO (coreCloseExecutor-8990-thread-1) [ x:collection1] o.a.s.u.DirectUpdateHandler2 closing DirectUpdateHandler2{commits=1,autocommits=0,soft autocommits=0,optimizes=0,rollbacks=0,expungeDeletes=0,docsPending=0,adds=0,deletesById=0,deletesByQuery=0,errors=0,cumulative_adds=33,cumulative_deletesById=0,cumulative_deletesByQuery=1,cumulative_errors=0}
    [junit4] 2> 2638243 INFO (coreCloseExecutor-8990-thread-1) [ x:collection1] o.a.s.u.SolrCoreState Closing SolrCoreState
    [junit4] 2> 2638244 INFO (coreCloseExecutor-8990-thread-1) [ x:collection1] o.a.s.u.DefaultSolrCoreState SolrCoreState ref count has reached 0 - closing IndexWriter
    [junit4] 2> 2638244 INFO (coreCloseExecutor-8990-thread-1) [ x:collection1] o.a.s.u.DefaultSolrCoreState closing IndexWriter with IndexWriterCloser
    [junit4] 2> 2638244 INFO (coreCloseExecutor-8990-thread-1) [ x:collection1] o.a.s.c.SolrCore [collection1] Closing main searcher on request.
    [junit4] 2> 2638244 INFO (coreCloseExecutor-8990-thread-1) [ x:collection1] o.a.s.c.CachingDirectoryFactory Closing MockDirectoryFactory - 2 directories currently being tracked
    [junit4] 2> 2638244 INFO (coreCloseExecutor-8990-thread-1) [ x:collection1] o.a.s.c.CachingDirectoryFactory looking to close C:\Users\jenkins\workspace\Lucene-Solr-5.5-Windows\solr\build\solr-core\test\J0\temp\solr.handler.TestReplicationHandlerBackup_AABF9F6EB5B189AE-001\solr-instance-002\.\collection1\data\ [CachedDir<<refCount=0;path=C:\Users\jenkins\workspace\Lucene-Solr-5.5-Windows\solr\build\solr-core\test\J0\temp\solr.handler.TestReplicationHandlerBackup_AABF9F6EB5B189AE-001\solr-instance-002\.\collection1\data\;done=false>>]
    [junit4] 2> 2638245 INFO (coreCloseExecutor-8990-thread-1) [ x:collection1] o.a.s.c.CachingDirectoryFactory Closing directory: C:\Users\jenkins\workspace\Lucene-Solr-5.5-Windows\solr\build\solr-core\test\J0\temp\solr.handler.TestReplicationHandlerBackup_AABF9F6EB5B189AE-001\solr-instance-002\.\collection1\data\
    [junit4] 2> 2638245 INFO (coreCloseExecutor-8990-thread-1) [ x:collection1] o.a.s.c.CachingDirectoryFactory looking to close C:\Users\jenkins\workspace\Lucene-Solr-5.5-Windows\solr\build\solr-core\test\J0\temp\solr.handler.TestReplicationHandlerBackup_AABF9F6EB5B189AE-001\solr-instance-002\.\collection1\data\index [CachedDir<<refCount=0;path=C:\Users\jenkins\workspace\Lucene-Solr-5.5-Windows\solr\build\solr-core\test\J0\temp\solr.handler.TestReplicationHandlerBackup_AABF9F6EB5B189AE-001\solr-instance-002\.\collection1\data\index;done=false>>]
    [junit4] 2> 2638245 INFO (coreCloseExecutor-8990-thread-1) [ x:collection1] o.a.s.c.CachingDirectoryFactory Closing directory: C:\Users\jenkins\workspace\Lucene-Solr-5.5-Windows\solr\build\solr-core\test\J0\temp\solr.handler.TestReplicationHandlerBackup_AABF9F6EB5B189AE-001\solr-instance-002\.\collection1\data\index
    [junit4] 2> 2638245 INFO (TEST-TestReplicationHandlerBackup.testBackupOnCommit-seed#[AABF9F6EB5B189AE]) [ ] o.e.j.s.h.ContextHandler Stopped o.e.j.s.ServletContextHandler@70a9eb92{/solr,null,UNAVAILABLE}
    [junit4] 2> 2638251 INFO (SUITE-TestReplicationHandlerBackup-seed#[AABF9F6EB5B189AE]-worker) [ ] o.a.s.SolrTestCaseJ4 ###deleteCore
    [junit4] 2> NOTE: leaving temporary files on disk at: C:\Users\jenkins\workspace\Lucene-Solr-5.5-Windows\solr\build\solr-core\test\J0\temp\solr.handler.TestReplicationHandlerBackup_AABF9F6EB5B189AE-001
    [junit4] 2> NOTE: test params are: codec=Asserting(Lucene54): {name=PostingsFormat(name=Memory doPackFST= false), id=PostingsFormat(name=Memory doPackFST= false)}, docValues:{}, sim=RandomSimilarity(queryNorm=true,coord=crazy): {}, locale=lt-LT, timezone=Asia/Samarkand
    [junit4] 2> NOTE: Windows 10 10.0 amd64/Oracle Corporation 1.8.0_92 (64-bit)/cpus=3,threads=1,free=283426656,total=512753664
    [junit4] 2> NOTE: All tests run in this JVM: [UnloadDistributedZkTest, RestartWhileUpdatingTest, TestDistributedSearch, StatelessScriptUpdateProcessorFactoryTest, OverseerTaskQueueTest, TestRandomDVFaceting, TestStressLucene, SharedFSAutoReplicaFailoverUtilsTest, TestFaceting, TestCloudSchemaless, SolrRequestParserTest, HdfsUnloadDistributedZkTest, TestManagedSynonymFilterFactory, TestSolrXml, SSLMigrationTest, TestFunctionQuery, OverriddenZkACLAndCredentialsProvidersTest, BlockJoinFacetRandomTest, TestCoreContainer, MoreLikeThisHandlerTest, TestHdfsUpdateLog, TestLRUCache, TestHighlightDedupGrouping, ClusterStateUpdateTest, DeleteInactiveReplicaTest, UUIDUpdateProcessorFallbackTest, RemoteQueryErrorTest, TestDefaultSearchFieldResource, BufferStoreTest, AssignTest, MergeStrategyTest, IndexBasedSpellCheckerTest, HLLUtilTest, ConjunctionSolrSpellCheckerTest, SpatialRPTFieldTypeTest, RegexBoostProcessorTest, TestPerFieldSimilarityWithDefaultOverride, TestSolrQueryResponse, TestStressVersions, SolrTestCaseJ4Test, DistributedSpellCheckComponentTest, VMParamsZkACLAndCredentialsProvidersTest, TestChildDocTransformer, DirectSolrSpellCheckerTest, TestLFUCache, TestShortCircuitedRequests, LeaderInitiatedRecoveryOnShardRestartTest, TestBlendedInfixSuggestions, SolrCoreTest, TermsComponentTest, HdfsNNFailoverTest, QueryElevationComponentTest, DocumentAnalysisRequestHandlerTest, CursorPagingTest, TestOrdValues, TestConfigSetImmutable, SoftAutoCommitTest, TestSort, AddSchemaFieldsUpdateProcessorFactoryTest, TestIBSimilarityFactory, TestSha256AuthenticationProvider, TestDocSet, AnalysisAfterCoreReloadTest, TestFastLRUCache, SuggesterFSTTest, TestTrieFacet, DeleteStatusTest, ActionThrottleTest, StandardRequestHandlerTest, TestSmileRequest, DirectUpdateHandlerTest, CloneFieldUpdateProcessorFactoryTest, TestSchemaManager, TestConfigSets, TestPhraseSuggestions, BigEndianAscendingWordDeserializerTest, HardAutoCommitTest, TestSearcherReuse, TestCSVLoader, TestCodecSupport, PreAnalyzedUpdateProcessorTest, ChangedSchemaMergeTest, TestSchemaResource, CollectionsAPISolrJTest, TestDFISimilarityFactory, TestPartialUpdateDeduplication, ZkStateReaderTest, AnalysisErrorHandlingTest, LeaderElectionTest, HighlighterMaxOffsetTest, TestConfig, CreateCollectionCleanupTest, TestOnReconnectListenerSupport, ZkControllerTest, SliceStateTest, SyncSliceTest, SampleTest, BitVectorTest, TestRemoteStreaming, TestUpdate, DistributedFacetPivotLongTailTest, UpdateParamsTest, HighlighterTest, TestRestoreCore, ScriptEngineTest, TestDocumentBuilder, DeleteReplicaTest, TestExtendedDismaxParser, TestCollectionAPI, HdfsRecoveryZkTest, InfoHandlerTest, ExternalFileFieldSortTest, SimpleMLTQParserTest, TestConfigSetsAPIExclusivity, UUIDFieldTest, TestSweetSpotSimilarityFactory, CollectionReloadTest, ZkCLITest, TestDownShardTolerantSearch, RuleEngineTest, TestRawResponseWriter, TestRemoveLastDynamicCopyField, SuggestComponentTest, TestFieldTypeResource, DisMaxRequestHandlerTest, TestInitParams, TestSchemaVersionResource, PingRequestHandlerTest, TestReloadAndDeleteDocs, ClusterStateTest, TestFreeTextSuggestions, FullHLLTest, DistribDocExpirationUpdateProcessorTest, TestUseDocValuesAsStored2, ReturnFieldsTest, TestHashPartitioner, TestPostingsSolrHighlighter, SOLR749Test, PrimitiveFieldTypeTest, CheckHdfsIndexTest, BasicDistributedZkTest, BasicDistributedZk2Test, OpenCloseCoreStressTest, OverseerTest, ShardRoutingTest, RecoveryZkTest, TestReplicationHandler, ZkSolrClientTest, TestZkChroot, ShardRoutingCustomTest, AutoCommitTest, TestRecovery, TermVectorComponentDistributedTest, TestRealTimeGet, TestStressReorder, TestReload, SimpleFacetsTest, StatsComponentTest, BadIndexSchemaTest, TestFiltering, TestLazyCores, CurrencyFieldXmlFileTest, SimplePostToolTest, TestCoreDiscovery, TestFoldingMultitermQuery, SuggesterTSTTest, SuggesterTest, SpatialFilterTest, SuggesterWFSTTest, PolyFieldTest, WordBreakSolrSpellCheckerTest, SchemaVersionSpecificBehaviorTest, TestPseudoReturnFields, TestWordDelimiterFilterFactory, QueryEqualityTest, DefaultValueUpdateProcessorTest, SortByFunctionTest, DocValuesMultiTest, DistanceFunctionTest, XsltUpdateRequestHandlerTest, CacheHeaderTest, TestQueryUtils, TestWriterPerf, TestReversedWildcardFilterFactory, TestOmitPositions, RequestHandlersTest, TestValueSourceCache, TermVectorComponentTest, TestSolrQueryParser, FastVectorHighlighterTest, LoggingHandlerTest, SolrPluginUtilsTest, TestJmxIntegration, QueryParsingTest, TestAnalyzedSuggestions, BinaryUpdateRequestHandlerTest, TestComponentsName, TestBinaryResponseWriter, TestQuerySenderNoQuery, BadComponentTest, TestStressRecovery, MultiTermTest, TestSearchPerf, TestElisionMultitermQuery, TestLuceneMatchVersion, TestCharFilters, TestDFRSimilarityFactory, TestLMJelinekMercerSimilarityFactory, TestFastWriter, TimeZoneUtilsTest, ResourceLoaderTest, URLClassifyProcessorTest, DateMathParserTest, PreAnalyzedFieldTest, TestSystemIdResolver, PrimUtilsTest, DateFieldTest, SpellingQueryConverterTest, DOMUtilTest, SystemInfoHandlerTest, CircularListTest, DistributedMLTComponentTest, DistributedIntervalFacetingTest, TestCursorMarkWithoutUniqueKey, TestTolerantSearch, ConnectionReuseTest, TestEmbeddedSolrServerConstructors, AliasIntegrationTest, CleanupOldIndexTest, CollectionTooManyReplicasTest, DistributedQueueTest, ForceLeaderTest, LeaderInitiatedRecoveryOnCommitTest, MigrateRouteKeyTest, OverseerRolesTest, ReplicationFactorTest, ShardSplitTest, TestExclusionRuleCollectionAccess, TestLeaderElectionZkExpiry, TestMiniSolrCloudCluster, TestRequestForwarding, TestSolrCloudWithKerberosAlt, HdfsBasicDistributedZk2Test, HdfsBasicDistributedZkTest, HdfsChaosMonkeyNothingIsSafeTest, HdfsChaosMonkeySafeLeaderTest, HdfsRecoverLeaseTest, HdfsRestartWhileUpdatingTest, HdfsSyncSliceTest, HdfsThreadLeakTest, HdfsWriteToMultipleCollectionsTest, StressHdfsTest, RulesTest, TestReplicationHandlerBackup]
    [junit4] Completed [481/573 (1!)] on J0 in 4.76s, 2 tests, 1 failure <<< FAILURES!

[...truncated 282 lines...]
BUILD FAILED
C:\Users\jenkins\workspace\Lucene-Solr-5.5-Windows\build.xml:750: The following error occurred while executing this line:
C:\Users\jenkins\workspace\Lucene-Solr-5.5-Windows\build.xml:694: The following error occurred while executing this line:
C:\Users\jenkins\workspace\Lucene-Solr-5.5-Windows\build.xml:59: The following error occurred while executing this line:
C:\Users\jenkins\workspace\Lucene-Solr-5.5-Windows\solr\build.xml:233: The following error occurred while executing this line:
C:\Users\jenkins\workspace\Lucene-Solr-5.5-Windows\solr\common-build.xml:534: The following error occurred while executing this line:
C:\Users\jenkins\workspace\Lucene-Solr-5.5-Windows\lucene\common-build.xml:1477: The following error occurred while executing this line:
C:\Users\jenkins\workspace\Lucene-Solr-5.5-Windows\lucene\common-build.xml:1033: There were test failures: 573 suites (7 ignored), 2319 tests, 1 failure, 94 ignored (49 assumptions) [seed: AABF9F6EB5B189AE]

Total time: 75 minutes 32 seconds
Build step 'Invoke Ant' marked build as failure
Archiving artifacts
[WARNINGS] Skipping publisher since build result is FAILURE
Recording test results
Email was triggered for: Failure - Any
Sending email for trigger: Failure - Any

Search Discussions

Related Discussions

Discussion Navigation
viewthread | post
posts ‹ prev | 1 of 1 | next ›
Discussion Overview
groupdev @
categorieslucene
postedJun 18, '16 at 1:38p
activeJun 18, '16 at 1:38p
posts1
users1
websitelucene.apache.org

1 user in discussion

Policeman Jenkins Server: 1 post

People

Translate

site design / logo © 2017 Grokbase