Grokbase Groups Lucene dev June 2016
FAQ
Build: http://jenkins.thetaphi.de/job/Lucene-Solr-master-Linux/17009/
Java: 64bit/jdk1.8.0_92 -XX:+UseCompressedOops -XX:+UseG1GC

1 tests failed.
FAILED: org.apache.solr.handler.TestReqParamsAPI.test

Error Message:
Could not get expected value 'first' for path 'response/params/x/_appends_/add' full output: { "responseHeader":{ "status":0, "QTime":0}, "response":{ "znodeVersion":3, "params":{ "x":{ "a":"A val", "b":"B val", "":{"v":0}}, "y":{ "p":"P val", "q":"Q val", "":{"v":2}}}}}, from server: https://127.0.0.1:43806/collection1

Stack Trace:
java.lang.AssertionError: Could not get expected value 'first' for path 'response/params/x/_appends_/add' full output: {
   "responseHeader":{
     "status":0,
     "QTime":0},
   "response":{
     "znodeVersion":3,
     "params":{
       "x":{
         "a":"A val",
         "b":"B val",
         "":{"v":0}},
       "y":{
         "p":"P val",
         "q":"Q val",
         "":{"v":2}}}}}, from server: https://127.0.0.1:43806/collection1
  at __randomizedtesting.SeedInfo.seed([5C6C84A667BB4041:D438BB7CC9472DB9]:0)
  at org.junit.Assert.fail(Assert.java:93)
  at org.junit.Assert.assertTrue(Assert.java:43)
  at org.apache.solr.core.TestSolrConfigHandler.testForResponseElement(TestSolrConfigHandler.java:481)
  at org.apache.solr.handler.TestReqParamsAPI.testReqParams(TestReqParamsAPI.java:230)
  at org.apache.solr.handler.TestReqParamsAPI.test(TestReqParamsAPI.java:61)
  at sun.reflect.NativeMethodAccessorImpl.invoke0(Native Method)
  at sun.reflect.NativeMethodAccessorImpl.invoke(NativeMethodAccessorImpl.java:62)
  at sun.reflect.DelegatingMethodAccessorImpl.invoke(DelegatingMethodAccessorImpl.java:43)
  at java.lang.reflect.Method.invoke(Method.java:498)
  at com.carrotsearch.randomizedtesting.RandomizedRunner.invoke(RandomizedRunner.java:1764)
  at com.carrotsearch.randomizedtesting.RandomizedRunner$8.evaluate(RandomizedRunner.java:871)
  at com.carrotsearch.randomizedtesting.RandomizedRunner$9.evaluate(RandomizedRunner.java:907)
  at com.carrotsearch.randomizedtesting.RandomizedRunner$10.evaluate(RandomizedRunner.java:921)
  at org.apache.solr.BaseDistributedSearchTestCase$ShardsRepeatRule$ShardsFixedStatement.callStatement(BaseDistributedSearchTestCase.java:985)
  at org.apache.solr.BaseDistributedSearchTestCase$ShardsRepeatRule$ShardsStatement.evaluate(BaseDistributedSearchTestCase.java:960)
  at com.carrotsearch.randomizedtesting.rules.SystemPropertiesRestoreRule$1.evaluate(SystemPropertiesRestoreRule.java:57)
  at org.apache.lucene.util.TestRuleSetupTeardownChained$1.evaluate(TestRuleSetupTeardownChained.java:49)
  at org.apache.lucene.util.AbstractBeforeAfterRule$1.evaluate(AbstractBeforeAfterRule.java:45)
  at org.apache.lucene.util.TestRuleThreadAndTestName$1.evaluate(TestRuleThreadAndTestName.java:48)
  at org.apache.lucene.util.TestRuleIgnoreAfterMaxFailures$1.evaluate(TestRuleIgnoreAfterMaxFailures.java:64)
  at org.apache.lucene.util.TestRuleMarkFailure$1.evaluate(TestRuleMarkFailure.java:47)
  at com.carrotsearch.randomizedtesting.rules.StatementAdapter.evaluate(StatementAdapter.java:36)
  at com.carrotsearch.randomizedtesting.ThreadLeakControl$StatementRunner.run(ThreadLeakControl.java:367)
  at com.carrotsearch.randomizedtesting.ThreadLeakControl.forkTimeoutingTask(ThreadLeakControl.java:809)
  at com.carrotsearch.randomizedtesting.ThreadLeakControl$3.evaluate(ThreadLeakControl.java:460)
  at com.carrotsearch.randomizedtesting.RandomizedRunner.runSingleTest(RandomizedRunner.java:880)
  at com.carrotsearch.randomizedtesting.RandomizedRunner$5.evaluate(RandomizedRunner.java:781)
  at com.carrotsearch.randomizedtesting.RandomizedRunner$6.evaluate(RandomizedRunner.java:816)
  at com.carrotsearch.randomizedtesting.RandomizedRunner$7.evaluate(RandomizedRunner.java:827)
  at com.carrotsearch.randomizedtesting.rules.StatementAdapter.evaluate(StatementAdapter.java:36)
  at com.carrotsearch.randomizedtesting.rules.SystemPropertiesRestoreRule$1.evaluate(SystemPropertiesRestoreRule.java:57)
  at org.apache.lucene.util.AbstractBeforeAfterRule$1.evaluate(AbstractBeforeAfterRule.java:45)
  at com.carrotsearch.randomizedtesting.rules.StatementAdapter.evaluate(StatementAdapter.java:36)
  at org.apache.lucene.util.TestRuleStoreClassName$1.evaluate(TestRuleStoreClassName.java:41)
  at com.carrotsearch.randomizedtesting.rules.NoShadowingOrOverridesOnMethodsRule$1.evaluate(NoShadowingOrOverridesOnMethodsRule.java:40)
  at com.carrotsearch.randomizedtesting.rules.NoShadowingOrOverridesOnMethodsRule$1.evaluate(NoShadowingOrOverridesOnMethodsRule.java:40)
  at com.carrotsearch.randomizedtesting.rules.StatementAdapter.evaluate(StatementAdapter.java:36)
  at com.carrotsearch.randomizedtesting.rules.StatementAdapter.evaluate(StatementAdapter.java:36)
  at com.carrotsearch.randomizedtesting.rules.StatementAdapter.evaluate(StatementAdapter.java:36)
  at org.apache.lucene.util.TestRuleAssertionsRequired$1.evaluate(TestRuleAssertionsRequired.java:53)
  at org.apache.lucene.util.TestRuleMarkFailure$1.evaluate(TestRuleMarkFailure.java:47)
  at org.apache.lucene.util.TestRuleIgnoreAfterMaxFailures$1.evaluate(TestRuleIgnoreAfterMaxFailures.java:64)
  at org.apache.lucene.util.TestRuleIgnoreTestSuites$1.evaluate(TestRuleIgnoreTestSuites.java:54)
  at com.carrotsearch.randomizedtesting.rules.StatementAdapter.evaluate(StatementAdapter.java:36)
  at com.carrotsearch.randomizedtesting.ThreadLeakControl$StatementRunner.run(ThreadLeakControl.java:367)
  at java.lang.Thread.run(Thread.java:745)




Build Log:
[...truncated 12139 lines...]
    [junit4] Suite: org.apache.solr.handler.TestReqParamsAPI
    [junit4] 2> Creating dataDir: /home/jenkins/workspace/Lucene-Solr-master-Linux/solr/build/solr-core/test/J0/temp/solr.handler.TestReqParamsAPI_5C6C84A667BB4041-001/init-core-data-001
    [junit4] 2> 1897201 INFO (SUITE-TestReqParamsAPI-seed#[5C6C84A667BB4041]-worker) [ ] o.a.s.SolrTestCaseJ4 Randomized ssl (true) and clientAuth (true) via: @org.apache.solr.util.RandomizeSSL(reason=, value=NaN, ssl=NaN, clientAuth=NaN)
    [junit4] 2> 1897202 INFO (SUITE-TestReqParamsAPI-seed#[5C6C84A667BB4041]-worker) [ ] o.a.s.BaseDistributedSearchTestCase Setting hostContext system property: /
    [junit4] 2> 1897203 INFO (TEST-TestReqParamsAPI.test-seed#[5C6C84A667BB4041]) [ ] o.a.s.c.ZkTestServer STARTING ZK TEST SERVER
    [junit4] 2> 1897203 INFO (Thread-4575) [ ] o.a.s.c.ZkTestServer client port:0.0.0.0/0.0.0.0:0
    [junit4] 2> 1897204 INFO (Thread-4575) [ ] o.a.s.c.ZkTestServer Starting server
    [junit4] 2> 1897304 INFO (TEST-TestReqParamsAPI.test-seed#[5C6C84A667BB4041]) [ ] o.a.s.c.ZkTestServer start zk server on port:45434
    [junit4] 2> 1897304 INFO (TEST-TestReqParamsAPI.test-seed#[5C6C84A667BB4041]) [ ] o.a.s.c.c.SolrZkClient Using default ZkCredentialsProvider
    [junit4] 2> 1897305 INFO (TEST-TestReqParamsAPI.test-seed#[5C6C84A667BB4041]) [ ] o.a.s.c.c.ConnectionManager Waiting for client to connect to ZooKeeper
    [junit4] 2> 1897306 INFO (zkCallback-2336-thread-1) [ ] o.a.s.c.c.ConnectionManager Watcher org.apache.solr.common.cloud.ConnectionManager@6ab22c86 name:ZooKeeperConnection Watcher:127.0.0.1:45434 got event WatchedEvent state:SyncConnected type:None path:null path:null type:None
    [junit4] 2> 1897306 INFO (TEST-TestReqParamsAPI.test-seed#[5C6C84A667BB4041]) [ ] o.a.s.c.c.ConnectionManager Client is connected to ZooKeeper
    [junit4] 2> 1897306 INFO (TEST-TestReqParamsAPI.test-seed#[5C6C84A667BB4041]) [ ] o.a.s.c.c.SolrZkClient Using default ZkACLProvider
    [junit4] 2> 1897306 INFO (TEST-TestReqParamsAPI.test-seed#[5C6C84A667BB4041]) [ ] o.a.s.c.c.SolrZkClient makePath: /solr
    [junit4] 2> 1897307 INFO (TEST-TestReqParamsAPI.test-seed#[5C6C84A667BB4041]) [ ] o.a.s.c.c.SolrZkClient Using default ZkCredentialsProvider
    [junit4] 2> 1897307 INFO (TEST-TestReqParamsAPI.test-seed#[5C6C84A667BB4041]) [ ] o.a.s.c.c.ConnectionManager Waiting for client to connect to ZooKeeper
    [junit4] 2> 1897308 INFO (zkCallback-2337-thread-1) [ ] o.a.s.c.c.ConnectionManager Watcher org.apache.solr.common.cloud.ConnectionManager@100812c2 name:ZooKeeperConnection Watcher:127.0.0.1:45434/solr got event WatchedEvent state:SyncConnected type:None path:null path:null type:None
    [junit4] 2> 1897308 INFO (TEST-TestReqParamsAPI.test-seed#[5C6C84A667BB4041]) [ ] o.a.s.c.c.ConnectionManager Client is connected to ZooKeeper
    [junit4] 2> 1897309 INFO (TEST-TestReqParamsAPI.test-seed#[5C6C84A667BB4041]) [ ] o.a.s.c.c.SolrZkClient Using default ZkACLProvider
    [junit4] 2> 1897309 INFO (TEST-TestReqParamsAPI.test-seed#[5C6C84A667BB4041]) [ ] o.a.s.c.c.SolrZkClient makePath: /collections/collection1
    [junit4] 2> 1897309 INFO (TEST-TestReqParamsAPI.test-seed#[5C6C84A667BB4041]) [ ] o.a.s.c.c.SolrZkClient makePath: /collections/collection1/shards
    [junit4] 2> 1897310 INFO (TEST-TestReqParamsAPI.test-seed#[5C6C84A667BB4041]) [ ] o.a.s.c.c.SolrZkClient makePath: /collections/control_collection
    [junit4] 2> 1897310 INFO (TEST-TestReqParamsAPI.test-seed#[5C6C84A667BB4041]) [ ] o.a.s.c.c.SolrZkClient makePath: /collections/control_collection/shards
    [junit4] 2> 1897310 INFO (TEST-TestReqParamsAPI.test-seed#[5C6C84A667BB4041]) [ ] o.a.s.c.AbstractZkTestCase put /home/jenkins/workspace/Lucene-Solr-master-Linux/solr/core/src/test-files/solr/collection1/conf/solrconfig-tlog.xml to /configs/conf1/solrconfig.xml
    [junit4] 2> 1897311 INFO (TEST-TestReqParamsAPI.test-seed#[5C6C84A667BB4041]) [ ] o.a.s.c.c.SolrZkClient makePath: /configs/conf1/solrconfig.xml
    [junit4] 2> 1897311 INFO (TEST-TestReqParamsAPI.test-seed#[5C6C84A667BB4041]) [ ] o.a.s.c.AbstractZkTestCase put /home/jenkins/workspace/Lucene-Solr-master-Linux/solr/core/src/test-files/solr/collection1/conf/schema.xml to /configs/conf1/schema.xml
    [junit4] 2> 1897311 INFO (TEST-TestReqParamsAPI.test-seed#[5C6C84A667BB4041]) [ ] o.a.s.c.c.SolrZkClient makePath: /configs/conf1/schema.xml
    [junit4] 2> 1897312 INFO (TEST-TestReqParamsAPI.test-seed#[5C6C84A667BB4041]) [ ] o.a.s.c.AbstractZkTestCase put /home/jenkins/workspace/Lucene-Solr-master-Linux/solr/core/src/test-files/solr/collection1/conf/solrconfig.snippet.randomindexconfig.xml to /configs/conf1/solrconfig.snippet.randomindexconfig.xml
    [junit4] 2> 1897312 INFO (TEST-TestReqParamsAPI.test-seed#[5C6C84A667BB4041]) [ ] o.a.s.c.c.SolrZkClient makePath: /configs/conf1/solrconfig.snippet.randomindexconfig.xml
    [junit4] 2> 1897313 INFO (TEST-TestReqParamsAPI.test-seed#[5C6C84A667BB4041]) [ ] o.a.s.c.AbstractZkTestCase put /home/jenkins/workspace/Lucene-Solr-master-Linux/solr/core/src/test-files/solr/collection1/conf/stopwords.txt to /configs/conf1/stopwords.txt
    [junit4] 2> 1897313 INFO (TEST-TestReqParamsAPI.test-seed#[5C6C84A667BB4041]) [ ] o.a.s.c.c.SolrZkClient makePath: /configs/conf1/stopwords.txt
    [junit4] 2> 1897313 INFO (TEST-TestReqParamsAPI.test-seed#[5C6C84A667BB4041]) [ ] o.a.s.c.AbstractZkTestCase put /home/jenkins/workspace/Lucene-Solr-master-Linux/solr/core/src/test-files/solr/collection1/conf/protwords.txt to /configs/conf1/protwords.txt
    [junit4] 2> 1897313 INFO (TEST-TestReqParamsAPI.test-seed#[5C6C84A667BB4041]) [ ] o.a.s.c.c.SolrZkClient makePath: /configs/conf1/protwords.txt
    [junit4] 2> 1897314 INFO (TEST-TestReqParamsAPI.test-seed#[5C6C84A667BB4041]) [ ] o.a.s.c.AbstractZkTestCase put /home/jenkins/workspace/Lucene-Solr-master-Linux/solr/core/src/test-files/solr/collection1/conf/currency.xml to /configs/conf1/currency.xml
    [junit4] 2> 1897314 INFO (TEST-TestReqParamsAPI.test-seed#[5C6C84A667BB4041]) [ ] o.a.s.c.c.SolrZkClient makePath: /configs/conf1/currency.xml
    [junit4] 2> 1897315 INFO (TEST-TestReqParamsAPI.test-seed#[5C6C84A667BB4041]) [ ] o.a.s.c.AbstractZkTestCase put /home/jenkins/workspace/Lucene-Solr-master-Linux/solr/core/src/test-files/solr/collection1/conf/enumsConfig.xml to /configs/conf1/enumsConfig.xml
    [junit4] 2> 1897315 INFO (TEST-TestReqParamsAPI.test-seed#[5C6C84A667BB4041]) [ ] o.a.s.c.c.SolrZkClient makePath: /configs/conf1/enumsConfig.xml
    [junit4] 2> 1897315 INFO (TEST-TestReqParamsAPI.test-seed#[5C6C84A667BB4041]) [ ] o.a.s.c.AbstractZkTestCase put /home/jenkins/workspace/Lucene-Solr-master-Linux/solr/core/src/test-files/solr/collection1/conf/open-exchange-rates.json to /configs/conf1/open-exchange-rates.json
    [junit4] 2> 1897315 INFO (TEST-TestReqParamsAPI.test-seed#[5C6C84A667BB4041]) [ ] o.a.s.c.c.SolrZkClient makePath: /configs/conf1/open-exchange-rates.json
    [junit4] 2> 1897317 INFO (TEST-TestReqParamsAPI.test-seed#[5C6C84A667BB4041]) [ ] o.a.s.c.AbstractZkTestCase put /home/jenkins/workspace/Lucene-Solr-master-Linux/solr/core/src/test-files/solr/collection1/conf/mapping-ISOLatin1Accent.txt to /configs/conf1/mapping-ISOLatin1Accent.txt
    [junit4] 2> 1897317 INFO (TEST-TestReqParamsAPI.test-seed#[5C6C84A667BB4041]) [ ] o.a.s.c.c.SolrZkClient makePath: /configs/conf1/mapping-ISOLatin1Accent.txt
    [junit4] 2> 1897317 INFO (TEST-TestReqParamsAPI.test-seed#[5C6C84A667BB4041]) [ ] o.a.s.c.AbstractZkTestCase put /home/jenkins/workspace/Lucene-Solr-master-Linux/solr/core/src/test-files/solr/collection1/conf/old_synonyms.txt to /configs/conf1/old_synonyms.txt
    [junit4] 2> 1897317 INFO (TEST-TestReqParamsAPI.test-seed#[5C6C84A667BB4041]) [ ] o.a.s.c.c.SolrZkClient makePath: /configs/conf1/old_synonyms.txt
    [junit4] 2> 1897319 INFO (TEST-TestReqParamsAPI.test-seed#[5C6C84A667BB4041]) [ ] o.a.s.c.AbstractZkTestCase put /home/jenkins/workspace/Lucene-Solr-master-Linux/solr/core/src/test-files/solr/collection1/conf/synonyms.txt to /configs/conf1/synonyms.txt
    [junit4] 2> 1897319 INFO (TEST-TestReqParamsAPI.test-seed#[5C6C84A667BB4041]) [ ] o.a.s.c.c.SolrZkClient makePath: /configs/conf1/synonyms.txt
    [junit4] 2> 1897320 INFO (TEST-TestReqParamsAPI.test-seed#[5C6C84A667BB4041]) [ ] o.a.s.c.c.SolrZkClient Using default ZkCredentialsProvider
    [junit4] 2> 1897320 INFO (TEST-TestReqParamsAPI.test-seed#[5C6C84A667BB4041]) [ ] o.a.s.c.c.ConnectionManager Waiting for client to connect to ZooKeeper
    [junit4] 2> 1897321 INFO (zkCallback-2339-thread-1) [ ] o.a.s.c.c.ConnectionManager Watcher org.apache.solr.common.cloud.ConnectionManager@115d76af name:ZooKeeperConnection Watcher:127.0.0.1:45434/solr got event WatchedEvent state:SyncConnected type:None path:null path:null type:None
    [junit4] 2> 1897321 INFO (TEST-TestReqParamsAPI.test-seed#[5C6C84A667BB4041]) [ ] o.a.s.c.c.ConnectionManager Client is connected to ZooKeeper
    [junit4] 2> 1897321 INFO (TEST-TestReqParamsAPI.test-seed#[5C6C84A667BB4041]) [ ] o.a.s.c.c.SolrZkClient Using default ZkACLProvider
    [junit4] 2> 1897394 INFO (TEST-TestReqParamsAPI.test-seed#[5C6C84A667BB4041]) [ ] o.a.s.SolrTestCaseJ4 Writing core.properties file to /home/jenkins/workspace/Lucene-Solr-master-Linux/solr/build/solr-core/test/J0/temp/solr.handler.TestReqParamsAPI_5C6C84A667BB4041-001/control-001/cores/collection1
    [junit4] 2> 1897395 INFO (TEST-TestReqParamsAPI.test-seed#[5C6C84A667BB4041]) [ ] o.e.j.s.Server jetty-9.3.8.v20160314
    [junit4] 2> 1897396 INFO (TEST-TestReqParamsAPI.test-seed#[5C6C84A667BB4041]) [ ] o.e.j.s.h.ContextHandler Started o.e.j.s.ServletContextHandler@1d871abe{/,null,AVAILABLE}
    [junit4] 2> 1897399 INFO (TEST-TestReqParamsAPI.test-seed#[5C6C84A667BB4041]) [ ] o.e.j.s.ServerConnector Started ServerConnector@5f0ac8e2{SSL,[ssl, http/1.1]}{127.0.0.1:35917}
    [junit4] 2> 1897399 INFO (TEST-TestReqParamsAPI.test-seed#[5C6C84A667BB4041]) [ ] o.e.j.s.Server Started @1898821ms
    [junit4] 2> 1897399 INFO (TEST-TestReqParamsAPI.test-seed#[5C6C84A667BB4041]) [ ] o.a.s.c.s.e.JettySolrRunner Jetty properties: {solr.data.dir=/home/jenkins/workspace/Lucene-Solr-master-Linux/solr/build/solr-core/test/J0/temp/solr.handler.TestReqParamsAPI_5C6C84A667BB4041-001/tempDir-001/control/data, hostContext=/, hostPort=35917, coreRootDirectory=/home/jenkins/workspace/Lucene-Solr-master-Linux/solr/build/solr-core/test/J0/../../../../../../../../../home/jenkins/workspace/Lucene-Solr-master-Linux/solr/build/solr-core/test/J0/temp/solr.handler.TestReqParamsAPI_5C6C84A667BB4041-001/control-001/cores}
    [junit4] 2> 1897399 INFO (TEST-TestReqParamsAPI.test-seed#[5C6C84A667BB4041]) [ ] o.a.s.s.SolrDispatchFilter SolrDispatchFilter.init(): sun.misc.Launcher$AppClassLoader@73d16e93
    [junit4] 2> 1897399 INFO (TEST-TestReqParamsAPI.test-seed#[5C6C84A667BB4041]) [ ] o.a.s.c.SolrResourceLoader new SolrResourceLoader for directory: '/home/jenkins/workspace/Lucene-Solr-master-Linux/solr/build/solr-core/test/J0/temp/solr.handler.TestReqParamsAPI_5C6C84A667BB4041-001/control-001'
    [junit4] 2> 1897400 INFO (TEST-TestReqParamsAPI.test-seed#[5C6C84A667BB4041]) [ ] o.a.s.c.SolrResourceLoader JNDI not configured for solr (NoInitialContextEx)
    [junit4] 2> 1897400 INFO (TEST-TestReqParamsAPI.test-seed#[5C6C84A667BB4041]) [ ] o.a.s.c.SolrResourceLoader solr home defaulted to 'solr/' (could not find system property or JNDI)
    [junit4] 2> 1897400 INFO (TEST-TestReqParamsAPI.test-seed#[5C6C84A667BB4041]) [ ] o.a.s.c.c.SolrZkClient Using default ZkCredentialsProvider
    [junit4] 2> 1897401 INFO (TEST-TestReqParamsAPI.test-seed#[5C6C84A667BB4041]) [ ] o.a.s.c.c.ConnectionManager Waiting for client to connect to ZooKeeper
    [junit4] 2> 1897401 INFO (zkCallback-2340-thread-1) [ ] o.a.s.c.c.ConnectionManager Watcher org.apache.solr.common.cloud.ConnectionManager@7f657297 name:ZooKeeperConnection Watcher:127.0.0.1:45434/solr got event WatchedEvent state:SyncConnected type:None path:null path:null type:None
    [junit4] 2> 1897401 INFO (TEST-TestReqParamsAPI.test-seed#[5C6C84A667BB4041]) [ ] o.a.s.c.c.ConnectionManager Client is connected to ZooKeeper
    [junit4] 2> 1897401 INFO (TEST-TestReqParamsAPI.test-seed#[5C6C84A667BB4041]) [ ] o.a.s.c.c.SolrZkClient Using default ZkACLProvider
    [junit4] 2> 1897402 INFO (TEST-TestReqParamsAPI.test-seed#[5C6C84A667BB4041]) [ ] o.a.s.s.SolrDispatchFilter Loading solr.xml from SolrHome (not found in ZooKeeper)
    [junit4] 2> 1897402 INFO (TEST-TestReqParamsAPI.test-seed#[5C6C84A667BB4041]) [ ] o.a.s.c.SolrXmlConfig Loading container configuration from /home/jenkins/workspace/Lucene-Solr-master-Linux/solr/build/solr-core/test/J0/temp/solr.handler.TestReqParamsAPI_5C6C84A667BB4041-001/control-001/solr.xml
    [junit4] 2> 1897405 INFO (TEST-TestReqParamsAPI.test-seed#[5C6C84A667BB4041]) [ ] o.a.s.c.CorePropertiesLocator Config-defined core root directory: /home/jenkins/workspace/Lucene-Solr-master-Linux/solr/build/solr-core/test/J0/../../../../../../../../../home/jenkins/workspace/Lucene-Solr-master-Linux/solr/build/solr-core/test/J0/temp/solr.handler.TestReqParamsAPI_5C6C84A667BB4041-001/control-001/cores
    [junit4] 2> 1897405 INFO (TEST-TestReqParamsAPI.test-seed#[5C6C84A667BB4041]) [ ] o.a.s.c.CoreContainer New CoreContainer 889838621
    [junit4] 2> 1897405 INFO (TEST-TestReqParamsAPI.test-seed#[5C6C84A667BB4041]) [ ] o.a.s.c.CoreContainer Loading cores into CoreContainer [instanceDir=/home/jenkins/workspace/Lucene-Solr-master-Linux/solr/build/solr-core/test/J0/temp/solr.handler.TestReqParamsAPI_5C6C84A667BB4041-001/control-001]
    [junit4] 2> 1897405 WARN (TEST-TestReqParamsAPI.test-seed#[5C6C84A667BB4041]) [ ] o.a.s.c.CoreContainer Couldn't add files from /home/jenkins/workspace/Lucene-Solr-master-Linux/solr/build/solr-core/test/J0/temp/solr.handler.TestReqParamsAPI_5C6C84A667BB4041-001/control-001/lib to classpath: /home/jenkins/workspace/Lucene-Solr-master-Linux/solr/build/solr-core/test/J0/temp/solr.handler.TestReqParamsAPI_5C6C84A667BB4041-001/control-001/lib
    [junit4] 2> 1897405 INFO (TEST-TestReqParamsAPI.test-seed#[5C6C84A667BB4041]) [ ] o.a.s.h.c.HttpShardHandlerFactory created with socketTimeout : 90000,urlScheme : ,connTimeout : 15000,maxConnectionsPerHost : 20,maxConnections : 10000,corePoolSize : 0,maximumPoolSize : 2147483647,maxThreadIdleTime : 5,sizeOfQueue : -1,fairnessPolicy : false,
    [junit4] 2> 1897406 INFO (TEST-TestReqParamsAPI.test-seed#[5C6C84A667BB4041]) [ ] o.a.s.u.UpdateShardHandler Creating UpdateShardHandler HTTP client with params:
    [junit4] 2> 1897407 INFO (TEST-TestReqParamsAPI.test-seed#[5C6C84A667BB4041]) [ ] o.a.s.l.LogWatcher SLF4J impl is org.slf4j.impl.Log4jLoggerFactory
    [junit4] 2> 1897407 INFO (TEST-TestReqParamsAPI.test-seed#[5C6C84A667BB4041]) [ ] o.a.s.l.LogWatcher Registering Log Listener [Log4j (org.slf4j.impl.Log4jLoggerFactory)]
    [junit4] 2> 1897407 INFO (TEST-TestReqParamsAPI.test-seed#[5C6C84A667BB4041]) [ ] o.a.s.c.ZkContainer Zookeeper client=127.0.0.1:45434/solr
    [junit4] 2> 1897407 INFO (TEST-TestReqParamsAPI.test-seed#[5C6C84A667BB4041]) [ ] o.a.s.c.ZkController zkHost includes chroot
    [junit4] 2> 1897407 INFO (TEST-TestReqParamsAPI.test-seed#[5C6C84A667BB4041]) [ ] o.a.s.c.c.SolrZkClient Using default ZkCredentialsProvider
    [junit4] 2> 1897407 INFO (TEST-TestReqParamsAPI.test-seed#[5C6C84A667BB4041]) [ ] o.a.s.c.c.ConnectionManager Waiting for client to connect to ZooKeeper
    [junit4] 2> 1897408 INFO (zkCallback-2343-thread-1) [ ] o.a.s.c.c.ConnectionManager Watcher org.apache.solr.common.cloud.ConnectionManager@260b8b72 name:ZooKeeperConnection Watcher:127.0.0.1:45434 got event WatchedEvent state:SyncConnected type:None path:null path:null type:None
    [junit4] 2> 1897408 INFO (TEST-TestReqParamsAPI.test-seed#[5C6C84A667BB4041]) [ ] o.a.s.c.c.ConnectionManager Client is connected to ZooKeeper
    [junit4] 2> 1897408 INFO (TEST-TestReqParamsAPI.test-seed#[5C6C84A667BB4041]) [ ] o.a.s.c.c.SolrZkClient Using default ZkACLProvider
    [junit4] 2> 1897409 INFO (TEST-TestReqParamsAPI.test-seed#[5C6C84A667BB4041]) [n:127.0.0.1:35917_ ] o.a.s.c.ZkController Added new OnReconnect listener org.apache.solr.cloud.ZkController$$Lambda$61/2133795607@2c9424b5
    [junit4] 2> 1897409 INFO (TEST-TestReqParamsAPI.test-seed#[5C6C84A667BB4041]) [n:127.0.0.1:35917_ ] o.a.s.c.c.ConnectionManager Waiting for client to connect to ZooKeeper
    [junit4] 2> 1897409 INFO (zkCallback-2344-thread-1-processing-n:127.0.0.1:35917_) [n:127.0.0.1:35917_ ] o.a.s.c.c.ConnectionManager Watcher org.apache.solr.common.cloud.ConnectionManager@1e3f1428 name:ZooKeeperConnection Watcher:127.0.0.1:45434/solr got event WatchedEvent state:SyncConnected type:None path:null path:null type:None
    [junit4] 2> 1897409 INFO (TEST-TestReqParamsAPI.test-seed#[5C6C84A667BB4041]) [n:127.0.0.1:35917_ ] o.a.s.c.c.ConnectionManager Client is connected to ZooKeeper
    [junit4] 2> 1897410 INFO (TEST-TestReqParamsAPI.test-seed#[5C6C84A667BB4041]) [n:127.0.0.1:35917_ ] o.a.s.c.c.SolrZkClient makePath: /overseer/queue
    [junit4] 2> 1897410 INFO (TEST-TestReqParamsAPI.test-seed#[5C6C84A667BB4041]) [n:127.0.0.1:35917_ ] o.a.s.c.c.SolrZkClient makePath: /overseer/collection-queue-work
    [junit4] 2> 1897411 INFO (TEST-TestReqParamsAPI.test-seed#[5C6C84A667BB4041]) [n:127.0.0.1:35917_ ] o.a.s.c.c.SolrZkClient makePath: /overseer/collection-map-running
    [junit4] 2> 1897413 INFO (TEST-TestReqParamsAPI.test-seed#[5C6C84A667BB4041]) [n:127.0.0.1:35917_ ] o.a.s.c.c.SolrZkClient makePath: /overseer/collection-map-completed
    [junit4] 2> 1897414 INFO (TEST-TestReqParamsAPI.test-seed#[5C6C84A667BB4041]) [n:127.0.0.1:35917_ ] o.a.s.c.c.SolrZkClient makePath: /overseer/collection-map-failure
    [junit4] 2> 1897414 INFO (TEST-TestReqParamsAPI.test-seed#[5C6C84A667BB4041]) [n:127.0.0.1:35917_ ] o.a.s.c.c.SolrZkClient makePath: /live_nodes
    [junit4] 2> 1897414 INFO (TEST-TestReqParamsAPI.test-seed#[5C6C84A667BB4041]) [n:127.0.0.1:35917_ ] o.a.s.c.c.SolrZkClient makePath: /aliases.json
    [junit4] 2> 1897415 INFO (TEST-TestReqParamsAPI.test-seed#[5C6C84A667BB4041]) [n:127.0.0.1:35917_ ] o.a.s.c.c.SolrZkClient makePath: /clusterstate.json
    [junit4] 2> 1897415 INFO (TEST-TestReqParamsAPI.test-seed#[5C6C84A667BB4041]) [n:127.0.0.1:35917_ ] o.a.s.c.c.SolrZkClient makePath: /security.json
    [junit4] 2> 1897415 INFO (TEST-TestReqParamsAPI.test-seed#[5C6C84A667BB4041]) [n:127.0.0.1:35917_ ] o.a.s.c.c.ZkStateReader Updating cluster state from ZooKeeper...
    [junit4] 2> 1897416 INFO (TEST-TestReqParamsAPI.test-seed#[5C6C84A667BB4041]) [n:127.0.0.1:35917_ ] o.a.s.c.c.ZkStateReader Loaded cluster properties: {urlScheme=https}
    [junit4] 2> 1897416 INFO (TEST-TestReqParamsAPI.test-seed#[5C6C84A667BB4041]) [n:127.0.0.1:35917_ ] o.a.s.c.c.ZkStateReader Updated live nodes from ZooKeeper... (0) -> (0)
    [junit4] 2> 1897417 INFO (TEST-TestReqParamsAPI.test-seed#[5C6C84A667BB4041]) [n:127.0.0.1:35917_ ] o.a.s.c.c.SolrZkClient makePath: /overseer_elect
    [junit4] 2> 1897417 INFO (TEST-TestReqParamsAPI.test-seed#[5C6C84A667BB4041]) [n:127.0.0.1:35917_ ] o.a.s.c.c.SolrZkClient makePath: /overseer_elect/election
    [junit4] 2> 1897417 INFO (TEST-TestReqParamsAPI.test-seed#[5C6C84A667BB4041]) [n:127.0.0.1:35917_ ] o.a.s.c.Overseer Overseer (id=null) closing
    [junit4] 2> 1897417 INFO (TEST-TestReqParamsAPI.test-seed#[5C6C84A667BB4041]) [n:127.0.0.1:35917_ ] o.a.s.c.LeaderElector Joined leadership election with path: /overseer_elect/election/96092274900402181-127.0.0.1:35917_-n_0000000000
    [junit4] 2> 1897418 INFO (TEST-TestReqParamsAPI.test-seed#[5C6C84A667BB4041]) [n:127.0.0.1:35917_ ] o.a.s.c.OverseerElectionContext I am going to be the leader 127.0.0.1:35917_
    [junit4] 2> 1897418 INFO (TEST-TestReqParamsAPI.test-seed#[5C6C84A667BB4041]) [n:127.0.0.1:35917_ ] o.a.s.c.c.SolrZkClient makePath: /overseer_elect/leader
    [junit4] 2> 1897418 INFO (TEST-TestReqParamsAPI.test-seed#[5C6C84A667BB4041]) [n:127.0.0.1:35917_ ] o.a.s.c.Overseer Overseer (id=96092274900402181-127.0.0.1:35917_-n_0000000000) starting
    [junit4] 2> 1897418 INFO (TEST-TestReqParamsAPI.test-seed#[5C6C84A667BB4041]) [n:127.0.0.1:35917_ ] o.a.s.c.c.SolrZkClient makePath: /overseer/queue-work
    [junit4] 2> 1897420 INFO (TEST-TestReqParamsAPI.test-seed#[5C6C84A667BB4041]) [n:127.0.0.1:35917_ ] o.a.s.c.OverseerAutoReplicaFailoverThread Starting OverseerAutoReplicaFailoverThread autoReplicaFailoverWorkLoopDelay=10000 autoReplicaFailoverWaitAfterExpiration=30000 autoReplicaFailoverBadNodeExpiration=60000
    [junit4] 2> 1897420 INFO (OverseerCollectionConfigSetProcessor-96092274900402181-127.0.0.1:35917_-n_0000000000) [n:127.0.0.1:35917_ ] o.a.s.c.OverseerTaskProcessor Process current queue of overseer operations
    [junit4] 2> 1897420 INFO (OverseerStateUpdate-96092274900402181-127.0.0.1:35917_-n_0000000000) [n:127.0.0.1:35917_ ] o.a.s.c.Overseer Starting to work on the main queue
    [junit4] 2> 1897420 INFO (TEST-TestReqParamsAPI.test-seed#[5C6C84A667BB4041]) [n:127.0.0.1:35917_ ] o.a.s.c.ZkController Register node as live in ZooKeeper:/live_nodes/127.0.0.1:35917_
    [junit4] 2> 1897420 INFO (TEST-TestReqParamsAPI.test-seed#[5C6C84A667BB4041]) [n:127.0.0.1:35917_ ] o.a.s.c.c.SolrZkClient makePath: /live_nodes/127.0.0.1:35917_
    [junit4] 2> 1897421 INFO (OverseerStateUpdate-96092274900402181-127.0.0.1:35917_-n_0000000000) [n:127.0.0.1:35917_ ] o.a.s.c.c.ZkStateReader Updated live nodes from ZooKeeper... (0) -> (0)
    [junit4] 2> 1897421 INFO (zkCallback-2344-thread-1-processing-n:127.0.0.1:35917_) [n:127.0.0.1:35917_ ] o.a.s.c.c.ZkStateReader A live node change: [WatchedEvent state:SyncConnected type:NodeChildrenChanged path:/live_nodes], has occurred - updating... (live nodes size: [0])
    [junit4] 2> 1897422 INFO (zkCallback-2344-thread-1-processing-n:127.0.0.1:35917_) [n:127.0.0.1:35917_ ] o.a.s.c.c.ZkStateReader Updated live nodes from ZooKeeper... (0) -> (1)
    [junit4] 2> 1897429 INFO (TEST-TestReqParamsAPI.test-seed#[5C6C84A667BB4041]) [n:127.0.0.1:35917_ ] o.a.s.c.CoreContainer Security conf doesn't exist. Skipping setup for authorization module.
    [junit4] 2> 1897429 INFO (TEST-TestReqParamsAPI.test-seed#[5C6C84A667BB4041]) [n:127.0.0.1:35917_ ] o.a.s.c.CoreContainer No authentication plugin used.
    [junit4] 2> 1897429 INFO (TEST-TestReqParamsAPI.test-seed#[5C6C84A667BB4041]) [n:127.0.0.1:35917_ ] o.a.s.c.CorePropertiesLocator Looking for core definitions underneath /home/jenkins/workspace/Lucene-Solr-master-Linux/solr/build/solr-core/test/J0/../../../../../../../../../home/jenkins/workspace/Lucene-Solr-master-Linux/solr/build/solr-core/test/J0/temp/solr.handler.TestReqParamsAPI_5C6C84A667BB4041-001/control-001/cores
    [junit4] 2> 1897429 INFO (TEST-TestReqParamsAPI.test-seed#[5C6C84A667BB4041]) [n:127.0.0.1:35917_ ] o.a.s.c.CoreDescriptor Created CoreDescriptor: {name=collection1, config=solrconfig.xml, transient=false, schema=schema.xml, loadOnStartup=true, configSetProperties=configsetprops.json, collection=control_collection, coreNodeName=, dataDir=data/, shard=}
    [junit4] 2> 1897430 INFO (TEST-TestReqParamsAPI.test-seed#[5C6C84A667BB4041]) [n:127.0.0.1:35917_ ] o.a.s.c.CorePropertiesLocator Found core collection1 in /home/jenkins/workspace/Lucene-Solr-master-Linux/solr/build/solr-core/test/J0/../../../../../../../../../home/jenkins/workspace/Lucene-Solr-master-Linux/solr/build/solr-core/test/J0/temp/solr.handler.TestReqParamsAPI_5C6C84A667BB4041-001/control-001/cores/collection1
    [junit4] 2> 1897430 INFO (TEST-TestReqParamsAPI.test-seed#[5C6C84A667BB4041]) [n:127.0.0.1:35917_ ] o.a.s.c.CorePropertiesLocator Found 1 core definitions
    [junit4] 2> 1897430 INFO (coreLoadExecutor-6239-thread-1-processing-n:127.0.0.1:35917_) [n:127.0.0.1:35917_ c:control_collection x:collection1] o.a.s.c.ZkController publishing state=down
    [junit4] 2> 1897430 INFO (coreLoadExecutor-6239-thread-1-processing-n:127.0.0.1:35917_) [n:127.0.0.1:35917_ c:control_collection x:collection1] o.a.s.c.ZkController numShards not found on descriptor - reading it from system property
    [junit4] 2> 1897430 INFO (TEST-TestReqParamsAPI.test-seed#[5C6C84A667BB4041]) [n:127.0.0.1:35917_ ] o.a.s.s.SolrDispatchFilter user.dir=/home/jenkins/workspace/Lucene-Solr-master-Linux/solr/build/solr-core/test/J0
    [junit4] 2> 1897430 INFO (TEST-TestReqParamsAPI.test-seed#[5C6C84A667BB4041]) [n:127.0.0.1:35917_ ] o.a.s.s.SolrDispatchFilter SolrDispatchFilter.init() done
    [junit4] 2> 1897430 INFO (coreLoadExecutor-6239-thread-1-processing-n:127.0.0.1:35917_) [n:127.0.0.1:35917_ c:control_collection x:collection1] o.a.s.c.ZkController Collection control_collection not visible yet, but flagging it so a watch is registered when it becomes visible
    [junit4] 2> 1897431 INFO (OverseerStateUpdate-96092274900402181-127.0.0.1:35917_-n_0000000000) [n:127.0.0.1:35917_ ] o.a.s.c.Overseer processMessage: queueSize: 1, message = {
    [junit4] 2> "core":"collection1",
    [junit4] 2> "roles":null,
    [junit4] 2> "base_url":"https://127.0.0.1:35917",
    [junit4] 2> "node_name":"127.0.0.1:35917_",
    [junit4] 2> "numShards":"1",
    [junit4] 2> "state":"down",
    [junit4] 2> "shard":null,
    [junit4] 2> "collection":"control_collection",
    [junit4] 2> "operation":"state"} current state version: 0
    [junit4] 2> 1897431 INFO (OverseerStateUpdate-96092274900402181-127.0.0.1:35917_-n_0000000000) [n:127.0.0.1:35917_ ] o.a.s.c.o.ReplicaMutator Update state numShards=1 message={
    [junit4] 2> "core":"collection1",
    [junit4] 2> "roles":null,
    [junit4] 2> "base_url":"https://127.0.0.1:35917",
    [junit4] 2> "node_name":"127.0.0.1:35917_",
    [junit4] 2> "numShards":"1",
    [junit4] 2> "state":"down",
    [junit4] 2> "shard":null,
    [junit4] 2> "collection":"control_collection",
    [junit4] 2> "operation":"state"}
    [junit4] 2> 1897431 INFO (coreLoadExecutor-6239-thread-1-processing-n:127.0.0.1:35917_) [n:127.0.0.1:35917_ c:control_collection x:collection1] o.a.s.c.c.ZkStateReader Deleting data for [control_collection]
    [junit4] 2> 1897431 INFO (OverseerStateUpdate-96092274900402181-127.0.0.1:35917_-n_0000000000) [n:127.0.0.1:35917_ ] o.a.s.c.o.ClusterStateMutator building a new cName: control_collection
    [junit4] 2> 1897431 INFO (coreLoadExecutor-6239-thread-1-processing-n:127.0.0.1:35917_) [n:127.0.0.1:35917_ c:control_collection x:collection1] o.a.s.c.ZkController look for our core node name
    [junit4] 2> 1897431 INFO (OverseerStateUpdate-96092274900402181-127.0.0.1:35917_-n_0000000000) [n:127.0.0.1:35917_ ] o.a.s.c.o.ReplicaMutator Assigning new node to shard shard=shard1
    [junit4] 2> 1897432 INFO (zkCallback-2344-thread-1-processing-n:127.0.0.1:35917_) [n:127.0.0.1:35917_ ] o.a.s.c.c.ZkStateReader A cluster state change: [WatchedEvent state:SyncConnected type:NodeDataChanged path:/clusterstate.json], has occurred - updating... (live nodes size: [1])
    [junit4] 2> 1898431 INFO (coreLoadExecutor-6239-thread-1-processing-n:127.0.0.1:35917_) [n:127.0.0.1:35917_ c:control_collection x:collection1] o.a.s.c.ZkController waiting to find shard id in clusterstate for collection1
    [junit4] 2> 1898431 INFO (coreLoadExecutor-6239-thread-1-processing-n:127.0.0.1:35917_) [n:127.0.0.1:35917_ c:control_collection x:collection1] o.a.s.c.ZkController Check for collection zkNode:control_collection
    [junit4] 2> 1898432 INFO (coreLoadExecutor-6239-thread-1-processing-n:127.0.0.1:35917_) [n:127.0.0.1:35917_ c:control_collection x:collection1] o.a.s.c.ZkController Collection zkNode exists
    [junit4] 2> 1898432 INFO (coreLoadExecutor-6239-thread-1-processing-n:127.0.0.1:35917_) [n:127.0.0.1:35917_ c:control_collection x:collection1] o.a.s.c.c.ZkStateReader Load collection config from: [/collections/control_collection]
    [junit4] 2> 1898433 INFO (coreLoadExecutor-6239-thread-1-processing-n:127.0.0.1:35917_) [n:127.0.0.1:35917_ c:control_collection x:collection1] o.a.s.c.c.ZkStateReader path=[/collections/control_collection] [configName]=[conf1] specified config exists in ZooKeeper
    [junit4] 2> 1898433 INFO (coreLoadExecutor-6239-thread-1-processing-n:127.0.0.1:35917_) [n:127.0.0.1:35917_ c:control_collection x:collection1] o.a.s.c.SolrResourceLoader new SolrResourceLoader for directory: '/home/jenkins/workspace/Lucene-Solr-master-Linux/solr/build/solr-core/test/J0/temp/solr.handler.TestReqParamsAPI_5C6C84A667BB4041-001/control-001/cores/collection1'
    [junit4] 2> 1898433 INFO (coreLoadExecutor-6239-thread-1-processing-n:127.0.0.1:35917_) [n:127.0.0.1:35917_ c:control_collection x:collection1] o.a.s.c.SolrResourceLoader JNDI not configured for solr (NoInitialContextEx)
    [junit4] 2> 1898433 INFO (coreLoadExecutor-6239-thread-1-processing-n:127.0.0.1:35917_) [n:127.0.0.1:35917_ c:control_collection x:collection1] o.a.s.c.SolrResourceLoader solr home defaulted to 'solr/' (could not find system property or JNDI)
    [junit4] 2> 1898434 INFO (coreLoadExecutor-6239-thread-1-processing-n:127.0.0.1:35917_) [n:127.0.0.1:35917_ c:control_collection x:collection1] o.a.s.c.Config loaded config solrconfig.xml with version 0
    [junit4] 2> 1898436 INFO (coreLoadExecutor-6239-thread-1-processing-n:127.0.0.1:35917_) [n:127.0.0.1:35917_ c:control_collection x:collection1] o.a.s.c.SolrConfig current version of requestparams : -1
    [junit4] 2> 1898439 INFO (coreLoadExecutor-6239-thread-1-processing-n:127.0.0.1:35917_) [n:127.0.0.1:35917_ c:control_collection x:collection1] o.a.s.c.SolrConfig Using Lucene MatchVersion: 7.0.0
    [junit4] 2> 1898444 INFO (coreLoadExecutor-6239-thread-1-processing-n:127.0.0.1:35917_) [n:127.0.0.1:35917_ c:control_collection x:collection1] o.a.s.c.SolrConfig Loaded SolrConfig: solrconfig.xml
    [junit4] 2> 1898447 INFO (coreLoadExecutor-6239-thread-1-processing-n:127.0.0.1:35917_) [n:127.0.0.1:35917_ c:control_collection x:collection1] o.a.s.s.IndexSchema [collection1] Schema name=test
    [junit4] 2> 1898494 INFO (coreLoadExecutor-6239-thread-1-processing-n:127.0.0.1:35917_) [n:127.0.0.1:35917_ c:control_collection x:collection1] o.a.s.s.OpenExchangeRatesOrgProvider Initialized with rates=open-exchange-rates.json, refreshInterval=1440.
    [junit4] 2> 1898498 INFO (coreLoadExecutor-6239-thread-1-processing-n:127.0.0.1:35917_) [n:127.0.0.1:35917_ c:control_collection x:collection1] o.a.s.s.IndexSchema default search field in schema is text
    [junit4] 2> 1898499 INFO (coreLoadExecutor-6239-thread-1-processing-n:127.0.0.1:35917_) [n:127.0.0.1:35917_ c:control_collection x:collection1] o.a.s.s.IndexSchema unique key field: id
    [junit4] 2> 1898503 INFO (coreLoadExecutor-6239-thread-1-processing-n:127.0.0.1:35917_) [n:127.0.0.1:35917_ c:control_collection x:collection1] o.a.s.s.FileExchangeRateProvider Reloading exchange rates from file currency.xml
    [junit4] 2> 1898504 INFO (coreLoadExecutor-6239-thread-1-processing-n:127.0.0.1:35917_) [n:127.0.0.1:35917_ c:control_collection x:collection1] o.a.s.s.FileExchangeRateProvider Reloading exchange rates from file currency.xml
    [junit4] 2> 1898505 INFO (coreLoadExecutor-6239-thread-1-processing-n:127.0.0.1:35917_) [n:127.0.0.1:35917_ c:control_collection x:collection1] o.a.s.s.OpenExchangeRatesOrgProvider Reloading exchange rates from open-exchange-rates.json
    [junit4] 2> 1898506 INFO (coreLoadExecutor-6239-thread-1-processing-n:127.0.0.1:35917_) [n:127.0.0.1:35917_ c:control_collection x:collection1] o.a.s.s.OpenExchangeRatesOrgProvider Reloading exchange rates from open-exchange-rates.json
    [junit4] 2> 1898506 INFO (coreLoadExecutor-6239-thread-1-processing-n:127.0.0.1:35917_) [n:127.0.0.1:35917_ c:control_collection x:collection1] o.a.s.c.ConfigSetProperties Did not find ConfigSet properties, assuming default properties: Can't find resource 'configsetprops.json' in classpath or '/configs/conf1', cwd=/home/jenkins/workspace/Lucene-Solr-master-Linux/solr/build/solr-core/test/J0
    [junit4] 2> 1898506 INFO (coreLoadExecutor-6239-thread-1-processing-n:127.0.0.1:35917_) [n:127.0.0.1:35917_ c:control_collection x:collection1] o.a.s.c.CoreContainer Creating SolrCore 'collection1' using configuration from collection control_collection
    [junit4] 2> 1898507 INFO (coreLoadExecutor-6239-thread-1-processing-n:127.0.0.1:35917_) [n:127.0.0.1:35917_ c:control_collection s:shard1 r:core_node1 x:collection1] o.a.s.c.SolrCore org.apache.solr.core.MockDirectoryFactory
    [junit4] 2> 1898507 INFO (coreLoadExecutor-6239-thread-1-processing-n:127.0.0.1:35917_) [n:127.0.0.1:35917_ c:control_collection s:shard1 r:core_node1 x:collection1] o.a.s.c.SolrCore [[collection1] ] Opening new SolrCore at [/home/jenkins/workspace/Lucene-Solr-master-Linux/solr/build/solr-core/test/J0/temp/solr.handler.TestReqParamsAPI_5C6C84A667BB4041-001/control-001/cores/collection1], dataDir=[/home/jenkins/workspace/Lucene-Solr-master-Linux/solr/build/solr-core/test/J0/../../../../../../../../../home/jenkins/workspace/Lucene-Solr-master-Linux/solr/build/solr-core/test/J0/temp/solr.handler.TestReqParamsAPI_5C6C84A667BB4041-001/control-001/cores/collection1/data/]
    [junit4] 2> 1898507 INFO (coreLoadExecutor-6239-thread-1-processing-n:127.0.0.1:35917_) [n:127.0.0.1:35917_ c:control_collection s:shard1 r:core_node1 x:collection1] o.a.s.c.JmxMonitoredMap JMX monitoring is enabled. Adding Solr mbeans to JMX Server: com.sun.jmx.mbeanserver.JmxMBeanServer@2b5a5649
    [junit4] 2> 1898507 INFO (coreLoadExecutor-6239-thread-1-processing-n:127.0.0.1:35917_) [n:127.0.0.1:35917_ c:control_collection s:shard1 r:core_node1 x:collection1] o.a.s.c.CachingDirectoryFactory return new directory for /home/jenkins/workspace/Lucene-Solr-master-Linux/solr/build/solr-core/test/J0/../../../../../../../../../home/jenkins/workspace/Lucene-Solr-master-Linux/solr/build/solr-core/test/J0/temp/solr.handler.TestReqParamsAPI_5C6C84A667BB4041-001/control-001/cores/collection1/data
    [junit4] 2> 1898507 INFO (coreLoadExecutor-6239-thread-1-processing-n:127.0.0.1:35917_) [n:127.0.0.1:35917_ c:control_collection s:shard1 r:core_node1 x:collection1] o.a.s.c.SolrCore New index directory detected: old=null new=/home/jenkins/workspace/Lucene-Solr-master-Linux/solr/build/solr-core/test/J0/../../../../../../../../../home/jenkins/workspace/Lucene-Solr-master-Linux/solr/build/solr-core/test/J0/temp/solr.handler.TestReqParamsAPI_5C6C84A667BB4041-001/control-001/cores/collection1/data/index/
    [junit4] 2> 1898507 WARN (coreLoadExecutor-6239-thread-1-processing-n:127.0.0.1:35917_) [n:127.0.0.1:35917_ c:control_collection s:shard1 r:core_node1 x:collection1] o.a.s.c.SolrCore [collection1] Solr index directory '/home/jenkins/workspace/Lucene-Solr-master-Linux/solr/build/solr-core/test/J0/../../../../../../../../../home/jenkins/workspace/Lucene-Solr-master-Linux/solr/build/solr-core/test/J0/temp/solr.handler.TestReqParamsAPI_5C6C84A667BB4041-001/control-001/cores/collection1/data/index' doesn't exist. Creating new index...
    [junit4] 2> 1898507 INFO (coreLoadExecutor-6239-thread-1-processing-n:127.0.0.1:35917_) [n:127.0.0.1:35917_ c:control_collection s:shard1 r:core_node1 x:collection1] o.a.s.c.CachingDirectoryFactory return new directory for /home/jenkins/workspace/Lucene-Solr-master-Linux/solr/build/solr-core/test/J0/../../../../../../../../../home/jenkins/workspace/Lucene-Solr-master-Linux/solr/build/solr-core/test/J0/temp/solr.handler.TestReqParamsAPI_5C6C84A667BB4041-001/control-001/cores/collection1/data/index
    [junit4] 2> 1898508 INFO (coreLoadExecutor-6239-thread-1-processing-n:127.0.0.1:35917_) [n:127.0.0.1:35917_ c:control_collection s:shard1 r:core_node1 x:collection1] o.a.s.u.RandomMergePolicy RandomMergePolicy wrapping class org.apache.lucene.index.TieredMergePolicy: [TieredMergePolicy: maxMergeAtOnce=11, maxMergeAtOnceExplicit=25, maxMergedSegmentMB=21.3857421875, floorSegmentMB=1.7734375, forceMergeDeletesPctAllowed=2.1947688273889376, segmentsPerTier=29.0, maxCFSSegmentSizeMB=8.796093022207999E12, noCFSRatio=1.0
    [junit4] 2> 1898508 INFO (coreLoadExecutor-6239-thread-1-processing-n:127.0.0.1:35917_) [n:127.0.0.1:35917_ c:control_collection s:shard1 r:core_node1 x:collection1] o.a.s.c.SolrDeletionPolicy SolrDeletionPolicy.onCommit: commits: num=1
    [junit4] 2> commit{dir=RawDirectoryWrapper(RAMDirectory@6b4ca990 lockFactory=org.apache.lucene.store.SingleInstanceLockFactory@4dd2b9d5),segFN=segments_1,generation=1}
    [junit4] 2> 1898508 INFO (coreLoadExecutor-6239-thread-1-processing-n:127.0.0.1:35917_) [n:127.0.0.1:35917_ c:control_collection s:shard1 r:core_node1 x:collection1] o.a.s.c.SolrDeletionPolicy newest commit generation = 1
    [junit4] 2> 1898508 INFO (OldIndexDirectoryCleanupThreadForCore-collection1) [n:127.0.0.1:35917_ c:control_collection s:shard1 r:core_node1 x:collection1] o.a.s.c.SolrCore Looking for old index directories to cleanup for core collection1 in /home/jenkins/workspace/Lucene-Solr-master-Linux/solr/build/solr-core/test/J0/../../../../../../../../../home/jenkins/workspace/Lucene-Solr-master-Linux/solr/build/solr-core/test/J0/temp/solr.handler.TestReqParamsAPI_5C6C84A667BB4041-001/control-001/cores/collection1/data/
    [junit4] 2> 1898509 WARN (OldIndexDirectoryCleanupThreadForCore-collection1) [n:127.0.0.1:35917_ c:control_collection s:shard1 r:core_node1 x:collection1] o.a.s.c.DirectoryFactory /home/jenkins/workspace/Lucene-Solr-master-Linux/solr/build/solr-core/test/J0/../../../../../../../../../home/jenkins/workspace/Lucene-Solr-master-Linux/solr/build/solr-core/test/J0/temp/solr.handler.TestReqParamsAPI_5C6C84A667BB4041-001/control-001/cores/collection1/data/ does not point to a valid data directory; skipping clean-up of old index directories.
    [junit4] 2> 1898510 INFO (coreLoadExecutor-6239-thread-1-processing-n:127.0.0.1:35917_) [n:127.0.0.1:35917_ c:control_collection s:shard1 r:core_node1 x:collection1] o.a.s.u.p.UpdateRequestProcessorChain creating updateRequestProcessorChain "nodistrib"
    [junit4] 2> 1898510 INFO (coreLoadExecutor-6239-thread-1-processing-n:127.0.0.1:35917_) [n:127.0.0.1:35917_ c:control_collection s:shard1 r:core_node1 x:collection1] o.a.s.u.p.UpdateRequestProcessorChain creating updateRequestProcessorChain "dedupe"
    [junit4] 2> 1898510 INFO (coreLoadExecutor-6239-thread-1-processing-n:127.0.0.1:35917_) [n:127.0.0.1:35917_ c:control_collection s:shard1 r:core_node1 x:collection1] o.a.s.u.p.UpdateRequestProcessorChain inserting DistributedUpdateProcessorFactory into updateRequestProcessorChain "dedupe"
    [junit4] 2> 1898510 INFO (coreLoadExecutor-6239-thread-1-processing-n:127.0.0.1:35917_) [n:127.0.0.1:35917_ c:control_collection s:shard1 r:core_node1 x:collection1] o.a.s.u.p.UpdateRequestProcessorChain creating updateRequestProcessorChain "stored_sig"
    [junit4] 2> 1898510 INFO (coreLoadExecutor-6239-thread-1-processing-n:127.0.0.1:35917_) [n:127.0.0.1:35917_ c:control_collection s:shard1 r:core_node1 x:collection1] o.a.s.u.p.UpdateRequestProcessorChain inserting DistributedUpdateProcessorFactory into updateRequestProcessorChain "stored_sig"
    [junit4] 2> 1898510 INFO (coreLoadExecutor-6239-thread-1-processing-n:127.0.0.1:35917_) [n:127.0.0.1:35917_ c:control_collection s:shard1 r:core_node1 x:collection1] o.a.s.u.p.UpdateRequestProcessorChain creating updateRequestProcessorChain "distrib-dup-test-chain-explicit"
    [junit4] 2> 1898510 INFO (coreLoadExecutor-6239-thread-1-processing-n:127.0.0.1:35917_) [n:127.0.0.1:35917_ c:control_collection s:shard1 r:core_node1 x:collection1] o.a.s.u.p.UpdateRequestProcessorChain creating updateRequestProcessorChain "distrib-dup-test-chain-implicit"
    [junit4] 2> 1898511 INFO (coreLoadExecutor-6239-thread-1-processing-n:127.0.0.1:35917_) [n:127.0.0.1:35917_ c:control_collection s:shard1 r:core_node1 x:collection1] o.a.s.u.p.UpdateRequestProcessorChain inserting DistributedUpdateProcessorFactory into updateRequestProcessorChain "distrib-dup-test-chain-implicit"
    [junit4] 2> 1898511 INFO (coreLoadExecutor-6239-thread-1-processing-n:127.0.0.1:35917_) [n:127.0.0.1:35917_ c:control_collection s:shard1 r:core_node1 x:collection1] o.a.s.c.SolrCore no updateRequestProcessorChain defined as default, creating implicit default
    [junit4] 2> 1898511 WARN (coreLoadExecutor-6239-thread-1-processing-n:127.0.0.1:35917_) [n:127.0.0.1:35917_ c:control_collection s:shard1 r:core_node1 x:collection1] o.a.s.c.RequestHandlers INVALID paramSet a in requestHandler {type = requestHandler,name = /dump,class = DumpRequestHandler,args = {defaults={a=A,b=B}}}
    [junit4] 2> 1898512 INFO (coreLoadExecutor-6239-thread-1-processing-n:127.0.0.1:35917_) [n:127.0.0.1:35917_ c:control_collection s:shard1 r:core_node1 x:collection1] o.a.s.h.l.XMLLoader xsltCacheLifetimeSeconds=60
    [junit4] 2> 1898512 INFO (coreLoadExecutor-6239-thread-1-processing-n:127.0.0.1:35917_) [n:127.0.0.1:35917_ c:control_collection s:shard1 r:core_node1 x:collection1] o.a.s.h.l.XMLLoader xsltCacheLifetimeSeconds=60
    [junit4] 2> 1898513 INFO (coreLoadExecutor-6239-thread-1-processing-n:127.0.0.1:35917_) [n:127.0.0.1:35917_ c:control_collection s:shard1 r:core_node1 x:collection1] o.a.s.h.l.XMLLoader xsltCacheLifetimeSeconds=60
    [junit4] 2> 1898513 INFO (coreLoadExecutor-6239-thread-1-processing-n:127.0.0.1:35917_) [n:127.0.0.1:35917_ c:control_collection s:shard1 r:core_node1 x:collection1] o.a.s.h.l.XMLLoader xsltCacheLifetimeSeconds=60
    [junit4] 2> 1898515 INFO (coreLoadExecutor-6239-thread-1-processing-n:127.0.0.1:35917_) [n:127.0.0.1:35917_ c:control_collection s:shard1 r:core_node1 x:collection1] o.a.s.c.RequestHandlers Registered paths: /admin/mbeans,standard,/update/json/docs,/admin/luke,/export,/get,/admin/properties,/update/json,/admin/threads,/dump,/update/csv,/sql,/graph,/admin/segments,/admin/system,/replication,/config,/stream,/schema,/admin/plugins,/admin/logging,/admin/ping,/update,/admin/file
    [junit4] 2> 1898515 INFO (coreLoadExecutor-6239-thread-1-processing-n:127.0.0.1:35917_) [n:127.0.0.1:35917_ c:control_collection s:shard1 r:core_node1 x:collection1] o.a.s.c.SolrCore Using default statsCache cache: org.apache.solr.search.stats.LocalStatsCache
    [junit4] 2> 1898515 INFO (coreLoadExecutor-6239-thread-1-processing-n:127.0.0.1:35917_) [n:127.0.0.1:35917_ c:control_collection s:shard1 r:core_node1 x:collection1] o.a.s.u.UpdateHandler Using UpdateLog implementation: org.apache.solr.update.UpdateLog
    [junit4] 2> 1898515 INFO (coreLoadExecutor-6239-thread-1-processing-n:127.0.0.1:35917_) [n:127.0.0.1:35917_ c:control_collection s:shard1 r:core_node1 x:collection1] o.a.s.u.UpdateLog Initializing UpdateLog: dataDir= defaultSyncLevel=FLUSH numRecordsToKeep=100 maxNumLogsToKeep=10 numVersionBuckets=65536
    [junit4] 2> 1898516 INFO (coreLoadExecutor-6239-thread-1-processing-n:127.0.0.1:35917_) [n:127.0.0.1:35917_ c:control_collection s:shard1 r:core_node1 x:collection1] o.a.s.u.CommitTracker Hard AutoCommit: disabled
    [junit4] 2> 1898516 INFO (coreLoadExecutor-6239-thread-1-processing-n:127.0.0.1:35917_) [n:127.0.0.1:35917_ c:control_collection s:shard1 r:core_node1 x:collection1] o.a.s.u.CommitTracker Soft AutoCommit: disabled
    [junit4] 2> 1898516 INFO (coreLoadExecutor-6239-thread-1-processing-n:127.0.0.1:35917_) [n:127.0.0.1:35917_ c:control_collection s:shard1 r:core_node1 x:collection1] o.a.s.u.RandomMergePolicy RandomMergePolicy wrapping class org.apache.lucene.index.TieredMergePolicy: [TieredMergePolicy: maxMergeAtOnce=22, maxMergeAtOnceExplicit=12, maxMergedSegmentMB=56.91796875, floorSegmentMB=1.2421875, forceMergeDeletesPctAllowed=26.042731846779013, segmentsPerTier=47.0, maxCFSSegmentSizeMB=8.796093022207999E12, noCFSRatio=0.0
    [junit4] 2> 1898516 INFO (coreLoadExecutor-6239-thread-1-processing-n:127.0.0.1:35917_) [n:127.0.0.1:35917_ c:control_collection s:shard1 r:core_node1 x:collection1] o.a.s.c.SolrDeletionPolicy SolrDeletionPolicy.onInit: commits: num=1
    [junit4] 2> commit{dir=RawDirectoryWrapper(RAMDirectory@6b4ca990 lockFactory=org.apache.lucene.store.SingleInstanceLockFactory@4dd2b9d5),segFN=segments_1,generation=1}
    [junit4] 2> 1898517 INFO (coreLoadExecutor-6239-thread-1-processing-n:127.0.0.1:35917_) [n:127.0.0.1:35917_ c:control_collection s:shard1 r:core_node1 x:collection1] o.a.s.c.SolrDeletionPolicy newest commit generation = 1
    [junit4] 2> 1898517 INFO (coreLoadExecutor-6239-thread-1-processing-n:127.0.0.1:35917_) [n:127.0.0.1:35917_ c:control_collection s:shard1 r:core_node1 x:collection1] o.a.s.s.SolrIndexSearcher Opening [Searcher@13194108[collection1] main]
    [junit4] 2> 1898517 INFO (coreLoadExecutor-6239-thread-1-processing-n:127.0.0.1:35917_) [n:127.0.0.1:35917_ c:control_collection s:shard1 r:core_node1 x:collection1] o.a.s.c.c.ZkStateReader Load collection config from: [/collections/control_collection]
    [junit4] 2> 1898517 INFO (coreLoadExecutor-6239-thread-1-processing-n:127.0.0.1:35917_) [n:127.0.0.1:35917_ c:control_collection s:shard1 r:core_node1 x:collection1] o.a.s.c.c.ZkStateReader path=[/collections/control_collection] [configName]=[conf1] specified config exists in ZooKeeper
    [junit4] 2> 1898517 INFO (coreLoadExecutor-6239-thread-1-processing-n:127.0.0.1:35917_) [n:127.0.0.1:35917_ c:control_collection s:shard1 r:core_node1 x:collection1] o.a.s.r.ManagedResourceStorage Setting up ZooKeeper-based storage for the RestManager with znodeBase: /configs/conf1
    [junit4] 2> 1898517 INFO (coreLoadExecutor-6239-thread-1-processing-n:127.0.0.1:35917_) [n:127.0.0.1:35917_ c:control_collection s:shard1 r:core_node1 x:collection1] o.a.s.r.ManagedResourceStorage Configured ZooKeeperStorageIO with znodeBase: /configs/conf1
    [junit4] 2> 1898517 INFO (coreLoadExecutor-6239-thread-1-processing-n:127.0.0.1:35917_) [n:127.0.0.1:35917_ c:control_collection s:shard1 r:core_node1 x:collection1] o.a.s.r.RestManager Initializing RestManager with initArgs: {}
    [junit4] 2> 1898517 INFO (coreLoadExecutor-6239-thread-1-processing-n:127.0.0.1:35917_) [n:127.0.0.1:35917_ c:control_collection s:shard1 r:core_node1 x:collection1] o.a.s.r.ManagedResourceStorage Reading _rest_managed.json using ZooKeeperStorageIO:path=/configs/conf1
    [junit4] 2> 1898518 INFO (coreLoadExecutor-6239-thread-1-processing-n:127.0.0.1:35917_) [n:127.0.0.1:35917_ c:control_collection s:shard1 r:core_node1 x:collection1] o.a.s.r.ManagedResourceStorage No data found for znode /configs/conf1/_rest_managed.json
    [junit4] 2> 1898518 INFO (coreLoadExecutor-6239-thread-1-processing-n:127.0.0.1:35917_) [n:127.0.0.1:35917_ c:control_collection s:shard1 r:core_node1 x:collection1] o.a.s.r.ManagedResourceStorage Loaded null at path _rest_managed.json using ZooKeeperStorageIO:path=/configs/conf1
    [junit4] 2> 1898518 INFO (coreLoadExecutor-6239-thread-1-processing-n:127.0.0.1:35917_) [n:127.0.0.1:35917_ c:control_collection s:shard1 r:core_node1 x:collection1] o.a.s.r.RestManager Initializing 0 registered ManagedResources
    [junit4] 2> 1898518 INFO (coreLoadExecutor-6239-thread-1-processing-n:127.0.0.1:35917_) [n:127.0.0.1:35917_ c:control_collection s:shard1 r:core_node1 x:collection1] o.a.s.h.ReplicationHandler Commits will be reserved for 10000
    [junit4] 2> 1898518 INFO (searcherExecutor-6240-thread-1-processing-n:127.0.0.1:35917_ x:collection1 s:shard1 c:control_collection r:core_node1) [n:127.0.0.1:35917_ c:control_collection s:shard1 r:core_node1 x:collection1] o.a.s.c.SolrCore [collection1] Registered new searcher Searcher@13194108[collection1] main{ExitableDirectoryReader(UninvertingDirectoryReader())}
    [junit4] 2> 1898518 INFO (coreLoadExecutor-6239-thread-1-processing-n:127.0.0.1:35917_) [n:127.0.0.1:35917_ c:control_collection s:shard1 r:core_node1 x:collection1] o.a.s.u.UpdateLog Looking up max value of version field to seed version buckets
    [junit4] 2> 1898518 INFO (coreLoadExecutor-6239-thread-1-processing-n:127.0.0.1:35917_) [n:127.0.0.1:35917_ c:control_collection s:shard1 r:core_node1 x:collection1] o.a.s.u.VersionInfo Refreshing highest value of _version_ for 65536 version buckets from index
    [junit4] 2> 1898518 INFO (coreLoadExecutor-6239-thread-1-processing-n:127.0.0.1:35917_) [n:127.0.0.1:35917_ c:control_collection s:shard1 r:core_node1 x:collection1] o.a.s.u.VersionInfo No terms found for _version_, cannot seed version bucket highest value from index
    [junit4] 2> 1898518 INFO (coreLoadExecutor-6239-thread-1-processing-n:127.0.0.1:35917_) [n:127.0.0.1:35917_ c:control_collection s:shard1 r:core_node1 x:collection1] o.a.s.u.UpdateLog Could not find max version in index or recent updates, using new clock 1537476399783215104
    [junit4] 2> 1898520 INFO (coreLoadExecutor-6239-thread-1-processing-n:127.0.0.1:35917_) [n:127.0.0.1:35917_ c:control_collection s:shard1 r:core_node1 x:collection1] o.a.s.u.UpdateLog Took 1.0ms to seed version buckets with highest version 1537476399783215104
    [junit4] 2> 1898521 INFO (coreLoadExecutor-6239-thread-1-processing-n:127.0.0.1:35917_) [n:127.0.0.1:35917_ c:control_collection s:shard1 r:core_node1 x:collection1] o.a.s.c.ZkController watch zkdir /configs/conf1
    [junit4] 2> 1898521 INFO (coreLoadExecutor-6239-thread-1-processing-n:127.0.0.1:35917_) [n:127.0.0.1:35917_ c:control_collection s:shard1 r:core_node1 x:collection1] o.a.s.c.CoreContainer registering core: collection1
    [junit4] 2> 1898521 INFO (coreZkRegister-6233-thread-1-processing-n:127.0.0.1:35917_ x:collection1 s:shard1 c:control_collection r:core_node1) [n:127.0.0.1:35917_ c:control_collection s:shard1 r:core_node1 x:collection1] o.a.s.c.ZkController Register replica - core:collection1 address:https://127.0.0.1:35917 collection:control_collection shard:shard1
    [junit4] 2> 1898522 INFO (coreZkRegister-6233-thread-1-processing-n:127.0.0.1:35917_ x:collection1 s:shard1 c:control_collection r:core_node1) [n:127.0.0.1:35917_ c:control_collection s:shard1 r:core_node1 x:collection1] o.a.s.c.c.SolrZkClient makePath: /collections/control_collection/leader_elect/shard1/election
    [junit4] 2> 1898522 INFO (coreZkRegister-6233-thread-1-processing-n:127.0.0.1:35917_ x:collection1 s:shard1 c:control_collection r:core_node1) [n:127.0.0.1:35917_ c:control_collection s:shard1 r:core_node1 x:collection1] o.a.s.c.LeaderElector Joined leadership election with path: /collections/control_collection/leader_elect/shard1/election/96092274900402181-core_node1-n_0000000000
    [junit4] 2> 1898523 INFO (coreZkRegister-6233-thread-1-processing-n:127.0.0.1:35917_ x:collection1 s:shard1 c:control_collection r:core_node1) [n:127.0.0.1:35917_ c:control_collection s:shard1 r:core_node1 x:collection1] o.a.s.c.ShardLeaderElectionContext Running the leader process for shard=shard1 and weAreReplacement=false and leaderVoteWait=10000
    [junit4] 2> 1898523 INFO (coreZkRegister-6233-thread-1-processing-n:127.0.0.1:35917_ x:collection1 s:shard1 c:control_collection r:core_node1) [n:127.0.0.1:35917_ c:control_collection s:shard1 r:core_node1 x:collection1] o.a.s.c.ShardLeaderElectionContext Enough replicas found to continue.
    [junit4] 2> 1898523 INFO (coreZkRegister-6233-thread-1-processing-n:127.0.0.1:35917_ x:collection1 s:shard1 c:control_collection r:core_node1) [n:127.0.0.1:35917_ c:control_collection s:shard1 r:core_node1 x:collection1] o.a.s.c.ShardLeaderElectionContext I may be the new leader - try and sync
    [junit4] 2> 1898523 INFO (coreZkRegister-6233-thread-1-processing-n:127.0.0.1:35917_ x:collection1 s:shard1 c:control_collection r:core_node1) [n:127.0.0.1:35917_ c:control_collection s:shard1 r:core_node1 x:collection1] o.a.s.c.SyncStrategy Sync replicas to https://127.0.0.1:35917/collection1/
    [junit4] 2> 1898523 INFO (OverseerStateUpdate-96092274900402181-127.0.0.1:35917_-n_0000000000) [n:127.0.0.1:35917_ ] o.a.s.c.Overseer processMessage: queueSize: 1, message = {
    [junit4] 2> "operation":"leader",
    [junit4] 2> "shard":"shard1",
    [junit4] 2> "collection":"control_collection"} current state version: 1
    [junit4] 2> 1898523 INFO (coreZkRegister-6233-thread-1-processing-n:127.0.0.1:35917_ x:collection1 s:shard1 c:control_collection r:core_node1) [n:127.0.0.1:35917_ c:control_collection s:shard1 r:core_node1 x:collection1] o.a.s.c.SyncStrategy Sync Success - now sync replicas to me
    [junit4] 2> 1898523 INFO (coreZkRegister-6233-thread-1-processing-n:127.0.0.1:35917_ x:collection1 s:shard1 c:control_collection r:core_node1) [n:127.0.0.1:35917_ c:control_collection s:shard1 r:core_node1 x:collection1] o.a.s.c.SyncStrategy https://127.0.0.1:35917/collection1/ has no replicas
    [junit4] 2> 1898524 INFO (coreZkRegister-6233-thread-1-processing-n:127.0.0.1:35917_ x:collection1 s:shard1 c:control_collection r:core_node1) [n:127.0.0.1:35917_ c:control_collection s:shard1 r:core_node1 x:collection1] o.a.s.c.c.SolrZkClient makePath: /collections/control_collection/leaders/shard1
    [junit4] 2> 1898524 INFO (coreZkRegister-6233-thread-1-processing-n:127.0.0.1:35917_ x:collection1 s:shard1 c:control_collection r:core_node1) [n:127.0.0.1:35917_ c:control_collection s:shard1 r:core_node1 x:collection1] o.a.s.c.ShardLeaderElectionContextBase Creating leader registration node /collections/control_collection/leaders/shard1/leader after winning as /collections/control_collection/leader_elect/shard1/election/96092274900402181-core_node1-n_0000000000
    [junit4] 2> 1898525 INFO (coreZkRegister-6233-thread-1-processing-n:127.0.0.1:35917_ x:collection1 s:shard1 c:control_collection r:core_node1) [n:127.0.0.1:35917_ c:control_collection s:shard1 r:core_node1 x:collection1] o.a.s.c.ShardLeaderElectionContext I am the new leader: https://127.0.0.1:35917/collection1/ shard1
    [junit4] 2> 1898525 INFO (OverseerStateUpdate-96092274900402181-127.0.0.1:35917_-n_0000000000) [n:127.0.0.1:35917_ ] o.a.s.c.Overseer processMessage: queueSize: 1, message = {
    [junit4] 2> "operation":"leader",
    [junit4] 2> "shard":"shard1",
    [junit4] 2> "collection":"control_collection",
    [junit4] 2> "base_url":"https://127.0.0.1:35917",
    [junit4] 2> "core":"collection1",
    [junit4] 2> "state":"active"} current state version: 1
    [junit4] 2> 1898626 INFO (zkCallback-2344-thread-1-processing-n:127.0.0.1:35917_) [n:127.0.0.1:35917_ ] o.a.s.c.c.ZkStateReader A cluster state change: [WatchedEvent state:SyncConnected type:NodeDataChanged path:/clusterstate.json], has occurred - updating... (live nodes size: [1])
    [junit4] 2> 1898676 INFO (coreZkRegister-6233-thread-1-processing-n:127.0.0.1:35917_ x:collection1 s:shard1 c:control_collection r:core_node1) [n:127.0.0.1:35917_ c:control_collection s:shard1 r:core_node1 x:collection1] o.a.s.c.ZkController We are https://127.0.0.1:35917/collection1/ and leader is https://127.0.0.1:35917/collection1/
    [junit4] 2> 1898676 INFO (coreZkRegister-6233-thread-1-processing-n:127.0.0.1:35917_ x:collection1 s:shard1 c:control_collection r:core_node1) [n:127.0.0.1:35917_ c:control_collection s:shard1 r:core_node1 x:collection1] o.a.s.c.ZkController No LogReplay needed for core=collection1 baseURL=https://127.0.0.1:35917
    [junit4] 2> 1898676 INFO (coreZkRegister-6233-thread-1-processing-n:127.0.0.1:35917_ x:collection1 s:shard1 c:control_collection r:core_node1) [n:127.0.0.1:35917_ c:control_collection s:shard1 r:core_node1 x:collection1] o.a.s.c.ZkController I am the leader, no recovery necessary
    [junit4] 2> 1898676 INFO (coreZkRegister-6233-thread-1-processing-n:127.0.0.1:35917_ x:collection1 s:shard1 c:control_collection r:core_node1) [n:127.0.0.1:35917_ c:control_collection s:shard1 r:core_node1 x:collection1] o.a.s.c.ZkController publishing state=active
    [junit4] 2> 1898676 INFO (coreZkRegister-6233-thread-1-processing-n:127.0.0.1:35917_ x:collection1 s:shard1 c:control_collection r:core_node1) [n:127.0.0.1:35917_ c:control_collection s:shard1 r:core_node1 x:collection1] o.a.s.c.ZkController numShards not found on descriptor - reading it from system property
    [junit4] 2> 1898677 INFO (OverseerStateUpdate-96092274900402181-127.0.0.1:35917_-n_0000000000) [n:127.0.0.1:35917_ ] o.a.s.c.Overseer processMessage: queueSize: 1, message = {
    [junit4] 2> "core":"collection1",
    [junit4] 2> "core_node_name":"core_node1",
    [junit4] 2> "roles":null,
    [junit4] 2> "base_url":"https://127.0.0.1:35917",
    [junit4] 2> "node_name":"127.0.0.1:35917_",
    [junit4] 2> "numShards":"1",
    [junit4] 2> "state":"active",
    [junit4] 2> "shard":"shard1",
    [junit4] 2> "collection":"control_collection",
    [junit4] 2> "operation":"state"} current state version: 2
    [junit4] 2> 1898677 INFO (OverseerStateUpdate-96092274900402181-127.0.0.1:35917_-n_0000000000) [n:127.0.0.1:35917_ ] o.a.s.c.o.ReplicaMutator Update state numShards=1 message={
    [junit4] 2> "core":"collection1",
    [junit4] 2> "core_node_name":"core_node1",
    [junit4] 2> "roles":null,
    [junit4] 2> "base_url":"https://127.0.0.1:35917",
    [junit4] 2> "node_name":"127.0.0.1:35917_",
    [junit4] 2> "numShards":"1",
    [junit4] 2> "state":"active",
    [junit4] 2> "shard":"shard1",
    [junit4] 2> "collection":"control_collection",
    [junit4] 2> "operation":"state"}
    [junit4] 2> 1898778 INFO (zkCallback-2344-thread-2-processing-n:127.0.0.1:35917_) [n:127.0.0.1:35917_ ] o.a.s.c.c.ZkStateReader A cluster state change: [WatchedEvent state:SyncConnected type:NodeDataChanged path:/clusterstate.json], has occurred - updating... (live nodes size: [1])
    [junit4] 2> 1898931 INFO (TEST-TestReqParamsAPI.test-seed#[5C6C84A667BB4041]) [ ] o.a.s.c.s.i.CloudSolrClient Final constructed zkHost string: 127.0.0.1:45434/solr
    [junit4] 2> 1898932 INFO (TEST-TestReqParamsAPI.test-seed#[5C6C84A667BB4041]) [ ] o.a.s.c.c.SolrZkClient Using default ZkCredentialsProvider
    [junit4] 2> 1898932 INFO (TEST-TestReqParamsAPI.test-seed#[5C6C84A667BB4041]) [ ] o.a.s.c.c.ConnectionManager Waiting for client to connect to ZooKeeper
    [junit4] 2> 1898933 INFO (zkCallback-2348-thread-1) [ ] o.a.s.c.c.ConnectionManager Watcher org.apache.solr.common.cloud.ConnectionManager@15769bb1 name:ZooKeeperConnection Watcher:127.0.0.1:45434/solr got event WatchedEvent state:SyncConnected type:None path:null path:null type:None
    [junit4] 2> 1898933 INFO (TEST-TestReqParamsAPI.test-seed#[5C6C84A667BB4041]) [ ] o.a.s.c.c.ConnectionManager Client is connected to ZooKeeper
    [junit4] 2> 1898933 INFO (TEST-TestReqParamsAPI.test-seed#[5C6C84A667BB4041]) [ ] o.a.s.c.c.SolrZkClient Using default ZkACLProvider
    [junit4] 2> 1898933 INFO (TEST-TestReqParamsAPI.test-seed#[5C6C84A667BB4041]) [ ] o.a.s.c.c.ZkStateReader Updating cluster state from ZooKeeper...
    [junit4] 2> 1898933 INFO (TEST-TestReqParamsAPI.test-seed#[5C6C84A667BB4041]) [ ] o.a.s.c.c.ZkStateReader Loaded cluster properties: {urlScheme=https}
    [junit4] 2> 1898933 INFO (TEST-TestReqParamsAPI.test-seed#[5C6C84A667BB4041]) [ ] o.a.s.c.c.ZkStateReader Updated live nodes from ZooKeeper... (0) -> (1)
    [junit4] 2> 1898934 INFO (TEST-TestReqParamsAPI.test-seed#[5C6C84A667BB4041]) [ ] o.a.s.c.ChaosMonkey monkey: init - expire sessions:false cause connection loss:false
    [junit4] 2> 1898991 INFO (TEST-TestReqParamsAPI.test-seed#[5C6C84A667BB4041]) [ ] o.a.s.SolrTestCaseJ4 Writing core.properties file to /home/jenkins/workspace/Lucene-Solr-master-Linux/solr/build/solr-core/test/J0/temp/solr.handler.TestReqParamsAPI_5C6C84A667BB4041-001/shard-1-001/cores/collection1
    [junit4] 2> 1898992 INFO (TEST-TestReqParamsAPI.test-seed#[5C6C84A667BB4041]) [ ] o.a.s.c.AbstractFullDistribZkTestBase create jetty 1 in directory /home/jenkins/workspace/Lucene-Solr-master-Linux/solr/build/solr-core/test/J0/temp/solr.handler.TestReqParamsAPI_5C6C84A667BB4041-001/shard-1-001
    [junit4] 2> 1898993 INFO (TEST-TestReqParamsAPI.test-seed#[5C6C84A667BB4041]) [ ] o.e.j.s.Server jetty-9.3.8.v20160314
    [junit4] 2> 1898993 INFO (TEST-TestReqParamsAPI.test-seed#[5C6C84A667BB4041]) [ ] o.e.j.s.h.ContextHandler Started o.e.j.s.ServletContextHandler@3bcba507{/,null,AVAILABLE}
    [junit4] 2> 1898994 INFO (TEST-TestReqParamsAPI.test-seed#[5C6C84A667BB4041]) [ ] o.e.j.s.ServerConnector Started ServerConnector@4f4dc5d9{SSL,[ssl, http/1.1]}{127.0.0.1:45803}
    [junit4] 2> 1898994 INFO (TEST-TestReqParamsAPI.test-seed#[5C6C84A667BB4041]) [ ] o.e.j.s.Server Started @1900416ms
    [junit4] 2> 1898994 INFO (TEST-TestReqParamsAPI.test-seed#[5C6C84A667BB4041]) [ ] o.a.s.c.s.e.JettySolrRunner Jetty properties: {solr.data.dir=/home/jenkins/workspace/Lucene-Solr-master-Linux/solr/build/solr-core/test/J0/temp/solr.handler.TestReqParamsAPI_5C6C84A667BB4041-001/tempDir-001/jetty1, solrconfig=solrconfig.xml, hostContext=/, hostPort=45803, coreRootDirectory=/home/jenkins/workspace/Lucene-Solr-master-Linux/solr/build/solr-core/test/J0/../../../../../../../../../home/jenkins/workspace/Lucene-Solr-master-Linux/solr/build/solr-core/test/J0/temp/solr.handler.TestReqParamsAPI_5C6C84A667BB4041-001/shard-1-001/cores}
    [junit4] 2> 1898995 INFO (TEST-TestReqParamsAPI.test-seed#[5C6C84A667BB4041]) [ ] o.a.s.s.SolrDispatchFilter SolrDispatchFilter.init(): sun.misc.Launcher$AppClassLoader@73d16e93
    [junit4] 2> 1898995 INFO (TEST-TestReqParamsAPI.test-seed#[5C6C84A667BB4041]) [ ] o.a.s.c.SolrResourceLoader new SolrResourceLoader for directory: '/home/jenkins/workspace/Lucene-Solr-master-Linux/solr/build/solr-core/test/J0/temp/solr.handler.TestReqParamsAPI_5C6C84A667BB4041-001/shard-1-001'
    [junit4] 2> 1898995 INFO (TEST-TestReqParamsAPI.test-seed#[5C6C84A667BB4041]) [ ] o.a.s.c.SolrResourceLoader JNDI not configured for solr (NoInitialContextEx)
    [junit4] 2> 1898995 INFO (TEST-TestReqParamsAPI.test-seed#[5C6C84A667BB4041]) [ ] o.a.s.c.SolrResourceLoader solr home defaulted to 'solr/' (could not find system property or JNDI)
    [junit4] 2> 1898995 INFO (TEST-TestReqParamsAPI.test-seed#[5C6C84A667BB4041]) [ ] o.a.s.c.c.SolrZkClient Using default ZkCredentialsProvider
    [junit4] 2> 1898995 INFO (TEST-TestReqParamsAPI.test-seed#[5C6C84A667BB4041]) [ ] o.a.s.c.c.ConnectionManager Waiting for client to connect to ZooKeeper
    [junit4] 2> 1898997 INFO (zkCallback-2349-thread-1) [ ] o.a.s.c.c.ConnectionManager Watcher org.apache.solr.common.cloud.ConnectionManager@24cd03c name:ZooKeeperConnection Watcher:127.0.0.1:45434/solr got event WatchedEvent state:SyncConnected type:None path:null path:null type:None
    [junit4] 2> 1898997 INFO (TEST-TestReqParamsAPI.test-seed#[5C6C84A667BB4041]) [ ] o.a.s.c.c.ConnectionManager Client is connected to ZooKeeper
    [junit4] 2> 1898997 INFO (TEST-TestReqParamsAPI.test-seed#[5C6C84A667BB4041]) [ ] o.a.s.c.c.SolrZkClient Using default ZkACLProvider
    [junit4] 2> 1898997 INFO (TEST-TestReqParamsAPI.test-seed#[5C6C84A667BB4041]) [ ] o.a.s.s.SolrDispatchFilter Loading solr.xml from SolrHome (not found in ZooKeeper)
    [junit4] 2> 1898997 INFO (TEST-TestReqParamsAPI.test-seed#[5C6C84A667BB4041]) [ ] o.a.s.c.SolrXmlConfig Loading container configuration from /home/jenkins/workspace/Lucene-Solr-master-Linux/solr/build/solr-core/test/J0/temp/solr.handler.TestReqParamsAPI_5C6C84A667BB4041-001/shard-1-001/solr.xml
    [junit4] 2> 1899000 INFO (TEST-TestReqParamsAPI.test-seed#[5C6C84A667BB4041]) [ ] o.a.s.c.CorePropertiesLocator Config-defined core root directory: /home/jenkins/workspace/Lucene-Solr-master-Linux/solr/build/solr-core/test/J0/../../../../../../../../../home/jenkins/workspace/Lucene-Solr-master-Linux/solr/build/solr-core/test/J0/temp/solr.handler.TestReqParamsAPI_5C6C84A667BB4041-001/shard-1-001/cores
    [junit4] 2> 1899000 INFO (TEST-TestReqParamsAPI.test-seed#[5C6C84A667BB4041]) [ ] o.a.s.c.CoreContainer New CoreContainer 778319590
    [junit4] 2> 1899000 INFO (TEST-TestReqParamsAPI.test-seed#[5C6C84A667BB4041]) [ ] o.a.s.c.CoreContainer Loading cores into CoreContainer [instanceDir=/home/jenkins/workspace/Lucene-Solr-master-Linux/solr/build/solr-core/test/J0/temp/solr.handler.TestReqParamsAPI_5C6C84A667BB4041-001/shard-1-001]
    [junit4] 2> 1899001 WARN (TEST-TestReqParamsAPI.test-seed#[5C6C84A667BB4041]) [ ] o.a.s.c.CoreContainer Couldn't add files from /home/jenkins/workspace/Lucene-Solr-master-Linux/solr/build/solr-core/test/J0/temp/solr.handler.TestReqParamsAPI_5C6C84A667BB4041-001/shard-1-001/lib to classpath: /home/jenkins/workspace/Lucene-Solr-master-Linux/solr/build/solr-core/test/J0/temp/solr.handler.TestReqParamsAPI_5C6C84A667BB4041-001/shard-1-001/lib
    [junit4] 2> 1899001 INFO (TEST-TestReqParamsAPI.test-seed#[5C6C84A667BB4041]) [ ] o.a.s.h.c.HttpShardHandlerFactory created with socketTimeout : 90000,urlScheme : ,connTimeout : 15000,maxConnectionsPerHost : 20,maxConnections : 10000,corePoolSize : 0,maximumPoolSize : 2147483647,maxThreadIdleTime : 5,sizeOfQueue : -1,fairnessPolicy : false,
    [junit4] 2> 1899002 INFO (TEST-TestReqParamsAPI.test-seed#[5C6C84A667BB4041]) [ ] o.a.s.u.UpdateShardHandler Creating UpdateShardHandler HTTP client with params:
    [junit4] 2> 1899002 INFO (TEST-TestReqParamsAPI.test-seed#[5C6C84A667BB4041]) [ ] o.a.s.l.LogWatcher SLF4J impl is org.slf4j.impl.Log4jLoggerFactory
    [junit4] 2> 1899002 INFO (TEST-TestReqParamsAPI.test-seed#[5C6C84A667BB4041]) [ ] o.a.s.l.LogWatcher Registering Log Listener [Log4j (org.slf4j.impl.Log4jLoggerFactory)]
    [junit4] 2> 1899002 INFO (TEST-TestReqParamsAPI.test-seed#[5C6C84A667BB4041]) [ ] o.a.s.c.ZkContainer Zookeeper client=127.0.0.1:45434/solr
    [junit4] 2> 1899002 INFO (TEST-TestReqParamsAPI.test-seed#[5C6C84A667BB4041]) [ ] o.a.s.c.ZkController zkHost includes chroot
    [junit4] 2> 1899002 INFO (TEST-TestReqParamsAPI.test-seed#[5C6C84A667BB4041]) [ ] o.a.s.c.c.SolrZkClient Using default ZkCredentialsProvider
    [junit4] 2> 1899003 INFO (TEST-TestReqParamsAPI.test-seed#[5C6C84A667BB4041]) [ ] o.a.s.c.c.ConnectionManager Waiting for client to connect to ZooKeeper
    [junit4] 2> 1899003 INFO (zkCallback-2352-thread-1) [ ] o.a.s.c.c.ConnectionManager Watcher org.apache.solr.common.cloud.ConnectionManager@124f489e name:ZooKeeperConnection Watcher:127.0.0.1:45434 got event WatchedEvent state:SyncConnected type:None path:null path:null type:None
    [junit4] 2> 1899003 INFO (TEST-TestReqParamsAPI.test-seed#[5C6C84A667BB4041]) [ ] o.a.s.c.c.ConnectionManager Client is connected to ZooKeeper
    [junit4] 2> 1899003 INFO (TEST-TestReqParamsAPI.test-seed#[5C6C84A667BB4041]) [ ] o.a.s.c.c.SolrZkClient Using default ZkACLProvider
    [junit4] 2> 1899004 INFO (TEST-TestReqParamsAPI.test-seed#[5C6C84A667BB4041]) [n:127.0.0.1:45803_ ] o.a.s.c.ZkController Added new OnReconnect listener org.apache.solr.cloud.ZkController$$Lambda$61/2133795607@5d075875
    [junit4] 2> 1899004 INFO (TEST-TestReqParamsAPI.test-seed#[5C6C84A667BB4041]) [n:127.0.0.1:45803_ ] o.a.s.c.c.ConnectionManager Waiting for client to connect to ZooKeeper
    [junit4] 2> 1899005 INFO (zkCallback-2353-thread-1-processing-n:127.0.0.1:45803_) [n:127.0.0.1:45803_ ] o.a.s.c.c.ConnectionManager Watcher org.apache.solr.common.cloud.ConnectionManager@3c18d816 name:ZooKeeperConnection Watcher:127.0.0.1:45434/solr got event WatchedEvent state:SyncConnected type:None path:null path:null type:None
    [junit4] 2> 1899005 INFO (TEST-TestReqParamsAPI.test-seed#[5C6C84A667BB4041]) [n:127.0.0.1:45803_ ] o.a.s.c.c.ConnectionManager Client is connected to ZooKeeper
    [junit4] 2> 1899007 INFO (TEST-TestReqParamsAPI.test-seed#[5C6C84A667BB4041]) [n:127.0.0.1:45803_ ] o.a.s.c.c.ZkStateReader Updating cluster state from ZooKeeper...
    [junit4] 2> 1899007 INFO (TEST-TestReqParamsAPI.test-seed#[5C6C84A667BB4041]) [n:127.0.0.1:45803_ ] o.a.s.c.c.ZkStateReader Loaded cluster properties: {urlScheme=https}
    [junit4] 2> 1899007 INFO (TEST-TestReqParamsAPI.test-seed#[5C6C84A667BB4041]) [n:127.0.0.1:45803_ ] o.a.s.c.c.ZkStateReader Updated live nodes from ZooKeeper... (0) -> (1)
    [junit4] 2> 1899009 INFO (TEST-TestReqParamsAPI.test-seed#[5C6C84A667BB4041]) [n:127.0.0.1:45803_ ] o.a.s.c.Overseer Overseer (id=null) closing
    [junit4] 2> 1899009 INFO (TEST-TestReqParamsAPI.test-seed#[5C6C84A667BB4041]) [n:127.0.0.1:45803_ ] o.a.s.c.LeaderElector Joined leadership election with path: /overseer_elect/election/96092274900402185-127.0.0.1:45803_-n_0000000001
    [junit4] 2> 1899009 INFO (TEST-TestReqParamsAPI.test-seed#[5C6C84A667BB4041]) [n:127.0.0.1:45803_ ] o.a.s.c.LeaderElector Watching path /overseer_elect/election/96092274900402181-127.0.0.1:35917_-n_0000000000 to know if I could be the leader
    [junit4] 2> 1899009 INFO (TEST-TestReqParamsAPI.test-seed#[5C6C84A667BB4041]) [n:127.0.0.1:45803_ ] o.a.s.c.ZkController Publish node=127.0.0.1:45803_ as DOWN
    [junit4] 2> 1899010 INFO (OverseerStateUpdate-96092274900402181-127.0.0.1:35917_-n_0000000000) [n:127.0.0.1:35917_ ] o.a.s.c.Overseer processMessage: queueSize: 1, message = {
    [junit4] 2> "operation":"downnode",
    [junit4] 2> "node_name":"127.0.0.1:45803_"} current state version: 3
    [junit4] 2> 1899010 INFO (OverseerStateUpdate-96092274900402181-127.0.0.1:35917_-n_0000000000) [n:127.0.0.1:35917_ ] o.a.s.c.o.NodeMutator DownNode state invoked for node: 127.0.0.1:45803_
    [junit4] 2> 1899111 INFO (zkCallback-2344-thread-3-processing-n:127.0.0.1:35917_) [n:127.0.0.1:35917_ ] o.a.s.c.c.ZkStateReader A cluster state change: [WatchedEvent state:SyncConnected type:NodeDataChanged path:/clusterstate.json], has occurred - updating... (live nodes size: [1])
    [junit4] 2> 1899111 INFO (zkCallback-2348-thread-1) [ ] o.a.s.c.c.ZkStateReader A cluster state change: [WatchedEvent state:SyncConnected type:NodeDataChanged path:/clusterstate.json], has occurred - updating... (live nodes size: [1])
    [junit4] 2> 1899111 INFO (zkCallback-2353-thread-1-processing-n:127.0.0.1:45803_) [n:127.0.0.1:45803_ ] o.a.s.c.c.ZkStateReader A cluster state change: [WatchedEvent state:SyncConnected type:NodeDataChanged path:/clusterstate.json], has occurred - updating... (live nodes size: [1])
    [junit4] 2> 1900010 INFO (TEST-TestReqParamsAPI.test-seed#[5C6C84A667BB4041]) [n:127.0.0.1:45803_ ] o.a.s.c.ZkController Register node as live in ZooKeeper:/live_nodes/127.0.0.1:45803_
    [junit4] 2> 1900010 INFO (TEST-TestReqParamsAPI.test-seed#[5C6C84A667BB4041]) [n:127.0.0.1:45803_ ] o.a.s.c.c.SolrZkClient makePath: /live_nodes/127.0.0.1:45803_
    [junit4] 2> 1900011 INFO (zkCallback-2353-thread-1-processing-n:127.0.0.1:45803_) [n:127.0.0.1:45803_ ] o.a.s.c.c.ZkStateReader A live node change: [WatchedEvent state:SyncConnected type:NodeChildrenChanged path:/live_nodes], has occurred - updating... (live nodes size: [1])
    [junit4] 2> 1900011 INFO (zkCallback-2344-thread-3-processing-n:127.0.0.1:35917_) [n:127.0.0.1:35917_ ] o.a.s.c.c.ZkStateReader A live node change: [WatchedEvent state:SyncConnected type:NodeChildrenChanged path:/live_nodes], has occurred - updating... (live nodes size: [1])
    [junit4] 2> 1900011 INFO (zkCallback-2348-thread-1) [ ] o.a.s.c.c.ZkStateReader A live node change: [WatchedEvent state:SyncConnected type:NodeChildrenChanged path:/live_nodes], has occurred - updating... (live nodes size: [1])
    [junit4] 2> 1900011 INFO (zkCallback-2353-thread-1-processing-n:127.0.0.1:45803_) [n:127.0.0.1:45803_ ] o.a.s.c.c.ZkStateReader Updated live nodes from ZooKeeper... (1) -> (2)
    [junit4] 2> 1900011 INFO (zkCallback-2344-thread-3-processing-n:127.0.0.1:35917_) [n:127.0.0.1:35917_ ] o.a.s.c.c.ZkStateReader Updated live nodes from ZooKeeper... (1) -> (2)
    [junit4] 2> 1900011 INFO (zkCallback-2348-thread-1) [ ] o.a.s.c.c.ZkStateReader Updated live nodes from ZooKeeper... (1) -> (2)
    [junit4] 2> 1900019 INFO (TEST-TestReqParamsAPI.test-seed#[5C6C84A667BB4041]) [n:127.0.0.1:45803_ ] o.a.s.c.CoreContainer Security conf doesn't exist. Skipping setup for authorization module.
    [junit4] 2> 1900019 INFO (TEST-TestReqParamsAPI.test-seed#[5C6C84A667BB4041]) [n:127.0.0.1:45803_ ] o.a.s.c.CoreContainer No authentication plugin used.
    [junit4] 2> 1900019 INFO (TEST-TestReqParamsAPI.test-seed#[5C6C84A667BB4041]) [n:127.0.0.1:45803_ ] o.a.s.c.CorePropertiesLocator Looking for core definitions underneath /home/jenkins/workspace/Lucene-Solr-master-Linux/solr/build/solr-core/test/J0/../../../../../../../../../home/jenkins/workspace/Lucene-Solr-master-Linux/solr/build/solr-core/test/J0/temp/solr.handler.TestReqParamsAPI_5C6C84A667BB4041-001/shard-1-001/cores
    [junit4] 2> 1900020 INFO (TEST-TestReqParamsAPI.test-seed#[5C6C84A667BB4041]) [n:127.0.0.1:45803_ ] o.a.s.c.CoreDescriptor Created CoreDescriptor: {name=collection1, config=solrconfig.xml, transient=false, schema=schema.xml, loadOnStartup=true, configSetProperties=configsetprops.json, collection=collection1, coreNodeName=, dataDir=data/, shard=}
    [junit4] 2> 1900020 INFO (TEST-TestReqParamsAPI.test-seed#[5C6C84A667BB4041]) [n:127.0.0.1:45803_ ] o.a.s.c.CorePropertiesLocator Found core collection1 in /home/jenkins/workspace/Lucene-Solr-master-Linux/solr/build/solr-core/test/J0/../../../../../../../../../home/jenkins/workspace/Lucene-Solr-master-Linux/solr/build/solr-core/test/J0/temp/solr.handler.TestReqParamsAPI_5C6C84A667BB4041-001/shard-1-001/cores/collection1
    [junit4] 2> 1900020 INFO (TEST-TestReqParamsAPI.test-seed#[5C6C84A667BB4041]) [n:127.0.0.1:45803_ ] o.a.s.c.CorePropertiesLocator Found 1 core definitions
    [junit4] 2> 1900020 INFO (coreLoadExecutor-6250-thread-1-processing-n:127.0.0.1:45803_) [n:127.0.0.1:45803_ c:collection1 x:collection1] o.a.s.c.ZkController publishing state=down
    [junit4] 2> 1900021 INFO (coreLoadExecutor-6250-thread-1-processing-n:127.0.0.1:45803_) [n:127.0.0.1:45803_ c:collection1 x:collection1] o.a.s.c.ZkController numShards not found on descriptor - reading it from system property
    [junit4] 2> 1900020 INFO (TEST-TestReqParamsAPI.test-seed#[5C6C84A667BB4041]) [n:127.0.0.1:45803_ ] o.a.s.s.SolrDispatchFilter user.dir=/home/jenkins/workspace/Lucene-Solr-master-Linux/solr/build/solr-core/test/J0
    [junit4] 2> 1900021 INFO (TEST-TestReqParamsAPI.test-seed#[5C6C84A667BB4041]) [n:127.0.0.1:45803_ ] o.a.s.s.SolrDispatchFilter SolrDispatchFilter.init() done
    [junit4] 2> 1900021 INFO (coreLoadExecutor-6250-thread-1-processing-n:127.0.0.1:45803_) [n:127.0.0.1:45803_ c:collection1 x:collection1] o.a.s.c.ZkController Collection collection1 not visible yet, but flagging it so a watch is registered when it becomes visible
    [junit4] 2> 1900021 INFO (OverseerStateUpdate-96092274900402181-127.0.0.1:35917_-n_0000000000) [n:127.0.0.1:35917_ ] o.a.s.c.Overseer processMessage: queueSize: 1, message = {
    [junit4] 2> "core":"collection1",
    [junit4] 2> "roles":null,
    [junit4] 2> "base_url":"https://127.0.0.1:45803",
    [junit4] 2> "node_name":"127.0.0.1:45803_",
    [junit4] 2> "numShards":"2",
    [junit4] 2> "state":"down",
    [junit4] 2> "shard":null,
    [junit4] 2> "collection":"collection1",
    [junit4] 2> "operation":"state"} current state version: 4
    [junit4] 2> 1900021 INFO (coreLoadExecutor-6250-thread-1-processing-n:127.0.0.1:45803_) [n:127.0.0.1:45803_ c:collection1 x:collection1] o.a.s.c.c.ZkStateReader Deleting data for [collection1]
    [junit4] 2> 1900021 INFO (OverseerStateUpdate-96092274900402181-127.0.0.1:35917_-n_0000000000) [n:127.0.0.1:35917_ ] o.a.s.c.o.ReplicaMutator Update state numShards=2 message={
    [junit4] 2> "core":"collection1",
    [junit4] 2> "roles":null,
    [junit4] 2> "base_url":"https://127.0.0.1:45803",
    [junit4] 2> "node_name":"127.0.0.1:45803_",
    [junit4] 2> "numShards":"2",
    [junit4] 2> "state":"down",
    [junit4] 2> "shard":null,
    [junit4] 2> "collection":"collection1",
    [junit4] 2> "operation":"state"}
    [junit4] 2> 1900021 INFO (OverseerStateUpdate-96092274900402181-127.0.0.1:35917_-n_0000000000) [n:127.0.0.1:35917_ ] o.a.s.c.o.ClusterStateMutator building a new cName: collection1
    [junit4] 2> 1900021 INFO (OverseerStateUpdate-96092274900402181-127.0.0.1:35917_-n_0000000000) [n:127.0.0.1:35917_ ] o.a.s.c.o.ReplicaMutator Assigning new node to shard shard=shard2
    [junit4] 2> 1900022 INFO (coreLoadExecutor-6250-thread-1-processing-n:127.0.0.1:45803_) [n:127.0.0.1:45803_ c:collection1 x:collection1] o.a.s.c.ZkController look for our core node name
    [junit4] 2> 1900122 INFO (zkCallback-2348-thread-1) [ ] o.a.s.c.c.ZkStateReader A cluster state change: [WatchedEvent state:SyncConnected type:NodeDataChanged path:/clusterstate.json], has occurred - updating... (live nodes size: [2])
    [junit4] 2> 1900122 INFO (zkCallback-2353-thread-1-processing-n:127.0.0.1:45803_) [n:127.0.0.1:45803_ ] o.a.s.c.c.ZkStateReader A cluster state change: [WatchedEvent state:SyncConnected type:NodeDataChanged path:/clusterstate.json], has occurred - updating... (live nodes size: [2])
    [junit4] 2> 1900122 INFO (zkCallback-2344-thread-3-processing-n:127.0.0.1:35917_) [n:127.0.0.1:35917_ ] o.a.s.c.c.ZkStateReader A cluster state change: [WatchedEvent state:SyncConnected type:NodeDataChanged path:/clusterstate.json], has occurred - updating... (live nodes size: [2])
    [junit4] 2> 1901022 INFO (coreLoadExecutor-6250-thread-1-processing-n:127.0.0.1:45803_) [n:127.0.0.1:45803_ c:collection1 x:collection1] o.a.s.c.ZkController waiting to find shard id in clusterstate for collection1
    [junit4] 2> 1901022 INFO (coreLoadExecutor-6250-thread-1-processing-n:127.0.0.1:45803_) [n:127.0.0.1:45803_ c:collection1 x:collection1] o.a.s.c.ZkController Check for collection zkNode:collection1
    [junit4] 2> 1901022 INFO (coreLoadExecutor-6250-thread-1-processing-n:127.0.0.1:45803_) [n:127.0.0.1:45803_ c:collection1 x:collection1] o.a.s.c.ZkController Collection zkNode exists
    [junit4] 2> 1901022 INFO (coreLoadExecutor-6250-thread-1-processing-n:127.0.0.1:45803_) [n:127.0.0.1:45803_ c:collection1 x:collection1] o.a.s.c.c.ZkStateReader Load collection config from: [/collections/collection1]
    [junit4] 2> 1901022 INFO (coreLoadExecutor-6250-thread-1-processing-n:127.0.0.1:45803_) [n:127.0.0.1:45803_ c:collection1 x:collection1] o.a.s.c.c.ZkStateReader path=[/collections/collection1] [configName]=[conf1] specified config exists in ZooKeeper
    [junit4] 2> 1901023 INFO (coreLoadExecutor-6250-thread-1-processing-n:127.0.0.1:45803_) [n:127.0.0.1:45803_ c:collection1 x:collection1] o.a.s.c.SolrResourceLoader new SolrResourceLoader for directory: '/home/jenkins/workspace/Lucene-Solr-master-Linux/solr/build/solr-core/test/J0/temp/solr.handler.TestReqParamsAPI_5C6C84A667BB4041-001/shard-1-001/cores/collection1'
    [junit4] 2> 1901023 INFO (coreLoadExecutor-6250-thread-1-processing-n:127.0.0.1:45803_) [n:127.0.0.1:45803_ c:collection1 x:collection1] o.a.s.c.SolrResourceLoader JNDI not configured for solr (NoInitialContextEx)
    [junit4] 2> 1901023 INFO (coreLoadExecutor-6250-thread-1-processing-n:127.0.0.1:45803_) [n:127.0.0.1:45803_ c:collection1 x:collection1] o.a.s.c.SolrResourceLoader solr home defaulted to 'solr/' (could not find system property or JNDI)
    [junit4] 2> 1901024 INFO (coreLoadExecutor-6250-thread-1-processing-n:127.0.0.1:45803_) [n:127.0.0.1:45803_ c:collection1 x:collection1] o.a.s.c.Config loaded config solrconfig.xml with version 0
    [junit4] 2> 1901026 INFO (coreLoadExecutor-6250-thread-1-processing-n:127.0.0.1:45803_) [n:127.0.0.1:45803_ c:collection1 x:collection1] o.a.s.c.SolrConfig current version of requestparams : -1
    [junit4] 2> 1901029 INFO (coreLoadExecutor-6250-thread-1-processing-n:127.0.0.1:45803_) [n:127.0.0.1:45803_ c:collection1 x:collection1] o.a.s.c.SolrConfig Using Lucene MatchVersion: 7.0.0
    [junit4] 2> 1901034 INFO (coreLoadExecutor-6250-thread-1-processing-n:127.0.0.1:45803_) [n:127.0.0.1:45803_ c:collection1 x:collection1] o.a.s.c.SolrConfig Loaded SolrConfig: solrconfig.xml
    [junit4] 2> 1901038 INFO (coreLoadExecutor-6250-thread-1-processing-n:127.0.0.1:45803_) [n:127.0.0.1:45803_ c:collection1 x:collection1] o.a.s.s.IndexSchema [collection1] Schema name=test
    [junit4] 2> 1901095 INFO (coreLoadExecutor-6250-thread-1-processing-n:127.0.0.1:45803_) [n:127.0.0.1:45803_ c:collection1 x:collection1] o.a.s.s.OpenExchangeRatesOrgProvider Initialized with rates=open-exchange-rates.json, refreshInterval=1440.
    [junit4] 2> 1901099 INFO (coreLoadExecutor-6250-thread-1-processing-n:127.0.0.1:45803_) [n:127.0.0.1:45803_ c:collection1 x:collection1] o.a.s.s.IndexSchema default search field in schema is text
    [junit4] 2> 1901099 INFO (coreLoadExecutor-6250-thread-1-processing-n:127.0.0.1:45803_) [n:127.0.0.1:45803_ c:collection1 x:collection1] o.a.s.s.IndexSchema unique key field: id
    [junit4] 2> 1901103 INFO (coreLoadExecutor-6250-thread-1-processing-n:127.0.0.1:45803_) [n:127.0.0.1:45803_ c:collection1 x:collection1] o.a.s.s.FileExchangeRateProvider Reloading exchange rates from file currency.xml
    [junit4] 2> 1901105 INFO (coreLoadExecutor-6250-thread-1-processing-n:127.0.0.1:45803_) [n:127.0.0.1:45803_ c:collection1 x:collection1] o.a.s.s.FileExchangeRateProvider Reloading exchange rates from file currency.xml
    [junit4] 2> 1901106 INFO (coreLoadExecutor-6250-thread-1-processing-n:127.0.0.1:45803_) [n:127.0.0.1:45803_ c:collection1 x:collection1] o.a.s.s.OpenExchangeRatesOrgProvider Reloading exchange rates from open-exchange-rates.json
    [junit4] 2> 1901106 INFO (coreLoadExecutor-6250-thread-1-processing-n:127.0.0.1:45803_) [n:127.0.0.1:45803_ c:collection1 x:collection1] o.a.s.s.OpenExchangeRatesOrgProvider Reloading exchange rates from open-exchange-rates.json
    [junit4] 2> 1901107 INFO (coreLoadExecutor-6250-thread-1-processing-n:127.0.0.1:45803_) [n:127.0.0.1:45803_ c:collection1 x:collection1] o.a.s.c.ConfigSetProperties Did not find ConfigSet properties, assuming default properties: Can't find resource 'configsetprops.json' in classpath or '/configs/conf1', cwd=/home/jenkins/workspace/Lucene-Solr-master-Linux/solr/build/solr-core/test/J0
    [junit4] 2> 1901107 INFO (coreLoadExecutor-6250-thread-1-processing-n:127.0.0.1:45803_) [n:127.0.0.1:45803_ c:collection1 x:collection1] o.a.s.c.CoreContainer Creating SolrCore 'collection1' using configuration from collection collection1
    [junit4] 2> 1901107 INFO (coreLoadExecutor-6250-thread-1-processing-n:127.0.0.1:45803_) [n:127.0.0.1:45803_ c:collection1 s:shard2 r:core_node1 x:collection1] o.a.s.c.SolrCore org.apache.solr.core.MockDirectoryFactory
    [junit4] 2> 1901107 INFO (coreLoadExecutor-6250-thread-1-processing-n:127.0.0.1:45803_) [n:127.0.0.1:45803_ c:collection1 s:shard2 r:core_node1 x:collection1] o.a.s.c.SolrCore [[collection1] ] Opening new SolrCore at [/home/jenkins/workspace/Lucene-Solr-master-Linux/solr/build/solr-core/test/J0/temp/solr.handler.TestReqParamsAPI_5C6C84A667BB4041-001/shard-1-001/cores/collection1], dataDir=[/home/jenkins/workspace/Lucene-Solr-master-Linux/solr/build/solr-core/test/J0/../../../../../../../../../home/jenkin

[...truncated too long message...]

sl, http/1.1]}{127.0.0.1:0}
    [junit4] 2> 1923737 INFO (TEST-TestReqParamsAPI.test-seed#[5C6C84A667BB4041]) [ ] o.e.j.s.h.ContextHandler Stopped o.e.j.s.ServletContextHandler@65d48ab3{/,null,UNAVAILABLE}
    [junit4] 2> 1923738 INFO (TEST-TestReqParamsAPI.test-seed#[5C6C84A667BB4041]) [ ] o.a.s.c.ZkTestServer connecting to 127.0.0.1:45434 45434
    [junit4] 2> 1923795 INFO (Thread-4575) [ ] o.a.s.c.ZkTestServer connecting to 127.0.0.1:45434 45434
    [junit4] 2> 1923796 WARN (Thread-4575) [ ] o.a.s.c.ZkTestServer Watch limit violations:
    [junit4] 2> Maximum concurrent create/delete watches above limit:
    [junit4] 2>
    [junit4] 2> 40 /solr/configs/conf1
    [junit4] 2> 6 /solr/aliases.json
    [junit4] 2> 5 /solr/security.json
    [junit4] 2> 4 /solr/collections/collection1/state.json
    [junit4] 2>
    [junit4] 2> Maximum concurrent data watches above limit:
    [junit4] 2>
    [junit4] 2> 6 /solr/clusterstate.json
    [junit4] 2> 6 /solr/clusterprops.json
    [junit4] 2>
    [junit4] 2> Maximum concurrent children watches above limit:
    [junit4] 2>
    [junit4] 2> 28 /solr/overseer/queue
    [junit4] 2> 28 /solr/overseer/collection-queue-work
    [junit4] 2> 6 /solr/live_nodes
    [junit4] 2> 6 /solr/collections
    [junit4] 2> 4 /solr/overseer/queue-work
    [junit4] 2>
    [junit4] 2> NOTE: reproduce with: ant test -Dtestcase=TestReqParamsAPI -Dtests.method=test -Dtests.seed=5C6C84A667BB4041 -Dtests.multiplier=3 -Dtests.slow=true -Dtests.locale=fi-FI -Dtests.timezone=Canada/East-Saskatchewan -Dtests.asserts=true -Dtests.file.encoding=US-ASCII
    [junit4] FAILURE 26.6s J0 | TestReqParamsAPI.test <<<
    [junit4] > Throwable #1: java.lang.AssertionError: Could not get expected value 'first' for path 'response/params/x/_appends_/add' full output: {
    [junit4] > "responseHeader":{
    [junit4] > "status":0,
    [junit4] > "QTime":0},
    [junit4] > "response":{
    [junit4] > "znodeVersion":3,
    [junit4] > "params":{
    [junit4] > "x":{
    [junit4] > "a":"A val",
    [junit4] > "b":"B val",
    [junit4] > "":{"v":0}},
    [junit4] > "y":{
    [junit4] > "p":"P val",
    [junit4] > "q":"Q val",
    [junit4] > "":{"v":2}}}}}, from server: https://127.0.0.1:43806/collection1
    [junit4] > at __randomizedtesting.SeedInfo.seed([5C6C84A667BB4041:D438BB7CC9472DB9]:0)
    [junit4] > at org.apache.solr.core.TestSolrConfigHandler.testForResponseElement(TestSolrConfigHandler.java:481)
    [junit4] > at org.apache.solr.handler.TestReqParamsAPI.testReqParams(TestReqParamsAPI.java:230)
    [junit4] > at org.apache.solr.handler.TestReqParamsAPI.test(TestReqParamsAPI.java:61)
    [junit4] > at org.apache.solr.BaseDistributedSearchTestCase$ShardsRepeatRule$ShardsFixedStatement.callStatement(BaseDistributedSearchTestCase.java:985)
    [junit4] > at org.apache.solr.BaseDistributedSearchTestCase$ShardsRepeatRule$ShardsStatement.evaluate(BaseDistributedSearchTestCase.java:960)
    [junit4] > at java.lang.Thread.run(Thread.java:745)
    [junit4] 2> 1923798 INFO (SUITE-TestReqParamsAPI-seed#[5C6C84A667BB4041]-worker) [ ] o.a.s.SolrTestCaseJ4 ###deleteCore
    [junit4] 2> NOTE: leaving temporary files on disk at: /home/jenkins/workspace/Lucene-Solr-master-Linux/solr/build/solr-core/test/J0/temp/solr.handler.TestReqParamsAPI_5C6C84A667BB4041-001
    [junit4] 2> Jun 18, 2016 12:09:39 PM com.carrotsearch.randomizedtesting.ThreadLeakControl checkThreadLeaks
    [junit4] 2> WARNING: Will linger awaiting termination of 2 leaked thread(s).
    [junit4] 2> NOTE: test params are: codec=Asserting(Lucene62), sim=ClassicSimilarity, locale=fi-FI, timezone=Canada/East-Saskatchewan
    [junit4] 2> NOTE: Linux 4.4.0-24-generic amd64/Oracle Corporation 1.8.0_92 (64-bit)/cpus=12,threads=1,free=163816104,total=536870912
    [junit4] 2> NOTE: All tests run in this JVM: [ZkNodePropsTest, RequiredFieldsTest, ResponseHeaderTest, TestHighlightDedupGrouping, CacheHeaderTest, StandardRequestHandlerTest, TestRebalanceLeaders, TestManagedSchemaAPI, HdfsBasicDistributedZk2Test, TestDFISimilarityFactory, TestHdfsUpdateLog, CollectionTooManyReplicasTest, PathHierarchyTokenizerFactoryTest, TestSolrQueryResponse, DeleteStatusTest, ForceLeaderTest, BufferStoreTest, TestFaceting, DistributedSpellCheckComponentTest, SystemInfoHandlerTest, DirectoryFactoryTest, TestIBSimilarityFactory, DistributedDebugComponentTest, ReplicationFactorTest, TestCloudPivotFacet, DateFieldTest, QueryResultKeyTest, AlternateDirectoryTest, TestConfigSetsAPIExclusivity, TestFoldingMultitermQuery, TestManagedStopFilterFactory, TestDocSet, TestAtomicUpdateErrorCases, TestStressLucene, SignatureUpdateProcessorFactoryTest, TestImplicitCoreProperties, XsltUpdateRequestHandlerTest, DistributedFacetPivotWhiteBoxTest, CloudMLTQParserTest, RAMDirectoryFactoryTest, TestMissingGroups, DistribJoinFromCollectionTest, SolrRequestParserTest, SolrCloudExampleTest, TestLeaderElectionZkExpiry, WrapperMergePolicyFactoryTest, PingRequestHandlerTest, TestJoin, TestFieldCacheVsDocValues, FileBasedSpellCheckerTest, QueryElevationComponentTest, CloudExitableDirectoryReaderTest, HdfsRecoverLeaseTest, TestFastOutputStream, TestPseudoReturnFields, TestUseDocValuesAsStored2, TestRTimerTree, DefaultValueUpdateProcessorTest, HLLUtilTest, SSLMigrationTest, TestDocTermOrds, BasicDistributedZkTest, TestBadConfig, CdcrReplicationDistributedZkTest, CursorMarkTest, TestRealTimeGet, BigEndianAscendingWordDeserializerTest, SuggestComponentContextFilterQueryTest, TestSearcherReuse, PreAnalyzedFieldTest, TestDefaultSearchFieldResource, TestLuceneMatchVersion, ConnectionReuseTest, JSONWriterTest, IndexSchemaRuntimeFieldTest, TestQueryWrapperFilter, TestRangeQuery, DisMaxRequestHandlerTest, TestRTGBase, TestReplicationHandler, URLClassifyProcessorTest, PrimUtilsTest, AddBlockUpdateTest, AsyncCallRequestStatusResponseTest, SortSpecParsingTest, TestRandomFaceting, TestFieldSortValues, TestCSVLoader, DocumentAnalysisRequestHandlerTest, HdfsChaosMonkeySafeLeaderTest, TestArbitraryIndexDir, UUIDUpdateProcessorFallbackTest, TestPhraseSuggestions, CopyFieldTest, CurrencyFieldOpenExchangeTest, TestValueSourceCache, ConcurrentDeleteAndCreateCollectionTest, LeaderInitiatedRecoveryOnCommitTest, TestSolrQueryParserDefaultOperatorResource, UUIDFieldTest, TestNumericTerms32, ChaosMonkeySafeLeaderTest, SyncSliceTest, OpenCloseCoreStressTest, OverseerTest, LeaderElectionIntegrationTest, ClusterStateUpdateTest, ZkSolrClientTest, ShardRoutingCustomTest, TestDistributedSearch, TestHashPartitioner, TestStressVersions, SolrCoreTest, PeerSyncTest, BadIndexSchemaTest, ConvertedLegacyTest, TestFunctionQuery, BasicFunctionalityTest, DirectUpdateHandlerTest, HighlighterTest, DistributedQueryElevationComponentTest, SuggesterFSTTest, SuggesterTSTTest, SpatialFilterTest, NoCacheHeaderTest, FieldMutatingUpdateProcessorTest, QueryEqualityTest, SolrInfoMBeanTest, TestSurroundQueryParser, DirectSolrSpellCheckerTest, PrimitiveFieldTypeTest, TermsComponentTest, MoreLikeThisHandlerTest, TestSolrQueryParser, RegexBoostProcessorTest, TestCollationField, ReturnFieldsTest, TestAnalyzedSuggestions, TestPHPSerializedResponseWriter, SearchHandlerTest, SOLR749Test, TestSolrIndexConfig, TestQuerySenderNoQuery, ResponseLogComponentTest, TestStressRecovery, TestMergePolicyConfig, TestSolrDeletionPolicy2, SampleTest, TestBinaryField, TestSearchPerf, NumericFieldsTest, MinimalSchemaTest, TestConfig, OutputWriterTest, TestFuzzyAnalyzedSuggestions, ExternalFileFieldSortTest, TestSolrCoreProperties, TestPostingsSolrHighlighter, DirectSolrConnectionTest, NotRequiredUniqueKeyTest, TestCodecSupport, SynonymTokenizerTest, EchoParamsTest, TestDFRSimilarityFactory, TestPerFieldSimilarity, TestLMDirichletSimilarityFactory, TestBM25SimilarityFactory, TestFastWriter, TestJmxMonitoredMap, ResourceLoaderTest, ScriptEngineTest, TestFastLRUCache, DateMathParserTest, SpellingQueryConverterTest, DOMUtilTest, TestSolrJ, TestLRUCache, TestUtils, SliceStateTest, CircularListTest, DistributedMLTComponentTest, CursorPagingTest, ActionThrottleTest, AssignTest, CdcrVersionReplicationTest, CollectionStateFormat2Test, CustomCollectionTest, HttpPartitionTest, TestConfigSetsAPI, TestConfigSetsAPIZkFailure, TestDistribDocBasedVersion, TestLockTree, TestMiniSolrCloudCluster, TestTolerantUpdateProcessorRandomCloud, TestInfoStreamLogging, TestNRTOpen, TestReloadAndDeleteDocs, TestShardHandlerFactory, TestSolrConfigHandler, TestReplicationHandlerBackup, TestReqParamsAPI]
    [junit4] Completed [503/614 (1!)] on J0 in 26.86s, 1 test, 1 failure <<< FAILURES!

[...truncated 374 lines...]
BUILD FAILED
/home/jenkins/workspace/Lucene-Solr-master-Linux/build.xml:740: The following error occurred while executing this line:
/home/jenkins/workspace/Lucene-Solr-master-Linux/build.xml:684: The following error occurred while executing this line:
/home/jenkins/workspace/Lucene-Solr-master-Linux/build.xml:59: The following error occurred while executing this line:
/home/jenkins/workspace/Lucene-Solr-master-Linux/solr/build.xml:233: The following error occurred while executing this line:
/home/jenkins/workspace/Lucene-Solr-master-Linux/solr/common-build.xml:531: The following error occurred while executing this line:
/home/jenkins/workspace/Lucene-Solr-master-Linux/lucene/common-build.xml:1427: The following error occurred while executing this line:
/home/jenkins/workspace/Lucene-Solr-master-Linux/lucene/common-build.xml:984: There were test failures: 614 suites (10 ignored), 2584 tests, 1 failure, 116 ignored (72 assumptions) [seed: 5C6C84A667BB4041]

Total time: 57 minutes 7 seconds
Build step 'Invoke Ant' marked build as failure
Archiving artifacts
[WARNINGS] Skipping publisher since build result is FAILURE
Recording test results
Email was triggered for: Failure - Any
Sending email for trigger: Failure - Any

Search Discussions

Related Discussions

Discussion Navigation
viewthread | post
posts ‹ prev | 1 of 1 | next ›
Discussion Overview
groupdev @
categorieslucene
postedJun 18, '16 at 12:13p
activeJun 18, '16 at 12:13p
posts1
users1
websitelucene.apache.org

1 user in discussion

Policeman Jenkins Server: 1 post

People

Translate

site design / logo © 2017 Grokbase