Grokbase Groups Lucene dev June 2016
FAQ
Build: http://jenkins.thetaphi.de/job/Lucene-Solr-master-MacOSX/3346/
Java: 64bit/jdk1.8.0 -XX:-UseCompressedOops -XX:+UseG1GC

3 tests failed.
FAILED: org.apache.solr.cloud.CollectionsAPIDistributedZkTest.test

Error Message:
Timeout occured while waiting response from server at: https://127.0.0.1:55021

Stack Trace:
org.apache.solr.client.solrj.SolrServerException: Timeout occured while waiting response from server at: https://127.0.0.1:55021
  at __randomizedtesting.SeedInfo.seed([7CEC55EDA2CDFB13:F4B86A370C3196EB]:0)
  at org.apache.solr.client.solrj.impl.HttpSolrClient.executeMethod(HttpSolrClient.java:617)
  at org.apache.solr.client.solrj.impl.HttpSolrClient.request(HttpSolrClient.java:259)
  at org.apache.solr.client.solrj.impl.HttpSolrClient.request(HttpSolrClient.java:248)
  at org.apache.solr.client.solrj.SolrClient.request(SolrClient.java:1219)
  at org.apache.solr.cloud.CollectionsAPIDistributedZkTest.makeRequest(CollectionsAPIDistributedZkTest.java:400)
  at org.apache.solr.cloud.CollectionsAPIDistributedZkTest.testCollectionsAPI(CollectionsAPIDistributedZkTest.java:898)
  at org.apache.solr.cloud.CollectionsAPIDistributedZkTest.test(CollectionsAPIDistributedZkTest.java:178)
  at sun.reflect.NativeMethodAccessorImpl.invoke0(Native Method)
  at sun.reflect.NativeMethodAccessorImpl.invoke(NativeMethodAccessorImpl.java:62)
  at sun.reflect.DelegatingMethodAccessorImpl.invoke(DelegatingMethodAccessorImpl.java:43)
  at java.lang.reflect.Method.invoke(Method.java:498)
  at com.carrotsearch.randomizedtesting.RandomizedRunner.invoke(RandomizedRunner.java:1764)
  at com.carrotsearch.randomizedtesting.RandomizedRunner$8.evaluate(RandomizedRunner.java:871)
  at com.carrotsearch.randomizedtesting.RandomizedRunner$9.evaluate(RandomizedRunner.java:907)
  at com.carrotsearch.randomizedtesting.RandomizedRunner$10.evaluate(RandomizedRunner.java:921)
  at org.apache.solr.BaseDistributedSearchTestCase$ShardsRepeatRule$ShardsFixedStatement.callStatement(BaseDistributedSearchTestCase.java:985)
  at org.apache.solr.BaseDistributedSearchTestCase$ShardsRepeatRule$ShardsStatement.evaluate(BaseDistributedSearchTestCase.java:960)
  at com.carrotsearch.randomizedtesting.rules.SystemPropertiesRestoreRule$1.evaluate(SystemPropertiesRestoreRule.java:57)
  at org.apache.lucene.util.TestRuleSetupTeardownChained$1.evaluate(TestRuleSetupTeardownChained.java:49)
  at org.apache.lucene.util.AbstractBeforeAfterRule$1.evaluate(AbstractBeforeAfterRule.java:45)
  at org.apache.lucene.util.TestRuleThreadAndTestName$1.evaluate(TestRuleThreadAndTestName.java:48)
  at org.apache.lucene.util.TestRuleIgnoreAfterMaxFailures$1.evaluate(TestRuleIgnoreAfterMaxFailures.java:64)
  at org.apache.lucene.util.TestRuleMarkFailure$1.evaluate(TestRuleMarkFailure.java:47)
  at com.carrotsearch.randomizedtesting.rules.StatementAdapter.evaluate(StatementAdapter.java:36)
  at com.carrotsearch.randomizedtesting.ThreadLeakControl$StatementRunner.run(ThreadLeakControl.java:367)
  at com.carrotsearch.randomizedtesting.ThreadLeakControl.forkTimeoutingTask(ThreadLeakControl.java:809)
  at com.carrotsearch.randomizedtesting.ThreadLeakControl$3.evaluate(ThreadLeakControl.java:460)
  at com.carrotsearch.randomizedtesting.RandomizedRunner.runSingleTest(RandomizedRunner.java:880)
  at com.carrotsearch.randomizedtesting.RandomizedRunner$5.evaluate(RandomizedRunner.java:781)
  at com.carrotsearch.randomizedtesting.RandomizedRunner$6.evaluate(RandomizedRunner.java:816)
  at com.carrotsearch.randomizedtesting.RandomizedRunner$7.evaluate(RandomizedRunner.java:827)
  at com.carrotsearch.randomizedtesting.rules.StatementAdapter.evaluate(StatementAdapter.java:36)
  at com.carrotsearch.randomizedtesting.rules.SystemPropertiesRestoreRule$1.evaluate(SystemPropertiesRestoreRule.java:57)
  at org.apache.lucene.util.AbstractBeforeAfterRule$1.evaluate(AbstractBeforeAfterRule.java:45)
  at com.carrotsearch.randomizedtesting.rules.StatementAdapter.evaluate(StatementAdapter.java:36)
  at org.apache.lucene.util.TestRuleStoreClassName$1.evaluate(TestRuleStoreClassName.java:41)
  at com.carrotsearch.randomizedtesting.rules.NoShadowingOrOverridesOnMethodsRule$1.evaluate(NoShadowingOrOverridesOnMethodsRule.java:40)
  at com.carrotsearch.randomizedtesting.rules.NoShadowingOrOverridesOnMethodsRule$1.evaluate(NoShadowingOrOverridesOnMethodsRule.java:40)
  at com.carrotsearch.randomizedtesting.rules.StatementAdapter.evaluate(StatementAdapter.java:36)
  at com.carrotsearch.randomizedtesting.rules.StatementAdapter.evaluate(StatementAdapter.java:36)
  at com.carrotsearch.randomizedtesting.rules.StatementAdapter.evaluate(StatementAdapter.java:36)
  at org.apache.lucene.util.TestRuleAssertionsRequired$1.evaluate(TestRuleAssertionsRequired.java:53)
  at org.apache.lucene.util.TestRuleMarkFailure$1.evaluate(TestRuleMarkFailure.java:47)
  at org.apache.lucene.util.TestRuleIgnoreAfterMaxFailures$1.evaluate(TestRuleIgnoreAfterMaxFailures.java:64)
  at org.apache.lucene.util.TestRuleIgnoreTestSuites$1.evaluate(TestRuleIgnoreTestSuites.java:54)
  at com.carrotsearch.randomizedtesting.rules.StatementAdapter.evaluate(StatementAdapter.java:36)
  at com.carrotsearch.randomizedtesting.ThreadLeakControl$StatementRunner.run(ThreadLeakControl.java:367)
  at java.lang.Thread.run(Thread.java:745)
Caused by: java.net.SocketTimeoutException: Read timed out
  at java.net.SocketInputStream.socketRead0(Native Method)
  at java.net.SocketInputStream.socketRead(SocketInputStream.java:116)
  at java.net.SocketInputStream.read(SocketInputStream.java:170)
  at java.net.SocketInputStream.read(SocketInputStream.java:141)
  at sun.security.ssl.InputRecord.readFully(InputRecord.java:465)
  at sun.security.ssl.InputRecord.read(InputRecord.java:503)
  at sun.security.ssl.SSLSocketImpl.readRecord(SSLSocketImpl.java:973)
  at sun.security.ssl.SSLSocketImpl.readDataRecord(SSLSocketImpl.java:930)
  at sun.security.ssl.AppInputStream.read(AppInputStream.java:105)
  at org.apache.http.impl.io.SessionInputBufferImpl.streamRead(SessionInputBufferImpl.java:139)
  at org.apache.http.impl.io.SessionInputBufferImpl.fillBuffer(SessionInputBufferImpl.java:155)
  at org.apache.http.impl.io.SessionInputBufferImpl.readLine(SessionInputBufferImpl.java:284)
  at org.apache.http.impl.conn.DefaultHttpResponseParser.parseHead(DefaultHttpResponseParser.java:140)
  at org.apache.http.impl.conn.DefaultHttpResponseParser.parseHead(DefaultHttpResponseParser.java:57)
  at org.apache.http.impl.io.AbstractMessageParser.parse(AbstractMessageParser.java:261)
  at org.apache.http.impl.DefaultBHttpClientConnection.receiveResponseHeader(DefaultBHttpClientConnection.java:165)
  at org.apache.http.impl.conn.CPoolProxy.receiveResponseHeader(CPoolProxy.java:167)
  at org.apache.http.protocol.HttpRequestExecutor.doReceiveResponse(HttpRequestExecutor.java:272)
  at org.apache.http.protocol.HttpRequestExecutor.execute(HttpRequestExecutor.java:124)
  at org.apache.http.impl.execchain.MainClientExec.execute(MainClientExec.java:271)
  at org.apache.http.impl.execchain.ProtocolExec.execute(ProtocolExec.java:184)
  at org.apache.http.impl.execchain.RetryExec.execute(RetryExec.java:88)
  at org.apache.http.impl.execchain.RedirectExec.execute(RedirectExec.java:110)
  at org.apache.http.impl.client.InternalHttpClient.doExecute(InternalHttpClient.java:184)
  at org.apache.http.impl.client.CloseableHttpClient.execute(CloseableHttpClient.java:82)
  at org.apache.http.impl.client.CloseableHttpClient.execute(CloseableHttpClient.java:55)
  at org.apache.solr.client.solrj.impl.HttpSolrClient.executeMethod(HttpSolrClient.java:511)
  ... 47 more


FAILED: junit.framework.TestSuite.org.apache.solr.cloud.CollectionsAPIDistributedZkTest

Error Message:
7 threads leaked from SUITE scope at org.apache.solr.cloud.CollectionsAPIDistributedZkTest: 1) Thread[id=13269, name=zkCallback-2028-thread-3, state=TIMED_WAITING, group=TGRP-CollectionsAPIDistributedZkTest] at sun.misc.Unsafe.park(Native Method) at java.util.concurrent.locks.LockSupport.parkNanos(LockSupport.java:215) at java.util.concurrent.SynchronousQueue$TransferStack.awaitFulfill(SynchronousQueue.java:460) at java.util.concurrent.SynchronousQueue$TransferStack.transfer(SynchronousQueue.java:362) at java.util.concurrent.SynchronousQueue.poll(SynchronousQueue.java:941) at java.util.concurrent.ThreadPoolExecutor.getTask(ThreadPoolExecutor.java:1066) at java.util.concurrent.ThreadPoolExecutor.runWorker(ThreadPoolExecutor.java:1127) at java.util.concurrent.ThreadPoolExecutor$Worker.run(ThreadPoolExecutor.java:617) at java.lang.Thread.run(Thread.java:745) 2) Thread[id=13144, name=zkCallback-2028-thread-1, state=TIMED_WAITING, group=TGRP-CollectionsAPIDistributedZkTest] at sun.misc.Unsafe.park(Native Method) at java.util.concurrent.locks.LockSupport.parkNanos(LockSupport.java:215) at java.util.concurrent.SynchronousQueue$TransferStack.awaitFulfill(SynchronousQueue.java:460) at java.util.concurrent.SynchronousQueue$TransferStack.transfer(SynchronousQueue.java:362) at java.util.concurrent.SynchronousQueue.poll(SynchronousQueue.java:941) at java.util.concurrent.ThreadPoolExecutor.getTask(ThreadPoolExecutor.java:1066) at java.util.concurrent.ThreadPoolExecutor.runWorker(ThreadPoolExecutor.java:1127) at java.util.concurrent.ThreadPoolExecutor$Worker.run(ThreadPoolExecutor.java:617) at java.lang.Thread.run(Thread.java:745) 3) Thread[id=13270, name=zkCallback-2028-thread-4, state=TIMED_WAITING, group=TGRP-CollectionsAPIDistributedZkTest] at sun.misc.Unsafe.park(Native Method) at java.util.concurrent.locks.LockSupport.parkNanos(LockSupport.java:215) at java.util.concurrent.SynchronousQueue$TransferStack.awaitFulfill(SynchronousQueue.java:460) at java.util.concurrent.SynchronousQueue$TransferStack.transfer(SynchronousQueue.java:362) at java.util.concurrent.SynchronousQueue.poll(SynchronousQueue.java:941) at java.util.concurrent.ThreadPoolExecutor.getTask(ThreadPoolExecutor.java:1066) at java.util.concurrent.ThreadPoolExecutor.runWorker(ThreadPoolExecutor.java:1127) at java.util.concurrent.ThreadPoolExecutor$Worker.run(ThreadPoolExecutor.java:617) at java.lang.Thread.run(Thread.java:745) 4) Thread[id=13143, name=TEST-CollectionsAPIDistributedZkTest.test-seed#[7CEC55EDA2CDFB13]-EventThread, state=WAITING, group=TGRP-CollectionsAPIDistributedZkTest] at sun.misc.Unsafe.park(Native Method) at java.util.concurrent.locks.LockSupport.park(LockSupport.java:175) at java.util.concurrent.locks.AbstractQueuedSynchronizer$ConditionObject.await(AbstractQueuedSynchronizer.java:2039) at java.util.concurrent.LinkedBlockingQueue.take(LinkedBlockingQueue.java:442) at org.apache.zookeeper.ClientCnxn$EventThread.run(ClientCnxn.java:494) 5) Thread[id=13141, name=Connection evictor, state=TIMED_WAITING, group=TGRP-CollectionsAPIDistributedZkTest] at java.lang.Thread.sleep(Native Method) at org.apache.http.impl.client.IdleConnectionEvictor$1.run(IdleConnectionEvictor.java:66) at java.lang.Thread.run(Thread.java:745) 6) Thread[id=13142, name=TEST-CollectionsAPIDistributedZkTest.test-seed#[7CEC55EDA2CDFB13]-SendThread(127.0.0.1:55008), state=TIMED_WAITING, group=TGRP-CollectionsAPIDistributedZkTest] at java.lang.Thread.sleep(Native Method) at org.apache.zookeeper.ClientCnxn$SendThread.run(ClientCnxn.java:994) 7) Thread[id=13224, name=zkCallback-2028-thread-2, state=TIMED_WAITING, group=TGRP-CollectionsAPIDistributedZkTest] at sun.misc.Unsafe.park(Native Method) at java.util.concurrent.locks.LockSupport.parkNanos(LockSupport.java:215) at java.util.concurrent.SynchronousQueue$TransferStack.awaitFulfill(SynchronousQueue.java:460) at java.util.concurrent.SynchronousQueue$TransferStack.transfer(SynchronousQueue.java:362) at java.util.concurrent.SynchronousQueue.poll(SynchronousQueue.java:941) at java.util.concurrent.ThreadPoolExecutor.getTask(ThreadPoolExecutor.java:1066) at java.util.concurrent.ThreadPoolExecutor.runWorker(ThreadPoolExecutor.java:1127) at java.util.concurrent.ThreadPoolExecutor$Worker.run(ThreadPoolExecutor.java:617) at java.lang.Thread.run(Thread.java:745)

Stack Trace:
com.carrotsearch.randomizedtesting.ThreadLeakError: 7 threads leaked from SUITE scope at org.apache.solr.cloud.CollectionsAPIDistributedZkTest:
    1) Thread[id=13269, name=zkCallback-2028-thread-3, state=TIMED_WAITING, group=TGRP-CollectionsAPIDistributedZkTest]
         at sun.misc.Unsafe.park(Native Method)
         at java.util.concurrent.locks.LockSupport.parkNanos(LockSupport.java:215)
         at java.util.concurrent.SynchronousQueue$TransferStack.awaitFulfill(SynchronousQueue.java:460)
         at java.util.concurrent.SynchronousQueue$TransferStack.transfer(SynchronousQueue.java:362)
         at java.util.concurrent.SynchronousQueue.poll(SynchronousQueue.java:941)
         at java.util.concurrent.ThreadPoolExecutor.getTask(ThreadPoolExecutor.java:1066)
         at java.util.concurrent.ThreadPoolExecutor.runWorker(ThreadPoolExecutor.java:1127)
         at java.util.concurrent.ThreadPoolExecutor$Worker.run(ThreadPoolExecutor.java:617)
         at java.lang.Thread.run(Thread.java:745)
    2) Thread[id=13144, name=zkCallback-2028-thread-1, state=TIMED_WAITING, group=TGRP-CollectionsAPIDistributedZkTest]
         at sun.misc.Unsafe.park(Native Method)
         at java.util.concurrent.locks.LockSupport.parkNanos(LockSupport.java:215)
         at java.util.concurrent.SynchronousQueue$TransferStack.awaitFulfill(SynchronousQueue.java:460)
         at java.util.concurrent.SynchronousQueue$TransferStack.transfer(SynchronousQueue.java:362)
         at java.util.concurrent.SynchronousQueue.poll(SynchronousQueue.java:941)
         at java.util.concurrent.ThreadPoolExecutor.getTask(ThreadPoolExecutor.java:1066)
         at java.util.concurrent.ThreadPoolExecutor.runWorker(ThreadPoolExecutor.java:1127)
         at java.util.concurrent.ThreadPoolExecutor$Worker.run(ThreadPoolExecutor.java:617)
         at java.lang.Thread.run(Thread.java:745)
    3) Thread[id=13270, name=zkCallback-2028-thread-4, state=TIMED_WAITING, group=TGRP-CollectionsAPIDistributedZkTest]
         at sun.misc.Unsafe.park(Native Method)
         at java.util.concurrent.locks.LockSupport.parkNanos(LockSupport.java:215)
         at java.util.concurrent.SynchronousQueue$TransferStack.awaitFulfill(SynchronousQueue.java:460)
         at java.util.concurrent.SynchronousQueue$TransferStack.transfer(SynchronousQueue.java:362)
         at java.util.concurrent.SynchronousQueue.poll(SynchronousQueue.java:941)
         at java.util.concurrent.ThreadPoolExecutor.getTask(ThreadPoolExecutor.java:1066)
         at java.util.concurrent.ThreadPoolExecutor.runWorker(ThreadPoolExecutor.java:1127)
         at java.util.concurrent.ThreadPoolExecutor$Worker.run(ThreadPoolExecutor.java:617)
         at java.lang.Thread.run(Thread.java:745)
    4) Thread[id=13143, name=TEST-CollectionsAPIDistributedZkTest.test-seed#[7CEC55EDA2CDFB13]-EventThread, state=WAITING, group=TGRP-CollectionsAPIDistributedZkTest]
         at sun.misc.Unsafe.park(Native Method)
         at java.util.concurrent.locks.LockSupport.park(LockSupport.java:175)
         at java.util.concurrent.locks.AbstractQueuedSynchronizer$ConditionObject.await(AbstractQueuedSynchronizer.java:2039)
         at java.util.concurrent.LinkedBlockingQueue.take(LinkedBlockingQueue.java:442)
         at org.apache.zookeeper.ClientCnxn$EventThread.run(ClientCnxn.java:494)
    5) Thread[id=13141, name=Connection evictor, state=TIMED_WAITING, group=TGRP-CollectionsAPIDistributedZkTest]
         at java.lang.Thread.sleep(Native Method)
         at org.apache.http.impl.client.IdleConnectionEvictor$1.run(IdleConnectionEvictor.java:66)
         at java.lang.Thread.run(Thread.java:745)
    6) Thread[id=13142, name=TEST-CollectionsAPIDistributedZkTest.test-seed#[7CEC55EDA2CDFB13]-SendThread(127.0.0.1:55008), state=TIMED_WAITING, group=TGRP-CollectionsAPIDistributedZkTest]
         at java.lang.Thread.sleep(Native Method)
         at org.apache.zookeeper.ClientCnxn$SendThread.run(ClientCnxn.java:994)
    7) Thread[id=13224, name=zkCallback-2028-thread-2, state=TIMED_WAITING, group=TGRP-CollectionsAPIDistributedZkTest]
         at sun.misc.Unsafe.park(Native Method)
         at java.util.concurrent.locks.LockSupport.parkNanos(LockSupport.java:215)
         at java.util.concurrent.SynchronousQueue$TransferStack.awaitFulfill(SynchronousQueue.java:460)
         at java.util.concurrent.SynchronousQueue$TransferStack.transfer(SynchronousQueue.java:362)
         at java.util.concurrent.SynchronousQueue.poll(SynchronousQueue.java:941)
         at java.util.concurrent.ThreadPoolExecutor.getTask(ThreadPoolExecutor.java:1066)
         at java.util.concurrent.ThreadPoolExecutor.runWorker(ThreadPoolExecutor.java:1127)
         at java.util.concurrent.ThreadPoolExecutor$Worker.run(ThreadPoolExecutor.java:617)
         at java.lang.Thread.run(Thread.java:745)
  at __randomizedtesting.SeedInfo.seed([7CEC55EDA2CDFB13]:0)


FAILED: junit.framework.TestSuite.org.apache.solr.cloud.CollectionsAPIDistributedZkTest

Error Message:
There are still zombie threads that couldn't be terminated: 1) Thread[id=13269, name=zkCallback-2028-thread-3, state=TIMED_WAITING, group=TGRP-CollectionsAPIDistributedZkTest] at sun.misc.Unsafe.park(Native Method) at java.util.concurrent.locks.LockSupport.parkNanos(LockSupport.java:215) at java.util.concurrent.SynchronousQueue$TransferStack.awaitFulfill(SynchronousQueue.java:460) at java.util.concurrent.SynchronousQueue$TransferStack.transfer(SynchronousQueue.java:362) at java.util.concurrent.SynchronousQueue.poll(SynchronousQueue.java:941) at java.util.concurrent.ThreadPoolExecutor.getTask(ThreadPoolExecutor.java:1066) at java.util.concurrent.ThreadPoolExecutor.runWorker(ThreadPoolExecutor.java:1127) at java.util.concurrent.ThreadPoolExecutor$Worker.run(ThreadPoolExecutor.java:617) at java.lang.Thread.run(Thread.java:745) 2) Thread[id=13144, name=zkCallback-2028-thread-1, state=TIMED_WAITING, group=TGRP-CollectionsAPIDistributedZkTest] at sun.misc.Unsafe.park(Native Method) at java.util.concurrent.locks.LockSupport.parkNanos(LockSupport.java:215) at java.util.concurrent.SynchronousQueue$TransferStack.awaitFulfill(SynchronousQueue.java:460) at java.util.concurrent.SynchronousQueue$TransferStack.transfer(SynchronousQueue.java:362) at java.util.concurrent.SynchronousQueue.poll(SynchronousQueue.java:941) at java.util.concurrent.ThreadPoolExecutor.getTask(ThreadPoolExecutor.java:1066) at java.util.concurrent.ThreadPoolExecutor.runWorker(ThreadPoolExecutor.java:1127) at java.util.concurrent.ThreadPoolExecutor$Worker.run(ThreadPoolExecutor.java:617) at java.lang.Thread.run(Thread.java:745) 3) Thread[id=13270, name=zkCallback-2028-thread-4, state=TIMED_WAITING, group=TGRP-CollectionsAPIDistributedZkTest] at sun.misc.Unsafe.park(Native Method) at java.util.concurrent.locks.LockSupport.parkNanos(LockSupport.java:215) at java.util.concurrent.SynchronousQueue$TransferStack.awaitFulfill(SynchronousQueue.java:460) at java.util.concurrent.SynchronousQueue$TransferStack.transfer(SynchronousQueue.java:362) at java.util.concurrent.SynchronousQueue.poll(SynchronousQueue.java:941) at java.util.concurrent.ThreadPoolExecutor.getTask(ThreadPoolExecutor.java:1066) at java.util.concurrent.ThreadPoolExecutor.runWorker(ThreadPoolExecutor.java:1127) at java.util.concurrent.ThreadPoolExecutor$Worker.run(ThreadPoolExecutor.java:617) at java.lang.Thread.run(Thread.java:745) 4) Thread[id=13142, name=TEST-CollectionsAPIDistributedZkTest.test-seed#[7CEC55EDA2CDFB13]-SendThread(127.0.0.1:55008), state=TIMED_WAITING, group=TGRP-CollectionsAPIDistributedZkTest] at java.lang.Thread.sleep(Native Method) at org.apache.zookeeper.client.StaticHostProvider.next(StaticHostProvider.java:101) at org.apache.zookeeper.ClientCnxn$SendThread.startConnect(ClientCnxn.java:940) at org.apache.zookeeper.ClientCnxn$SendThread.run(ClientCnxn.java:1003) 5) Thread[id=13224, name=zkCallback-2028-thread-2, state=TIMED_WAITING, group=TGRP-CollectionsAPIDistributedZkTest] at sun.misc.Unsafe.park(Native Method) at java.util.concurrent.locks.LockSupport.parkNanos(LockSupport.java:215) at java.util.concurrent.SynchronousQueue$TransferStack.awaitFulfill(SynchronousQueue.java:460) at java.util.concurrent.SynchronousQueue$TransferStack.transfer(SynchronousQueue.java:362) at java.util.concurrent.SynchronousQueue.poll(SynchronousQueue.java:941) at java.util.concurrent.ThreadPoolExecutor.getTask(ThreadPoolExecutor.java:1066) at java.util.concurrent.ThreadPoolExecutor.runWorker(ThreadPoolExecutor.java:1127) at java.util.concurrent.ThreadPoolExecutor$Worker.run(ThreadPoolExecutor.java:617) at java.lang.Thread.run(Thread.java:745)

Stack Trace:
com.carrotsearch.randomizedtesting.ThreadLeakError: There are still zombie threads that couldn't be terminated:
    1) Thread[id=13269, name=zkCallback-2028-thread-3, state=TIMED_WAITING, group=TGRP-CollectionsAPIDistributedZkTest]
         at sun.misc.Unsafe.park(Native Method)
         at java.util.concurrent.locks.LockSupport.parkNanos(LockSupport.java:215)
         at java.util.concurrent.SynchronousQueue$TransferStack.awaitFulfill(SynchronousQueue.java:460)
         at java.util.concurrent.SynchronousQueue$TransferStack.transfer(SynchronousQueue.java:362)
         at java.util.concurrent.SynchronousQueue.poll(SynchronousQueue.java:941)
         at java.util.concurrent.ThreadPoolExecutor.getTask(ThreadPoolExecutor.java:1066)
         at java.util.concurrent.ThreadPoolExecutor.runWorker(ThreadPoolExecutor.java:1127)
         at java.util.concurrent.ThreadPoolExecutor$Worker.run(ThreadPoolExecutor.java:617)
         at java.lang.Thread.run(Thread.java:745)
    2) Thread[id=13144, name=zkCallback-2028-thread-1, state=TIMED_WAITING, group=TGRP-CollectionsAPIDistributedZkTest]
         at sun.misc.Unsafe.park(Native Method)
         at java.util.concurrent.locks.LockSupport.parkNanos(LockSupport.java:215)
         at java.util.concurrent.SynchronousQueue$TransferStack.awaitFulfill(SynchronousQueue.java:460)
         at java.util.concurrent.SynchronousQueue$TransferStack.transfer(SynchronousQueue.java:362)
         at java.util.concurrent.SynchronousQueue.poll(SynchronousQueue.java:941)
         at java.util.concurrent.ThreadPoolExecutor.getTask(ThreadPoolExecutor.java:1066)
         at java.util.concurrent.ThreadPoolExecutor.runWorker(ThreadPoolExecutor.java:1127)
         at java.util.concurrent.ThreadPoolExecutor$Worker.run(ThreadPoolExecutor.java:617)
         at java.lang.Thread.run(Thread.java:745)
    3) Thread[id=13270, name=zkCallback-2028-thread-4, state=TIMED_WAITING, group=TGRP-CollectionsAPIDistributedZkTest]
         at sun.misc.Unsafe.park(Native Method)
         at java.util.concurrent.locks.LockSupport.parkNanos(LockSupport.java:215)
         at java.util.concurrent.SynchronousQueue$TransferStack.awaitFulfill(SynchronousQueue.java:460)
         at java.util.concurrent.SynchronousQueue$TransferStack.transfer(SynchronousQueue.java:362)
         at java.util.concurrent.SynchronousQueue.poll(SynchronousQueue.java:941)
         at java.util.concurrent.ThreadPoolExecutor.getTask(ThreadPoolExecutor.java:1066)
         at java.util.concurrent.ThreadPoolExecutor.runWorker(ThreadPoolExecutor.java:1127)
         at java.util.concurrent.ThreadPoolExecutor$Worker.run(ThreadPoolExecutor.java:617)
         at java.lang.Thread.run(Thread.java:745)
    4) Thread[id=13142, name=TEST-CollectionsAPIDistributedZkTest.test-seed#[7CEC55EDA2CDFB13]-SendThread(127.0.0.1:55008), state=TIMED_WAITING, group=TGRP-CollectionsAPIDistributedZkTest]
         at java.lang.Thread.sleep(Native Method)
         at org.apache.zookeeper.client.StaticHostProvider.next(StaticHostProvider.java:101)
         at org.apache.zookeeper.ClientCnxn$SendThread.startConnect(ClientCnxn.java:940)
         at org.apache.zookeeper.ClientCnxn$SendThread.run(ClientCnxn.java:1003)
    5) Thread[id=13224, name=zkCallback-2028-thread-2, state=TIMED_WAITING, group=TGRP-CollectionsAPIDistributedZkTest]
         at sun.misc.Unsafe.park(Native Method)
         at java.util.concurrent.locks.LockSupport.parkNanos(LockSupport.java:215)
         at java.util.concurrent.SynchronousQueue$TransferStack.awaitFulfill(SynchronousQueue.java:460)
         at java.util.concurrent.SynchronousQueue$TransferStack.transfer(SynchronousQueue.java:362)
         at java.util.concurrent.SynchronousQueue.poll(SynchronousQueue.java:941)
         at java.util.concurrent.ThreadPoolExecutor.getTask(ThreadPoolExecutor.java:1066)
         at java.util.concurrent.ThreadPoolExecutor.runWorker(ThreadPoolExecutor.java:1127)
         at java.util.concurrent.ThreadPoolExecutor$Worker.run(ThreadPoolExecutor.java:617)
         at java.lang.Thread.run(Thread.java:745)
  at __randomizedtesting.SeedInfo.seed([7CEC55EDA2CDFB13]:0)




Build Log:
[...truncated 11423 lines...]
    [junit4] Suite: org.apache.solr.cloud.CollectionsAPIDistributedZkTest
    [junit4] 2> Creating dataDir: /Users/jenkins/workspace/Lucene-Solr-master-MacOSX/solr/build/solr-core/test/J0/temp/solr.cloud.CollectionsAPIDistributedZkTest_7CEC55EDA2CDFB13-001/init-core-data-001
    [junit4] 2> 1745795 INFO (SUITE-CollectionsAPIDistributedZkTest-seed#[7CEC55EDA2CDFB13]-worker) [ ] o.a.s.SolrTestCaseJ4 Randomized ssl (true) and clientAuth (false) via: @org.apache.solr.util.RandomizeSSL(reason=, value=NaN, ssl=NaN, clientAuth=NaN) w/ MAC_OS_X supressed clientAuth
    [junit4] 2> 1745810 INFO (SUITE-CollectionsAPIDistributedZkTest-seed#[7CEC55EDA2CDFB13]-worker) [ ] o.a.s.BaseDistributedSearchTestCase Setting hostContext system property: /
    [junit4] 2> 1745813 INFO (TEST-CollectionsAPIDistributedZkTest.test-seed#[7CEC55EDA2CDFB13]) [ ] o.a.s.c.ZkTestServer STARTING ZK TEST SERVER
    [junit4] 2> 1745814 INFO (Thread-4026) [ ] o.a.s.c.ZkTestServer client port:0.0.0.0/0.0.0.0:0
    [junit4] 2> 1745814 INFO (Thread-4026) [ ] o.a.s.c.ZkTestServer Starting server
    [junit4] 2> 1745920 INFO (TEST-CollectionsAPIDistributedZkTest.test-seed#[7CEC55EDA2CDFB13]) [ ] o.a.s.c.ZkTestServer start zk server on port:55008
    [junit4] 2> 1745920 INFO (TEST-CollectionsAPIDistributedZkTest.test-seed#[7CEC55EDA2CDFB13]) [ ] o.a.s.c.c.SolrZkClient Using default ZkCredentialsProvider
    [junit4] 2> 1745929 INFO (TEST-CollectionsAPIDistributedZkTest.test-seed#[7CEC55EDA2CDFB13]) [ ] o.a.s.c.c.ConnectionManager Waiting for client to connect to ZooKeeper
    [junit4] 2> 1745956 INFO (zkCallback-1980-thread-1) [ ] o.a.s.c.c.ConnectionManager Watcher org.apache.solr.common.cloud.ConnectionManager@6041bf94 name:ZooKeeperConnection Watcher:127.0.0.1:55008 got event WatchedEvent state:SyncConnected type:None path:null path:null type:None
    [junit4] 2> 1745956 INFO (TEST-CollectionsAPIDistributedZkTest.test-seed#[7CEC55EDA2CDFB13]) [ ] o.a.s.c.c.ConnectionManager Client is connected to ZooKeeper
    [junit4] 2> 1745956 INFO (TEST-CollectionsAPIDistributedZkTest.test-seed#[7CEC55EDA2CDFB13]) [ ] o.a.s.c.c.SolrZkClient Using default ZkACLProvider
    [junit4] 2> 1745956 INFO (TEST-CollectionsAPIDistributedZkTest.test-seed#[7CEC55EDA2CDFB13]) [ ] o.a.s.c.c.SolrZkClient makePath: /solr
    [junit4] 2> 1745961 INFO (TEST-CollectionsAPIDistributedZkTest.test-seed#[7CEC55EDA2CDFB13]) [ ] o.a.s.c.c.SolrZkClient Using default ZkCredentialsProvider
    [junit4] 2> 1745962 INFO (TEST-CollectionsAPIDistributedZkTest.test-seed#[7CEC55EDA2CDFB13]) [ ] o.a.s.c.c.ConnectionManager Waiting for client to connect to ZooKeeper
    [junit4] 2> 1745964 INFO (zkCallback-1981-thread-1) [ ] o.a.s.c.c.ConnectionManager Watcher org.apache.solr.common.cloud.ConnectionManager@b92a874 name:ZooKeeperConnection Watcher:127.0.0.1:55008/solr got event WatchedEvent state:SyncConnected type:None path:null path:null type:None
    [junit4] 2> 1745964 INFO (TEST-CollectionsAPIDistributedZkTest.test-seed#[7CEC55EDA2CDFB13]) [ ] o.a.s.c.c.ConnectionManager Client is connected to ZooKeeper
    [junit4] 2> 1745965 INFO (TEST-CollectionsAPIDistributedZkTest.test-seed#[7CEC55EDA2CDFB13]) [ ] o.a.s.c.c.SolrZkClient Using default ZkACLProvider
    [junit4] 2> 1745965 INFO (TEST-CollectionsAPIDistributedZkTest.test-seed#[7CEC55EDA2CDFB13]) [ ] o.a.s.c.c.SolrZkClient makePath: /collections/collection1
    [junit4] 2> 1745969 INFO (TEST-CollectionsAPIDistributedZkTest.test-seed#[7CEC55EDA2CDFB13]) [ ] o.a.s.c.c.SolrZkClient makePath: /collections/collection1/shards
    [junit4] 2> 1745972 INFO (TEST-CollectionsAPIDistributedZkTest.test-seed#[7CEC55EDA2CDFB13]) [ ] o.a.s.c.c.SolrZkClient makePath: /collections/control_collection
    [junit4] 2> 1745977 INFO (TEST-CollectionsAPIDistributedZkTest.test-seed#[7CEC55EDA2CDFB13]) [ ] o.a.s.c.c.SolrZkClient makePath: /collections/control_collection/shards
    [junit4] 2> 1745981 INFO (TEST-CollectionsAPIDistributedZkTest.test-seed#[7CEC55EDA2CDFB13]) [ ] o.a.s.c.AbstractZkTestCase put /Users/jenkins/workspace/Lucene-Solr-master-MacOSX/solr/core/src/test-files/solr/collection1/conf/solrconfig-tlog.xml to /configs/conf1/solrconfig.xml
    [junit4] 2> 1745982 INFO (TEST-CollectionsAPIDistributedZkTest.test-seed#[7CEC55EDA2CDFB13]) [ ] o.a.s.c.c.SolrZkClient makePath: /configs/conf1/solrconfig.xml
    [junit4] 2> 1745987 INFO (TEST-CollectionsAPIDistributedZkTest.test-seed#[7CEC55EDA2CDFB13]) [ ] o.a.s.c.AbstractZkTestCase put /Users/jenkins/workspace/Lucene-Solr-master-MacOSX/solr/core/src/test-files/solr/collection1/conf/schema.xml to /configs/conf1/schema.xml
    [junit4] 2> 1745992 INFO (TEST-CollectionsAPIDistributedZkTest.test-seed#[7CEC55EDA2CDFB13]) [ ] o.a.s.c.c.SolrZkClient makePath: /configs/conf1/schema.xml
    [junit4] 2> 1745997 INFO (TEST-CollectionsAPIDistributedZkTest.test-seed#[7CEC55EDA2CDFB13]) [ ] o.a.s.c.AbstractZkTestCase put /Users/jenkins/workspace/Lucene-Solr-master-MacOSX/solr/core/src/test-files/solr/collection1/conf/solrconfig.snippet.randomindexconfig.xml to /configs/conf1/solrconfig.snippet.randomindexconfig.xml
    [junit4] 2> 1745997 INFO (TEST-CollectionsAPIDistributedZkTest.test-seed#[7CEC55EDA2CDFB13]) [ ] o.a.s.c.c.SolrZkClient makePath: /configs/conf1/solrconfig.snippet.randomindexconfig.xml
    [junit4] 2> 1746002 INFO (TEST-CollectionsAPIDistributedZkTest.test-seed#[7CEC55EDA2CDFB13]) [ ] o.a.s.c.AbstractZkTestCase put /Users/jenkins/workspace/Lucene-Solr-master-MacOSX/solr/core/src/test-files/solr/collection1/conf/stopwords.txt to /configs/conf1/stopwords.txt
    [junit4] 2> 1746002 INFO (TEST-CollectionsAPIDistributedZkTest.test-seed#[7CEC55EDA2CDFB13]) [ ] o.a.s.c.c.SolrZkClient makePath: /configs/conf1/stopwords.txt
    [junit4] 2> 1746007 INFO (TEST-CollectionsAPIDistributedZkTest.test-seed#[7CEC55EDA2CDFB13]) [ ] o.a.s.c.AbstractZkTestCase put /Users/jenkins/workspace/Lucene-Solr-master-MacOSX/solr/core/src/test-files/solr/collection1/conf/protwords.txt to /configs/conf1/protwords.txt
    [junit4] 2> 1746007 INFO (TEST-CollectionsAPIDistributedZkTest.test-seed#[7CEC55EDA2CDFB13]) [ ] o.a.s.c.c.SolrZkClient makePath: /configs/conf1/protwords.txt
    [junit4] 2> 1746011 INFO (TEST-CollectionsAPIDistributedZkTest.test-seed#[7CEC55EDA2CDFB13]) [ ] o.a.s.c.AbstractZkTestCase put /Users/jenkins/workspace/Lucene-Solr-master-MacOSX/solr/core/src/test-files/solr/collection1/conf/currency.xml to /configs/conf1/currency.xml
    [junit4] 2> 1746012 INFO (TEST-CollectionsAPIDistributedZkTest.test-seed#[7CEC55EDA2CDFB13]) [ ] o.a.s.c.c.SolrZkClient makePath: /configs/conf1/currency.xml
    [junit4] 2> 1746017 INFO (TEST-CollectionsAPIDistributedZkTest.test-seed#[7CEC55EDA2CDFB13]) [ ] o.a.s.c.AbstractZkTestCase put /Users/jenkins/workspace/Lucene-Solr-master-MacOSX/solr/core/src/test-files/solr/collection1/conf/enumsConfig.xml to /configs/conf1/enumsConfig.xml
    [junit4] 2> 1746020 INFO (TEST-CollectionsAPIDistributedZkTest.test-seed#[7CEC55EDA2CDFB13]) [ ] o.a.s.c.c.SolrZkClient makePath: /configs/conf1/enumsConfig.xml
    [junit4] 2> 1746025 INFO (TEST-CollectionsAPIDistributedZkTest.test-seed#[7CEC55EDA2CDFB13]) [ ] o.a.s.c.AbstractZkTestCase put /Users/jenkins/workspace/Lucene-Solr-master-MacOSX/solr/core/src/test-files/solr/collection1/conf/open-exchange-rates.json to /configs/conf1/open-exchange-rates.json
    [junit4] 2> 1746025 INFO (TEST-CollectionsAPIDistributedZkTest.test-seed#[7CEC55EDA2CDFB13]) [ ] o.a.s.c.c.SolrZkClient makePath: /configs/conf1/open-exchange-rates.json
    [junit4] 2> 1746030 INFO (TEST-CollectionsAPIDistributedZkTest.test-seed#[7CEC55EDA2CDFB13]) [ ] o.a.s.c.AbstractZkTestCase put /Users/jenkins/workspace/Lucene-Solr-master-MacOSX/solr/core/src/test-files/solr/collection1/conf/mapping-ISOLatin1Accent.txt to /configs/conf1/mapping-ISOLatin1Accent.txt
    [junit4] 2> 1746031 INFO (TEST-CollectionsAPIDistributedZkTest.test-seed#[7CEC55EDA2CDFB13]) [ ] o.a.s.c.c.SolrZkClient makePath: /configs/conf1/mapping-ISOLatin1Accent.txt
    [junit4] 2> 1746035 INFO (TEST-CollectionsAPIDistributedZkTest.test-seed#[7CEC55EDA2CDFB13]) [ ] o.a.s.c.AbstractZkTestCase put /Users/jenkins/workspace/Lucene-Solr-master-MacOSX/solr/core/src/test-files/solr/collection1/conf/old_synonyms.txt to /configs/conf1/old_synonyms.txt
    [junit4] 2> 1746052 INFO (TEST-CollectionsAPIDistributedZkTest.test-seed#[7CEC55EDA2CDFB13]) [ ] o.a.s.c.c.SolrZkClient makePath: /configs/conf1/old_synonyms.txt
    [junit4] 2> 1746058 INFO (TEST-CollectionsAPIDistributedZkTest.test-seed#[7CEC55EDA2CDFB13]) [ ] o.a.s.c.AbstractZkTestCase put /Users/jenkins/workspace/Lucene-Solr-master-MacOSX/solr/core/src/test-files/solr/collection1/conf/synonyms.txt to /configs/conf1/synonyms.txt
    [junit4] 2> 1746059 INFO (TEST-CollectionsAPIDistributedZkTest.test-seed#[7CEC55EDA2CDFB13]) [ ] o.a.s.c.c.SolrZkClient makePath: /configs/conf1/synonyms.txt
    [junit4] 2> 1746066 INFO (TEST-CollectionsAPIDistributedZkTest.test-seed#[7CEC55EDA2CDFB13]) [ ] o.a.s.c.c.SolrZkClient Using default ZkCredentialsProvider
    [junit4] 2> 1746068 INFO (TEST-CollectionsAPIDistributedZkTest.test-seed#[7CEC55EDA2CDFB13]) [ ] o.a.s.c.c.ConnectionManager Waiting for client to connect to ZooKeeper
    [junit4] 2> 1746069 INFO (zkCallback-1983-thread-1) [ ] o.a.s.c.c.ConnectionManager Watcher org.apache.solr.common.cloud.ConnectionManager@55bd357d name:ZooKeeperConnection Watcher:127.0.0.1:55008/solr got event WatchedEvent state:SyncConnected type:None path:null path:null type:None
    [junit4] 2> 1746069 INFO (TEST-CollectionsAPIDistributedZkTest.test-seed#[7CEC55EDA2CDFB13]) [ ] o.a.s.c.c.ConnectionManager Client is connected to ZooKeeper
    [junit4] 2> 1746069 INFO (TEST-CollectionsAPIDistributedZkTest.test-seed#[7CEC55EDA2CDFB13]) [ ] o.a.s.c.c.SolrZkClient Using default ZkACLProvider
    [junit4] 2> 1746073 INFO (TEST-CollectionsAPIDistributedZkTest.test-seed#[7CEC55EDA2CDFB13]) [ ] o.a.s.c.c.SolrZkClient Using default ZkCredentialsProvider
    [junit4] 2> 1746073 INFO (TEST-CollectionsAPIDistributedZkTest.test-seed#[7CEC55EDA2CDFB13]) [ ] o.a.s.c.c.ConnectionManager Waiting for client to connect to ZooKeeper
    [junit4] 2> 1746075 INFO (zkCallback-1984-thread-1) [ ] o.a.s.c.c.ConnectionManager Watcher org.apache.solr.common.cloud.ConnectionManager@8a01dc2 name:ZooKeeperConnection Watcher:127.0.0.1:55008 got event WatchedEvent state:SyncConnected type:None path:null path:null type:None
    [junit4] 2> 1746075 INFO (TEST-CollectionsAPIDistributedZkTest.test-seed#[7CEC55EDA2CDFB13]) [ ] o.a.s.c.c.ConnectionManager Client is connected to ZooKeeper
    [junit4] 2> 1746076 INFO (TEST-CollectionsAPIDistributedZkTest.test-seed#[7CEC55EDA2CDFB13]) [ ] o.a.s.c.c.SolrZkClient Using default ZkACLProvider
    [junit4] 2> 1746076 INFO (TEST-CollectionsAPIDistributedZkTest.test-seed#[7CEC55EDA2CDFB13]) [ ] o.a.s.c.c.SolrZkClient makePath: /solr
    [junit4] 2> 1746080 INFO (TEST-CollectionsAPIDistributedZkTest.test-seed#[7CEC55EDA2CDFB13]) [ ] o.a.s.c.c.SolrZkClient Using default ZkCredentialsProvider
    [junit4] 2> 1746081 INFO (TEST-CollectionsAPIDistributedZkTest.test-seed#[7CEC55EDA2CDFB13]) [ ] o.a.s.c.c.ConnectionManager Waiting for client to connect to ZooKeeper
    [junit4] 2> 1746083 INFO (zkCallback-1985-thread-1) [ ] o.a.s.c.c.ConnectionManager Watcher org.apache.solr.common.cloud.ConnectionManager@3bcd9c72 name:ZooKeeperConnection Watcher:127.0.0.1:55008/solr got event WatchedEvent state:SyncConnected type:None path:null path:null type:None
    [junit4] 2> 1746083 INFO (TEST-CollectionsAPIDistributedZkTest.test-seed#[7CEC55EDA2CDFB13]) [ ] o.a.s.c.c.ConnectionManager Client is connected to ZooKeeper
    [junit4] 2> 1746083 INFO (TEST-CollectionsAPIDistributedZkTest.test-seed#[7CEC55EDA2CDFB13]) [ ] o.a.s.c.c.SolrZkClient Using default ZkACLProvider
    [junit4] 2> 1746085 INFO (TEST-CollectionsAPIDistributedZkTest.test-seed#[7CEC55EDA2CDFB13]) [ ] o.a.s.c.AbstractZkTestCase put /Users/jenkins/workspace/Lucene-Solr-master-MacOSX/solr/core/src/test-files/solr/collection1/conf/solrconfig-tlog.xml to /configs/conf2/solrconfig.xml
    [junit4] 2> 1746085 INFO (TEST-CollectionsAPIDistributedZkTest.test-seed#[7CEC55EDA2CDFB13]) [ ] o.a.s.c.c.SolrZkClient makePath: /configs/conf2/solrconfig.xml
    [junit4] 2> 1746092 INFO (TEST-CollectionsAPIDistributedZkTest.test-seed#[7CEC55EDA2CDFB13]) [ ] o.a.s.c.AbstractZkTestCase put /Users/jenkins/workspace/Lucene-Solr-master-MacOSX/solr/core/src/test-files/solr/collection1/conf/schema.xml to /configs/conf2/schema.xml
    [junit4] 2> 1746092 INFO (TEST-CollectionsAPIDistributedZkTest.test-seed#[7CEC55EDA2CDFB13]) [ ] o.a.s.c.c.SolrZkClient makePath: /configs/conf2/schema.xml
    [junit4] 2> 1746097 INFO (TEST-CollectionsAPIDistributedZkTest.test-seed#[7CEC55EDA2CDFB13]) [ ] o.a.s.c.AbstractZkTestCase put /Users/jenkins/workspace/Lucene-Solr-master-MacOSX/solr/core/src/test-files/solr/collection1/conf/enumsConfig.xml to /configs/conf2/enumsConfig.xml
    [junit4] 2> 1746098 INFO (TEST-CollectionsAPIDistributedZkTest.test-seed#[7CEC55EDA2CDFB13]) [ ] o.a.s.c.c.SolrZkClient makePath: /configs/conf2/enumsConfig.xml
    [junit4] 2> 1746102 INFO (TEST-CollectionsAPIDistributedZkTest.test-seed#[7CEC55EDA2CDFB13]) [ ] o.a.s.c.AbstractZkTestCase put /Users/jenkins/workspace/Lucene-Solr-master-MacOSX/solr/core/src/test-files/solr/collection1/conf/solrconfig.snippet.randomindexconfig.xml to /configs/conf2/solrconfig.snippet.randomindexconfig.xml
    [junit4] 2> 1746103 INFO (TEST-CollectionsAPIDistributedZkTest.test-seed#[7CEC55EDA2CDFB13]) [ ] o.a.s.c.c.SolrZkClient makePath: /configs/conf2/solrconfig.snippet.randomindexconfig.xml
    [junit4] 2> 1746107 INFO (TEST-CollectionsAPIDistributedZkTest.test-seed#[7CEC55EDA2CDFB13]) [ ] o.a.s.c.AbstractZkTestCase put /Users/jenkins/workspace/Lucene-Solr-master-MacOSX/solr/core/src/test-files/solr/collection1/conf/stopwords.txt to /configs/conf2/stopwords.txt
    [junit4] 2> 1746107 INFO (TEST-CollectionsAPIDistributedZkTest.test-seed#[7CEC55EDA2CDFB13]) [ ] o.a.s.c.c.SolrZkClient makePath: /configs/conf2/stopwords.txt
    [junit4] 2> 1746112 INFO (TEST-CollectionsAPIDistributedZkTest.test-seed#[7CEC55EDA2CDFB13]) [ ] o.a.s.c.AbstractZkTestCase put /Users/jenkins/workspace/Lucene-Solr-master-MacOSX/solr/core/src/test-files/solr/collection1/conf/protwords.txt to /configs/conf2/protwords.txt
    [junit4] 2> 1746113 INFO (TEST-CollectionsAPIDistributedZkTest.test-seed#[7CEC55EDA2CDFB13]) [ ] o.a.s.c.c.SolrZkClient makePath: /configs/conf2/protwords.txt
    [junit4] 2> 1746117 INFO (TEST-CollectionsAPIDistributedZkTest.test-seed#[7CEC55EDA2CDFB13]) [ ] o.a.s.c.AbstractZkTestCase put /Users/jenkins/workspace/Lucene-Solr-master-MacOSX/solr/core/src/test-files/solr/collection1/conf/currency.xml to /configs/conf2/currency.xml
    [junit4] 2> 1746117 INFO (TEST-CollectionsAPIDistributedZkTest.test-seed#[7CEC55EDA2CDFB13]) [ ] o.a.s.c.c.SolrZkClient makePath: /configs/conf2/currency.xml
    [junit4] 2> 1746122 INFO (TEST-CollectionsAPIDistributedZkTest.test-seed#[7CEC55EDA2CDFB13]) [ ] o.a.s.c.AbstractZkTestCase put /Users/jenkins/workspace/Lucene-Solr-master-MacOSX/solr/core/src/test-files/solr/collection1/conf/open-exchange-rates.json to /configs/conf2/open-exchange-rates.json
    [junit4] 2> 1746123 INFO (TEST-CollectionsAPIDistributedZkTest.test-seed#[7CEC55EDA2CDFB13]) [ ] o.a.s.c.c.SolrZkClient makePath: /configs/conf2/open-exchange-rates.json
    [junit4] 2> 1746127 INFO (TEST-CollectionsAPIDistributedZkTest.test-seed#[7CEC55EDA2CDFB13]) [ ] o.a.s.c.AbstractZkTestCase put /Users/jenkins/workspace/Lucene-Solr-master-MacOSX/solr/core/src/test-files/solr/collection1/conf/mapping-ISOLatin1Accent.txt to /configs/conf2/mapping-ISOLatin1Accent.txt
    [junit4] 2> 1746127 INFO (TEST-CollectionsAPIDistributedZkTest.test-seed#[7CEC55EDA2CDFB13]) [ ] o.a.s.c.c.SolrZkClient makePath: /configs/conf2/mapping-ISOLatin1Accent.txt
    [junit4] 2> 1746131 INFO (TEST-CollectionsAPIDistributedZkTest.test-seed#[7CEC55EDA2CDFB13]) [ ] o.a.s.c.AbstractZkTestCase put /Users/jenkins/workspace/Lucene-Solr-master-MacOSX/solr/core/src/test-files/solr/collection1/conf/old_synonyms.txt to /configs/conf2/old_synonyms.txt
    [junit4] 2> 1746131 INFO (TEST-CollectionsAPIDistributedZkTest.test-seed#[7CEC55EDA2CDFB13]) [ ] o.a.s.c.c.SolrZkClient makePath: /configs/conf2/old_synonyms.txt
    [junit4] 2> 1746136 INFO (TEST-CollectionsAPIDistributedZkTest.test-seed#[7CEC55EDA2CDFB13]) [ ] o.a.s.c.AbstractZkTestCase put /Users/jenkins/workspace/Lucene-Solr-master-MacOSX/solr/core/src/test-files/solr/collection1/conf/synonyms.txt to /configs/conf2/synonyms.txt
    [junit4] 2> 1746136 INFO (TEST-CollectionsAPIDistributedZkTest.test-seed#[7CEC55EDA2CDFB13]) [ ] o.a.s.c.c.SolrZkClient makePath: /configs/conf2/synonyms.txt
    [junit4] 2> 1746141 INFO (TEST-CollectionsAPIDistributedZkTest.test-seed#[7CEC55EDA2CDFB13]) [ ] o.a.s.c.AbstractZkTestCase put /Users/jenkins/workspace/Lucene-Solr-master-MacOSX/solr/core/src/test-files/solr/collection1/conf/elevate.xml to /configs/conf2/elevate.xml
    [junit4] 2> 1746144 INFO (TEST-CollectionsAPIDistributedZkTest.test-seed#[7CEC55EDA2CDFB13]) [ ] o.a.s.c.c.SolrZkClient makePath: /configs/conf2/elevate.xml
    [junit4] 2> 1747755 INFO (TEST-CollectionsAPIDistributedZkTest.test-seed#[7CEC55EDA2CDFB13]) [ ] o.a.s.SolrTestCaseJ4 Writing core.properties file to /Users/jenkins/workspace/Lucene-Solr-master-MacOSX/solr/build/solr-core/test/J0/temp/solr.cloud.CollectionsAPIDistributedZkTest_7CEC55EDA2CDFB13-001/control-001/cores/collection1
    [junit4] 2> 1747763 INFO (TEST-CollectionsAPIDistributedZkTest.test-seed#[7CEC55EDA2CDFB13]) [ ] o.e.j.s.Server jetty-9.3.8.v20160314
    [junit4] 2> 1747766 INFO (TEST-CollectionsAPIDistributedZkTest.test-seed#[7CEC55EDA2CDFB13]) [ ] o.e.j.s.h.ContextHandler Started o.e.j.s.ServletContextHandler@6a5fd223{/,null,AVAILABLE}
    [junit4] 2> 1747768 INFO (TEST-CollectionsAPIDistributedZkTest.test-seed#[7CEC55EDA2CDFB13]) [ ] o.e.j.s.ServerConnector Started ServerConnector@2e177459{SSL,[ssl, http/1.1]}{127.0.0.1:55014}
    [junit4] 2> 1747769 INFO (TEST-CollectionsAPIDistributedZkTest.test-seed#[7CEC55EDA2CDFB13]) [ ] o.e.j.s.Server Started @1753844ms
    [junit4] 2> 1747769 INFO (TEST-CollectionsAPIDistributedZkTest.test-seed#[7CEC55EDA2CDFB13]) [ ] o.a.s.c.s.e.JettySolrRunner Jetty properties: {solr.data.dir=/Users/jenkins/workspace/Lucene-Solr-master-MacOSX/solr/build/solr-core/test/J0/temp/solr.cloud.CollectionsAPIDistributedZkTest_7CEC55EDA2CDFB13-001/tempDir-001/control/data, hostContext=/, hostPort=55014, coreRootDirectory=/Users/jenkins/workspace/Lucene-Solr-master-MacOSX/solr/build/solr-core/test/J0/../../../../../../../../../Users/jenkins/workspace/Lucene-Solr-master-MacOSX/solr/build/solr-core/test/J0/temp/solr.cloud.CollectionsAPIDistributedZkTest_7CEC55EDA2CDFB13-001/control-001/cores}
    [junit4] 2> 1747769 INFO (TEST-CollectionsAPIDistributedZkTest.test-seed#[7CEC55EDA2CDFB13]) [ ] o.a.s.s.SolrDispatchFilter SolrDispatchFilter.init(): sun.misc.Launcher$AppClassLoader@4554617c
    [junit4] 2> 1747769 INFO (TEST-CollectionsAPIDistributedZkTest.test-seed#[7CEC55EDA2CDFB13]) [ ] o.a.s.c.SolrResourceLoader new SolrResourceLoader for directory: '/Users/jenkins/workspace/Lucene-Solr-master-MacOSX/solr/build/solr-core/test/J0/temp/solr.cloud.CollectionsAPIDistributedZkTest_7CEC55EDA2CDFB13-001/control-001'
    [junit4] 2> 1747770 INFO (TEST-CollectionsAPIDistributedZkTest.test-seed#[7CEC55EDA2CDFB13]) [ ] o.a.s.c.SolrResourceLoader JNDI not configured for solr (NoInitialContextEx)
    [junit4] 2> 1747770 INFO (TEST-CollectionsAPIDistributedZkTest.test-seed#[7CEC55EDA2CDFB13]) [ ] o.a.s.c.SolrResourceLoader solr home defaulted to 'solr/' (could not find system property or JNDI)
    [junit4] 2> 1747770 INFO (TEST-CollectionsAPIDistributedZkTest.test-seed#[7CEC55EDA2CDFB13]) [ ] o.a.s.c.c.SolrZkClient Using default ZkCredentialsProvider
    [junit4] 2> 1747771 INFO (TEST-CollectionsAPIDistributedZkTest.test-seed#[7CEC55EDA2CDFB13]) [ ] o.a.s.c.c.ConnectionManager Waiting for client to connect to ZooKeeper
    [junit4] 2> 1747773 INFO (zkCallback-1986-thread-1) [ ] o.a.s.c.c.ConnectionManager Watcher org.apache.solr.common.cloud.ConnectionManager@46bf0bf0 name:ZooKeeperConnection Watcher:127.0.0.1:55008/solr got event WatchedEvent state:SyncConnected type:None path:null path:null type:None
    [junit4] 2> 1747773 INFO (TEST-CollectionsAPIDistributedZkTest.test-seed#[7CEC55EDA2CDFB13]) [ ] o.a.s.c.c.ConnectionManager Client is connected to ZooKeeper
    [junit4] 2> 1747773 INFO (TEST-CollectionsAPIDistributedZkTest.test-seed#[7CEC55EDA2CDFB13]) [ ] o.a.s.c.c.SolrZkClient Using default ZkACLProvider
    [junit4] 2> 1747775 INFO (TEST-CollectionsAPIDistributedZkTest.test-seed#[7CEC55EDA2CDFB13]) [ ] o.a.s.s.SolrDispatchFilter Loading solr.xml from SolrHome (not found in ZooKeeper)
    [junit4] 2> 1747775 INFO (TEST-CollectionsAPIDistributedZkTest.test-seed#[7CEC55EDA2CDFB13]) [ ] o.a.s.c.SolrXmlConfig Loading container configuration from /Users/jenkins/workspace/Lucene-Solr-master-MacOSX/solr/build/solr-core/test/J0/temp/solr.cloud.CollectionsAPIDistributedZkTest_7CEC55EDA2CDFB13-001/control-001/solr.xml
    [junit4] 2> 1747787 INFO (TEST-CollectionsAPIDistributedZkTest.test-seed#[7CEC55EDA2CDFB13]) [ ] o.a.s.c.CorePropertiesLocator Config-defined core root directory: /Users/jenkins/workspace/Lucene-Solr-master-MacOSX/solr/build/solr-core/test/J0/../../../../../../../../../Users/jenkins/workspace/Lucene-Solr-master-MacOSX/solr/build/solr-core/test/J0/temp/solr.cloud.CollectionsAPIDistributedZkTest_7CEC55EDA2CDFB13-001/control-001/cores
    [junit4] 2> 1747787 INFO (TEST-CollectionsAPIDistributedZkTest.test-seed#[7CEC55EDA2CDFB13]) [ ] o.a.s.c.CoreContainer New CoreContainer 781028937
    [junit4] 2> 1747787 INFO (TEST-CollectionsAPIDistributedZkTest.test-seed#[7CEC55EDA2CDFB13]) [ ] o.a.s.c.CoreContainer Loading cores into CoreContainer [instanceDir=/Users/jenkins/workspace/Lucene-Solr-master-MacOSX/solr/build/solr-core/test/J0/temp/solr.cloud.CollectionsAPIDistributedZkTest_7CEC55EDA2CDFB13-001/control-001]
    [junit4] 2> 1747787 WARN (TEST-CollectionsAPIDistributedZkTest.test-seed#[7CEC55EDA2CDFB13]) [ ] o.a.s.c.CoreContainer Couldn't add files from /Users/jenkins/workspace/Lucene-Solr-master-MacOSX/solr/build/solr-core/test/J0/temp/solr.cloud.CollectionsAPIDistributedZkTest_7CEC55EDA2CDFB13-001/control-001/lib to classpath: /Users/jenkins/workspace/Lucene-Solr-master-MacOSX/solr/build/solr-core/test/J0/temp/solr.cloud.CollectionsAPIDistributedZkTest_7CEC55EDA2CDFB13-001/control-001/lib
    [junit4] 2> 1747788 INFO (TEST-CollectionsAPIDistributedZkTest.test-seed#[7CEC55EDA2CDFB13]) [ ] o.a.s.h.c.HttpShardHandlerFactory created with socketTimeout : 90000,urlScheme : ,connTimeout : 15000,maxConnectionsPerHost : 20,maxConnections : 10000,corePoolSize : 0,maximumPoolSize : 2147483647,maxThreadIdleTime : 5,sizeOfQueue : -1,fairnessPolicy : false,
    [junit4] 2> 1747792 INFO (TEST-CollectionsAPIDistributedZkTest.test-seed#[7CEC55EDA2CDFB13]) [ ] o.a.s.u.UpdateShardHandler Creating UpdateShardHandler HTTP client with params:
    [junit4] 2> 1747793 INFO (TEST-CollectionsAPIDistributedZkTest.test-seed#[7CEC55EDA2CDFB13]) [ ] o.a.s.l.LogWatcher SLF4J impl is org.slf4j.impl.Log4jLoggerFactory
    [junit4] 2> 1747793 INFO (TEST-CollectionsAPIDistributedZkTest.test-seed#[7CEC55EDA2CDFB13]) [ ] o.a.s.l.LogWatcher Registering Log Listener [Log4j (org.slf4j.impl.Log4jLoggerFactory)]
    [junit4] 2> 1747793 INFO (TEST-CollectionsAPIDistributedZkTest.test-seed#[7CEC55EDA2CDFB13]) [ ] o.a.s.c.ZkContainer Zookeeper client=127.0.0.1:55008/solr
    [junit4] 2> 1747793 INFO (TEST-CollectionsAPIDistributedZkTest.test-seed#[7CEC55EDA2CDFB13]) [ ] o.a.s.c.ZkController zkHost includes chroot
    [junit4] 2> 1747793 INFO (TEST-CollectionsAPIDistributedZkTest.test-seed#[7CEC55EDA2CDFB13]) [ ] o.a.s.c.c.SolrZkClient Using default ZkCredentialsProvider
    [junit4] 2> 1747794 INFO (TEST-CollectionsAPIDistributedZkTest.test-seed#[7CEC55EDA2CDFB13]) [ ] o.a.s.c.c.ConnectionManager Waiting for client to connect to ZooKeeper
    [junit4] 2> 1747795 INFO (zkCallback-1989-thread-1) [ ] o.a.s.c.c.ConnectionManager Watcher org.apache.solr.common.cloud.ConnectionManager@25656922 name:ZooKeeperConnection Watcher:127.0.0.1:55008 got event WatchedEvent state:SyncConnected type:None path:null path:null type:None
    [junit4] 2> 1747796 INFO (TEST-CollectionsAPIDistributedZkTest.test-seed#[7CEC55EDA2CDFB13]) [ ] o.a.s.c.c.ConnectionManager Client is connected to ZooKeeper
    [junit4] 2> 1747796 INFO (TEST-CollectionsAPIDistributedZkTest.test-seed#[7CEC55EDA2CDFB13]) [ ] o.a.s.c.c.SolrZkClient Using default ZkACLProvider
    [junit4] 2> 1747798 INFO (TEST-CollectionsAPIDistributedZkTest.test-seed#[7CEC55EDA2CDFB13]) [n:127.0.0.1:55014_ ] o.a.s.c.ZkController Added new OnReconnect listener org.apache.solr.cloud.ZkController$$Lambda$79/2039185798@32589e9c
    [junit4] 2> 1747799 INFO (TEST-CollectionsAPIDistributedZkTest.test-seed#[7CEC55EDA2CDFB13]) [n:127.0.0.1:55014_ ] o.a.s.c.c.ConnectionManager Waiting for client to connect to ZooKeeper
    [junit4] 2> 1747801 INFO (zkCallback-1990-thread-1-processing-n:127.0.0.1:55014_) [n:127.0.0.1:55014_ ] o.a.s.c.c.ConnectionManager Watcher org.apache.solr.common.cloud.ConnectionManager@31153412 name:ZooKeeperConnection Watcher:127.0.0.1:55008/solr got event WatchedEvent state:SyncConnected type:None path:null path:null type:None
    [junit4] 2> 1747801 INFO (TEST-CollectionsAPIDistributedZkTest.test-seed#[7CEC55EDA2CDFB13]) [n:127.0.0.1:55014_ ] o.a.s.c.c.ConnectionManager Client is connected to ZooKeeper
    [junit4] 2> 1747802 INFO (TEST-CollectionsAPIDistributedZkTest.test-seed#[7CEC55EDA2CDFB13]) [n:127.0.0.1:55014_ ] o.a.s.c.c.SolrZkClient makePath: /overseer/queue
    [junit4] 2> 1747806 INFO (TEST-CollectionsAPIDistributedZkTest.test-seed#[7CEC55EDA2CDFB13]) [n:127.0.0.1:55014_ ] o.a.s.c.c.SolrZkClient makePath: /overseer/collection-queue-work
    [junit4] 2> 1747812 INFO (TEST-CollectionsAPIDistributedZkTest.test-seed#[7CEC55EDA2CDFB13]) [n:127.0.0.1:55014_ ] o.a.s.c.c.SolrZkClient makePath: /overseer/collection-map-running
    [junit4] 2> 1747816 INFO (TEST-CollectionsAPIDistributedZkTest.test-seed#[7CEC55EDA2CDFB13]) [n:127.0.0.1:55014_ ] o.a.s.c.c.SolrZkClient makePath: /overseer/collection-map-completed
    [junit4] 2> 1747829 INFO (TEST-CollectionsAPIDistributedZkTest.test-seed#[7CEC55EDA2CDFB13]) [n:127.0.0.1:55014_ ] o.a.s.c.c.SolrZkClient makePath: /overseer/collection-map-failure
    [junit4] 2> 1747834 INFO (TEST-CollectionsAPIDistributedZkTest.test-seed#[7CEC55EDA2CDFB13]) [n:127.0.0.1:55014_ ] o.a.s.c.c.SolrZkClient makePath: /live_nodes
    [junit4] 2> 1747838 INFO (TEST-CollectionsAPIDistributedZkTest.test-seed#[7CEC55EDA2CDFB13]) [n:127.0.0.1:55014_ ] o.a.s.c.c.SolrZkClient makePath: /aliases.json
    [junit4] 2> 1747840 INFO (TEST-CollectionsAPIDistributedZkTest.test-seed#[7CEC55EDA2CDFB13]) [n:127.0.0.1:55014_ ] o.a.s.c.c.SolrZkClient makePath: /clusterstate.json
    [junit4] 2> 1747843 INFO (TEST-CollectionsAPIDistributedZkTest.test-seed#[7CEC55EDA2CDFB13]) [n:127.0.0.1:55014_ ] o.a.s.c.c.SolrZkClient makePath: /security.json
    [junit4] 2> 1747845 INFO (TEST-CollectionsAPIDistributedZkTest.test-seed#[7CEC55EDA2CDFB13]) [n:127.0.0.1:55014_ ] o.a.s.c.c.ZkStateReader Updating cluster state from ZooKeeper...
    [junit4] 2> 1747846 INFO (TEST-CollectionsAPIDistributedZkTest.test-seed#[7CEC55EDA2CDFB13]) [n:127.0.0.1:55014_ ] o.a.s.c.c.ZkStateReader Loaded cluster properties: {urlScheme=https}
    [junit4] 2> 1747847 INFO (TEST-CollectionsAPIDistributedZkTest.test-seed#[7CEC55EDA2CDFB13]) [n:127.0.0.1:55014_ ] o.a.s.c.c.ZkStateReader Updated live nodes from ZooKeeper... (0) -> (0)
    [junit4] 2> 1747851 INFO (TEST-CollectionsAPIDistributedZkTest.test-seed#[7CEC55EDA2CDFB13]) [n:127.0.0.1:55014_ ] o.a.s.c.c.SolrZkClient makePath: /overseer_elect
    [junit4] 2> 1747854 INFO (TEST-CollectionsAPIDistributedZkTest.test-seed#[7CEC55EDA2CDFB13]) [n:127.0.0.1:55014_ ] o.a.s.c.c.SolrZkClient makePath: /overseer_elect/election
    [junit4] 2> 1747856 INFO (TEST-CollectionsAPIDistributedZkTest.test-seed#[7CEC55EDA2CDFB13]) [n:127.0.0.1:55014_ ] o.a.s.c.Overseer Overseer (id=null) closing
    [junit4] 2> 1747856 INFO (TEST-CollectionsAPIDistributedZkTest.test-seed#[7CEC55EDA2CDFB13]) [n:127.0.0.1:55014_ ] o.a.s.c.LeaderElector Joined leadership election with path: /overseer_elect/election/96090339624288263-127.0.0.1:55014_-n_0000000000
    [junit4] 2> 1747857 INFO (TEST-CollectionsAPIDistributedZkTest.test-seed#[7CEC55EDA2CDFB13]) [n:127.0.0.1:55014_ ] o.a.s.c.OverseerElectionContext I am going to be the leader 127.0.0.1:55014_
    [junit4] 2> 1747857 INFO (TEST-CollectionsAPIDistributedZkTest.test-seed#[7CEC55EDA2CDFB13]) [n:127.0.0.1:55014_ ] o.a.s.c.c.SolrZkClient makePath: /overseer_elect/leader
    [junit4] 2> 1747860 INFO (TEST-CollectionsAPIDistributedZkTest.test-seed#[7CEC55EDA2CDFB13]) [n:127.0.0.1:55014_ ] o.a.s.c.Overseer Overseer (id=96090339624288263-127.0.0.1:55014_-n_0000000000) starting
    [junit4] 2> 1747864 INFO (TEST-CollectionsAPIDistributedZkTest.test-seed#[7CEC55EDA2CDFB13]) [n:127.0.0.1:55014_ ] o.a.s.c.c.SolrZkClient makePath: /overseer/queue-work
    [junit4] 2> 1747876 INFO (TEST-CollectionsAPIDistributedZkTest.test-seed#[7CEC55EDA2CDFB13]) [n:127.0.0.1:55014_ ] o.a.s.c.OverseerAutoReplicaFailoverThread Starting OverseerAutoReplicaFailoverThread autoReplicaFailoverWorkLoopDelay=10000 autoReplicaFailoverWaitAfterExpiration=10000 autoReplicaFailoverBadNodeExpiration=60000
    [junit4] 2> 1747877 INFO (OverseerCollectionConfigSetProcessor-96090339624288263-127.0.0.1:55014_-n_0000000000) [n:127.0.0.1:55014_ ] o.a.s.c.OverseerTaskProcessor Process current queue of overseer operations
    [junit4] 2> 1747877 INFO (OverseerStateUpdate-96090339624288263-127.0.0.1:55014_-n_0000000000) [n:127.0.0.1:55014_ ] o.a.s.c.Overseer Starting to work on the main queue
    [junit4] 2> 1747878 INFO (TEST-CollectionsAPIDistributedZkTest.test-seed#[7CEC55EDA2CDFB13]) [n:127.0.0.1:55014_ ] o.a.s.c.ZkController Register node as live in ZooKeeper:/live_nodes/127.0.0.1:55014_
    [junit4] 2> 1747880 INFO (TEST-CollectionsAPIDistributedZkTest.test-seed#[7CEC55EDA2CDFB13]) [n:127.0.0.1:55014_ ] o.a.s.c.c.SolrZkClient makePath: /live_nodes/127.0.0.1:55014_
    [junit4] 2> 1747882 INFO (OverseerStateUpdate-96090339624288263-127.0.0.1:55014_-n_0000000000) [n:127.0.0.1:55014_ ] o.a.s.c.c.ZkStateReader Updated live nodes from ZooKeeper... (0) -> (0)
    [junit4] 2> 1747882 INFO (zkCallback-1990-thread-1-processing-n:127.0.0.1:55014_) [n:127.0.0.1:55014_ ] o.a.s.c.c.ZkStateReader A live node change: [WatchedEvent state:SyncConnected type:NodeChildrenChanged path:/live_nodes], has occurred - updating... (live nodes size: [0])
    [junit4] 2> 1747884 INFO (zkCallback-1990-thread-1-processing-n:127.0.0.1:55014_) [n:127.0.0.1:55014_ ] o.a.s.c.c.ZkStateReader Updated live nodes from ZooKeeper... (0) -> (1)
    [junit4] 2> 1747913 INFO (TEST-CollectionsAPIDistributedZkTest.test-seed#[7CEC55EDA2CDFB13]) [n:127.0.0.1:55014_ ] o.a.s.c.CoreContainer Security conf doesn't exist. Skipping setup for authorization module.
    [junit4] 2> 1747913 INFO (TEST-CollectionsAPIDistributedZkTest.test-seed#[7CEC55EDA2CDFB13]) [n:127.0.0.1:55014_ ] o.a.s.c.CoreContainer No authentication plugin used.
    [junit4] 2> 1747918 INFO (TEST-CollectionsAPIDistributedZkTest.test-seed#[7CEC55EDA2CDFB13]) [n:127.0.0.1:55014_ ] o.a.s.c.CorePropertiesLocator Looking for core definitions underneath /Users/jenkins/workspace/Lucene-Solr-master-MacOSX/solr/build/solr-core/test/J0/../../../../../../../../../Users/jenkins/workspace/Lucene-Solr-master-MacOSX/solr/build/solr-core/test/J0/temp/solr.cloud.CollectionsAPIDistributedZkTest_7CEC55EDA2CDFB13-001/control-001/cores
    [junit4] 2> 1747921 INFO (TEST-CollectionsAPIDistributedZkTest.test-seed#[7CEC55EDA2CDFB13]) [n:127.0.0.1:55014_ ] o.a.s.c.CoreDescriptor Created CoreDescriptor: {name=collection1, config=solrconfig.xml, transient=false, schema=schema.xml, loadOnStartup=true, configSetProperties=configsetprops.json, collection=control_collection, coreNodeName=, dataDir=data/, shard=}
    [junit4] 2> 1747921 INFO (TEST-CollectionsAPIDistributedZkTest.test-seed#[7CEC55EDA2CDFB13]) [n:127.0.0.1:55014_ ] o.a.s.c.CorePropertiesLocator Found core collection1 in /Users/jenkins/workspace/Lucene-Solr-master-MacOSX/solr/build/solr-core/test/J0/../../../../../../../../../Users/jenkins/workspace/Lucene-Solr-master-MacOSX/solr/build/solr-core/test/J0/temp/solr.cloud.CollectionsAPIDistributedZkTest_7CEC55EDA2CDFB13-001/control-001/cores/collection1
    [junit4] 2> 1747922 INFO (TEST-CollectionsAPIDistributedZkTest.test-seed#[7CEC55EDA2CDFB13]) [n:127.0.0.1:55014_ ] o.a.s.c.CorePropertiesLocator Found 1 core definitions
    [junit4] 2> 1747923 INFO (coreLoadExecutor-5533-thread-1-processing-n:127.0.0.1:55014_) [n:127.0.0.1:55014_ c:control_collection x:collection1] o.a.s.c.ZkController publishing state=down
    [junit4] 2> 1747923 INFO (coreLoadExecutor-5533-thread-1-processing-n:127.0.0.1:55014_) [n:127.0.0.1:55014_ c:control_collection x:collection1] o.a.s.c.ZkController numShards not found on descriptor - reading it from system property
    [junit4] 2> 1747923 INFO (TEST-CollectionsAPIDistributedZkTest.test-seed#[7CEC55EDA2CDFB13]) [n:127.0.0.1:55014_ ] o.a.s.s.SolrDispatchFilter user.dir=/Users/jenkins/workspace/Lucene-Solr-master-MacOSX/solr/build/solr-core/test/J0
    [junit4] 2> 1747923 INFO (TEST-CollectionsAPIDistributedZkTest.test-seed#[7CEC55EDA2CDFB13]) [n:127.0.0.1:55014_ ] o.a.s.s.SolrDispatchFilter SolrDispatchFilter.init() done
    [junit4] 2> 1747924 INFO (coreLoadExecutor-5533-thread-1-processing-n:127.0.0.1:55014_) [n:127.0.0.1:55014_ c:control_collection x:collection1] o.a.s.c.ZkController Collection control_collection not visible yet, but flagging it so a watch is registered when it becomes visible
    [junit4] 2> 1747926 INFO (OverseerStateUpdate-96090339624288263-127.0.0.1:55014_-n_0000000000) [n:127.0.0.1:55014_ ] o.a.s.c.Overseer processMessage: queueSize: 1, message = {
    [junit4] 2> "core":"collection1",
    [junit4] 2> "roles":null,
    [junit4] 2> "base_url":"https://127.0.0.1:55014",
    [junit4] 2> "node_name":"127.0.0.1:55014_",
    [junit4] 2> "numShards":"1",
    [junit4] 2> "state":"down",
    [junit4] 2> "shard":null,
    [junit4] 2> "collection":"control_collection",
    [junit4] 2> "operation":"state"} current state version: 0
    [junit4] 2> 1747926 INFO (OverseerStateUpdate-96090339624288263-127.0.0.1:55014_-n_0000000000) [n:127.0.0.1:55014_ ] o.a.s.c.o.ReplicaMutator Update state numShards=1 message={
    [junit4] 2> "core":"collection1",
    [junit4] 2> "roles":null,
    [junit4] 2> "base_url":"https://127.0.0.1:55014",
    [junit4] 2> "node_name":"127.0.0.1:55014_",
    [junit4] 2> "numShards":"1",
    [junit4] 2> "state":"down",
    [junit4] 2> "shard":null,
    [junit4] 2> "collection":"control_collection",
    [junit4] 2> "operation":"state"}
    [junit4] 2> 1747926 INFO (coreLoadExecutor-5533-thread-1-processing-n:127.0.0.1:55014_) [n:127.0.0.1:55014_ c:control_collection x:collection1] o.a.s.c.c.ZkStateReader Deleting data for [control_collection]
    [junit4] 2> 1747927 INFO (OverseerStateUpdate-96090339624288263-127.0.0.1:55014_-n_0000000000) [n:127.0.0.1:55014_ ] o.a.s.c.o.ClusterStateMutator building a new cName: control_collection
    [junit4] 2> 1747928 INFO (OverseerStateUpdate-96090339624288263-127.0.0.1:55014_-n_0000000000) [n:127.0.0.1:55014_ ] o.a.s.c.o.ReplicaMutator Assigning new node to shard shard=shard1
    [junit4] 2> 1747928 INFO (coreLoadExecutor-5533-thread-1-processing-n:127.0.0.1:55014_) [n:127.0.0.1:55014_ c:control_collection x:collection1] o.a.s.c.ZkController look for our core node name
    [junit4] 2> 1747931 INFO (zkCallback-1990-thread-1-processing-n:127.0.0.1:55014_) [n:127.0.0.1:55014_ ] o.a.s.c.c.ZkStateReader A cluster state change: [WatchedEvent state:SyncConnected type:NodeDataChanged path:/clusterstate.json], has occurred - updating... (live nodes size: [1])
    [junit4] 2> 1748937 INFO (coreLoadExecutor-5533-thread-1-processing-n:127.0.0.1:55014_) [n:127.0.0.1:55014_ c:control_collection x:collection1] o.a.s.c.ZkController waiting to find shard id in clusterstate for collection1
    [junit4] 2> 1748937 INFO (coreLoadExecutor-5533-thread-1-processing-n:127.0.0.1:55014_) [n:127.0.0.1:55014_ c:control_collection x:collection1] o.a.s.c.ZkController Check for collection zkNode:control_collection
    [junit4] 2> 1748938 INFO (coreLoadExecutor-5533-thread-1-processing-n:127.0.0.1:55014_) [n:127.0.0.1:55014_ c:control_collection x:collection1] o.a.s.c.ZkController Collection zkNode exists
    [junit4] 2> 1748938 INFO (coreLoadExecutor-5533-thread-1-processing-n:127.0.0.1:55014_) [n:127.0.0.1:55014_ c:control_collection x:collection1] o.a.s.c.c.ZkStateReader Load collection config from: [/collections/control_collection]
    [junit4] 2> 1748940 INFO (coreLoadExecutor-5533-thread-1-processing-n:127.0.0.1:55014_) [n:127.0.0.1:55014_ c:control_collection x:collection1] o.a.s.c.c.ZkStateReader path=[/collections/control_collection] [configName]=[conf1] specified config exists in ZooKeeper
    [junit4] 2> 1748940 INFO (coreLoadExecutor-5533-thread-1-processing-n:127.0.0.1:55014_) [n:127.0.0.1:55014_ c:control_collection x:collection1] o.a.s.c.SolrResourceLoader new SolrResourceLoader for directory: '/Users/jenkins/workspace/Lucene-Solr-master-MacOSX/solr/build/solr-core/test/J0/temp/solr.cloud.CollectionsAPIDistributedZkTest_7CEC55EDA2CDFB13-001/control-001/cores/collection1'
    [junit4] 2> 1748941 INFO (coreLoadExecutor-5533-thread-1-processing-n:127.0.0.1:55014_) [n:127.0.0.1:55014_ c:control_collection x:collection1] o.a.s.c.SolrResourceLoader JNDI not configured for solr (NoInitialContextEx)
    [junit4] 2> 1748941 INFO (coreLoadExecutor-5533-thread-1-processing-n:127.0.0.1:55014_) [n:127.0.0.1:55014_ c:control_collection x:collection1] o.a.s.c.SolrResourceLoader solr home defaulted to 'solr/' (could not find system property or JNDI)
    [junit4] 2> 1748944 INFO (coreLoadExecutor-5533-thread-1-processing-n:127.0.0.1:55014_) [n:127.0.0.1:55014_ c:control_collection x:collection1] o.a.s.c.Config loaded config solrconfig.xml with version 0
    [junit4] 2> 1748953 INFO (coreLoadExecutor-5533-thread-1-processing-n:127.0.0.1:55014_) [n:127.0.0.1:55014_ c:control_collection x:collection1] o.a.s.c.SolrConfig current version of requestparams : -1
    [junit4] 2> 1748959 INFO (coreLoadExecutor-5533-thread-1-processing-n:127.0.0.1:55014_) [n:127.0.0.1:55014_ c:control_collection x:collection1] o.a.s.c.SolrConfig Using Lucene MatchVersion: 7.0.0
    [junit4] 2> 1748971 INFO (coreLoadExecutor-5533-thread-1-processing-n:127.0.0.1:55014_) [n:127.0.0.1:55014_ c:control_collection x:collection1] o.a.s.c.SolrConfig Loaded SolrConfig: solrconfig.xml
    [junit4] 2> 1748982 INFO (coreLoadExecutor-5533-thread-1-processing-n:127.0.0.1:55014_) [n:127.0.0.1:55014_ c:control_collection x:collection1] o.a.s.s.IndexSchema [collection1] Schema name=test
    [junit4] 2> 1749108 INFO (coreLoadExecutor-5533-thread-1-processing-n:127.0.0.1:55014_) [n:127.0.0.1:55014_ c:control_collection x:collection1] o.a.s.s.OpenExchangeRatesOrgProvider Initialized with rates=open-exchange-rates.json, refreshInterval=1440.
    [junit4] 2> 1749116 INFO (coreLoadExecutor-5533-thread-1-processing-n:127.0.0.1:55014_) [n:127.0.0.1:55014_ c:control_collection x:collection1] o.a.s.s.IndexSchema default search field in schema is text
    [junit4] 2> 1749118 INFO (coreLoadExecutor-5533-thread-1-processing-n:127.0.0.1:55014_) [n:127.0.0.1:55014_ c:control_collection x:collection1] o.a.s.s.IndexSchema unique key field: id
    [junit4] 2> 1749134 INFO (coreLoadExecutor-5533-thread-1-processing-n:127.0.0.1:55014_) [n:127.0.0.1:55014_ c:control_collection x:collection1] o.a.s.s.FileExchangeRateProvider Reloading exchange rates from file currency.xml
    [junit4] 2> 1749137 INFO (coreLoadExecutor-5533-thread-1-processing-n:127.0.0.1:55014_) [n:127.0.0.1:55014_ c:control_collection x:collection1] o.a.s.s.FileExchangeRateProvider Reloading exchange rates from file currency.xml
    [junit4] 2> 1749140 INFO (coreLoadExecutor-5533-thread-1-processing-n:127.0.0.1:55014_) [n:127.0.0.1:55014_ c:control_collection x:collection1] o.a.s.s.OpenExchangeRatesOrgProvider Reloading exchange rates from open-exchange-rates.json
    [junit4] 2> 1749142 INFO (coreLoadExecutor-5533-thread-1-processing-n:127.0.0.1:55014_) [n:127.0.0.1:55014_ c:control_collection x:collection1] o.a.s.s.OpenExchangeRatesOrgProvider Reloading exchange rates from open-exchange-rates.json
    [junit4] 2> 1749147 INFO (coreLoadExecutor-5533-thread-1-processing-n:127.0.0.1:55014_) [n:127.0.0.1:55014_ c:control_collection x:collection1] o.a.s.c.ConfigSetProperties Did not find ConfigSet properties, assuming default properties: Can't find resource 'configsetprops.json' in classpath or '/configs/conf1', cwd=/Users/jenkins/workspace/Lucene-Solr-master-MacOSX/solr/build/solr-core/test/J0
    [junit4] 2> 1749147 INFO (coreLoadExecutor-5533-thread-1-processing-n:127.0.0.1:55014_) [n:127.0.0.1:55014_ c:control_collection x:collection1] o.a.s.c.CoreContainer Creating SolrCore 'collection1' using configuration from collection control_collection
    [junit4] 2> 1749147 INFO (coreLoadExecutor-5533-thread-1-processing-n:127.0.0.1:55014_) [n:127.0.0.1:55014_ c:control_collection s:shard1 r:core_node1 x:collection1] o.a.s.c.SolrCore org.apache.solr.core.MockDirectoryFactory
    [junit4] 2> 1749147 INFO (coreLoadExecutor-5533-thread-1-processing-n:127.0.0.1:55014_) [n:127.0.0.1:55014_ c:control_collection s:shard1 r:core_node1 x:collection1] o.a.s.c.SolrCore [[collection1] ] Opening new SolrCore at [/Users/jenkins/workspace/Lucene-Solr-master-MacOSX/solr/build/solr-core/test/J0/temp/solr.cloud.CollectionsAPIDistributedZkTest_7CEC55EDA2CDFB13-001/control-001/cores/collection1], dataDir=[/Users/jenkins/workspace/Lucene-Solr-master-MacOSX/solr/build/solr-core/test/J0/../../../../../../../../../Users/jenkins/workspace/Lucene-Solr-master-MacOSX/solr/build/solr-core/test/J0/temp/solr.cloud.CollectionsAPIDistributedZkTest_7CEC55EDA2CDFB13-001/control-001/cores/collection1/data/]
    [junit4] 2> 1749148 INFO (coreLoadExecutor-5533-thread-1-processing-n:127.0.0.1:55014_) [n:127.0.0.1:55014_ c:control_collection s:shard1 r:core_node1 x:collection1] o.a.s.c.JmxMonitoredMap JMX monitoring is enabled. Adding Solr mbeans to JMX Server: com.sun.jmx.mbeanserver.JmxMBeanServer@4533fc56
    [junit4] 2> 1749148 INFO (coreLoadExecutor-5533-thread-1-processing-n:127.0.0.1:55014_) [n:127.0.0.1:55014_ c:control_collection s:shard1 r:core_node1 x:collection1] o.a.s.c.CachingDirectoryFactory return new directory for /Users/jenkins/workspace/Lucene-Solr-master-MacOSX/solr/build/solr-core/test/J0/../../../../../../../../../Users/jenkins/workspace/Lucene-Solr-master-MacOSX/solr/build/solr-core/test/J0/temp/solr.cloud.CollectionsAPIDistributedZkTest_7CEC55EDA2CDFB13-001/control-001/cores/collection1/data
    [junit4] 2> 1749148 INFO (coreLoadExecutor-5533-thread-1-processing-n:127.0.0.1:55014_) [n:127.0.0.1:55014_ c:control_collection s:shard1 r:core_node1 x:collection1] o.a.s.c.SolrCore New index directory detected: old=null new=/Users/jenkins/workspace/Lucene-Solr-master-MacOSX/solr/build/solr-core/test/J0/../../../../../../../../../Users/jenkins/workspace/Lucene-Solr-master-MacOSX/solr/build/solr-core/test/J0/temp/solr.cloud.CollectionsAPIDistributedZkTest_7CEC55EDA2CDFB13-001/control-001/cores/collection1/data/index/
    [junit4] 2> 1749148 WARN (coreLoadExecutor-5533-thread-1-processing-n:127.0.0.1:55014_) [n:127.0.0.1:55014_ c:control_collection s:shard1 r:core_node1 x:collection1] o.a.s.c.SolrCore [collection1] Solr index directory '/Users/jenkins/workspace/Lucene-Solr-master-MacOSX/solr/build/solr-core/test/J0/../../../../../../../../../Users/jenkins/workspace/Lucene-Solr-master-MacOSX/solr/build/solr-core/test/J0/temp/solr.cloud.CollectionsAPIDistributedZkTest_7CEC55EDA2CDFB13-001/control-001/cores/collection1/data/index' doesn't exist. Creating new index...
    [junit4] 2> 1749149 INFO (coreLoadExecutor-5533-thread-1-processing-n:127.0.0.1:55014_) [n:127.0.0.1:55014_ c:control_collection s:shard1 r:core_node1 x:collection1] o.a.s.c.CachingDirectoryFactory return new directory for /Users/jenkins/workspace/Lucene-Solr-master-MacOSX/solr/build/solr-core/test/J0/../../../../../../../../../Users/jenkins/workspace/Lucene-Solr-master-MacOSX/solr/build/solr-core/test/J0/temp/solr.cloud.CollectionsAPIDistributedZkTest_7CEC55EDA2CDFB13-001/control-001/cores/collection1/data/index
    [junit4] 2> 1749149 INFO (coreLoadExecutor-5533-thread-1-processing-n:127.0.0.1:55014_) [n:127.0.0.1:55014_ c:control_collection s:shard1 r:core_node1 x:collection1] o.a.s.u.RandomMergePolicy RandomMergePolicy wrapping class org.apache.lucene.index.LogDocMergePolicy: [LogDocMergePolicy: minMergeSize=1000, mergeFactor=10, maxMergeSize=9223372036854775807, maxMergeSizeForForcedMerge=9223372036854775807, calibrateSizeByDeletes=false, maxMergeDocs=2147483647, maxCFSSegmentSizeMB=8.796093022207999E12, noCFSRatio=0.770524120765177]
    [junit4] 2> 1749150 INFO (coreLoadExecutor-5533-thread-1-processing-n:127.0.0.1:55014_) [n:127.0.0.1:55014_ c:control_collection s:shard1 r:core_node1 x:collection1] o.a.s.c.SolrDeletionPolicy SolrDeletionPolicy.onCommit: commits: num=1
    [junit4] 2> commit{dir=MockDirectoryWrapper(RAMDirectory@5575d6ef lockFactory=org.apache.lucene.store.SingleInstanceLockFactory@3e34e020),segFN=segments_1,generation=1}
    [junit4] 2> 1749150 INFO (coreLoadExecutor-5533-thread-1-processing-n:127.0.0.1:55014_) [n:127.0.0.1:55014_ c:control_collection s:shard1 r:core_node1 x:collection1] o.a.s.c.SolrDeletionPolicy newest commit generation = 1
    [junit4] 2> 1749151 INFO (OldIndexDirectoryCleanupThreadForCore-collection1) [n:127.0.0.1:55014_ c:control_collection s:shard1 r:core_node1 x:collection1] o.a.s.c.SolrCore Looking for old index directories to cleanup for core collection1 in /Users/jenkins/workspace/Lucene-Solr-master-MacOSX/solr/build/solr-core/test/J0/../../../../../../../../../Users/jenkins/workspace/Lucene-Solr-master-MacOSX/solr/build/solr-core/test/J0/temp/solr.cloud.CollectionsAPIDistributedZkTest_7CEC55EDA2CDFB13-001/control-001/cores/collection1/data/
    [junit4] 2> 1749151 WARN (OldIndexDirectoryCleanupThreadForCore-collection1) [n:127.0.0.1:55014_ c:control_collection s:shard1 r:core_node1 x:collection1] o.a.s.c.DirectoryFactory /Users/jenkins/workspace/Lucene-Solr-master-MacOSX/solr/build/solr-core/test/J0/../../../../../../../../../Users/jenkins/workspace/Lucene-Solr-master-MacOSX/solr/build/solr-core/test/J0/temp/solr.cloud.CollectionsAPIDistributedZkTest_7CEC55EDA2CDFB13-001/control-001/cores/collection1/data/ does not point to a valid data directory; skipping clean-up of old index directories.
    [junit4] 2> 1749154 INFO (coreLoadExecutor-5533-thread-1-processing-n:127.0.0.1:55014_) [n:127.0.0.1:55014_ c:control_collection s:shard1 r:core_node1 x:collection1] o.a.s.u.p.UpdateRequestProcessorChain creating updateRequestProcessorChain "nodistrib"
    [junit4] 2> 1749154 INFO (coreLoadExecutor-5533-thread-1-processing-n:127.0.0.1:55014_) [n:127.0.0.1:55014_ c:control_collection s:shard1 r:core_node1 x:collection1] o.a.s.u.p.UpdateRequestProcessorChain creating updateRequestProcessorChain "dedupe"
    [junit4] 2> 1749154 INFO (coreLoadExecutor-5533-thread-1-processing-n:127.0.0.1:55014_) [n:127.0.0.1:55014_ c:control_collection s:shard1 r:core_node1 x:collection1] o.a.s.u.p.UpdateRequestProcessorChain inserting DistributedUpdateProcessorFactory into updateRequestProcessorChain "dedupe"
    [junit4] 2> 1749154 INFO (coreLoadExecutor-5533-thread-1-processing-n:127.0.0.1:55014_) [n:127.0.0.1:55014_ c:control_collection s:shard1 r:core_node1 x:collection1] o.a.s.u.p.UpdateRequestProcessorChain creating updateRequestProcessorChain "stored_sig"
    [junit4] 2> 1749155 INFO (coreLoadExecutor-5533-thread-1-processing-n:127.0.0.1:55014_) [n:127.0.0.1:55014_ c:control_collection s:shard1 r:core_node1 x:collection1] o.a.s.u.p.UpdateRequestProcessorChain inserting DistributedUpdateProcessorFactory into updateRequestProcessorChain "stored_sig"
    [junit4] 2> 1749155 INFO (coreLoadExecutor-5533-thread-1-processing-n:127.0.0.1:55014_) [n:127.0.0.1:55014_ c:control_collection s:shard1 r:core_node1 x:collection1] o.a.s.u.p.UpdateRequestProcessorChain creating updateRequestProcessorChain "distrib-dup-test-chain-explicit"
    [junit4] 2> 1749155 INFO (coreLoadExecutor-5533-thread-1-processing-n:127.0.0.1:55014_) [n:127.0.0.1:55014_ c:control_collection s:shard1 r:core_node1 x:collection1] o.a.s.u.p.UpdateRequestProcessorChain creating updateRequestProcessorChain "distrib-dup-test-chain-implicit"
    [junit4] 2> 1749155 INFO (coreLoadExecutor-5533-thread-1-processing-n:127.0.0.1:55014_) [n:127.0.0.1:55014_ c:control_collection s:shard1 r:core_node1 x:collection1] o.a.s.u.p.UpdateRequestProcessorChain inserting DistributedUpdateProcessorFactory into updateRequestProcessorChain "distrib-dup-test-chain-implicit"
    [junit4] 2> 1749155 INFO (coreLoadExecutor-5533-thread-1-processing-n:127.0.0.1:55014_) [n:127.0.0.1:55014_ c:control_collection s:shard1 r:core_node1 x:collection1] o.a.s.c.SolrCore no updateRequestProcessorChain defined as default, creating implicit default
    [junit4] 2> 1749155 WARN (coreLoadExecutor-5533-thread-1-processing-n:127.0.0.1:55014_) [n:127.0.0.1:55014_ c:control_collection s:shard1 r:core_node1 x:collection1] o.a.s.c.RequestHandlers INVALID paramSet a in requestHandler {type = requestHandler,name = /dump,class = DumpRequestHandler,args = {defaults={a=A,b=B}}}
    [junit4] 2> 1749161 INFO (coreLoadExecutor-5533-thread-1-processing-n:127.0.0.1:55014_) [n:127.0.0.1:55014_ c:control_collection s:shard1 r:core_node1 x:collection1] o.a.s.h.l.XMLLoader xsltCacheLifetimeSeconds=60
    [junit4] 2> 1749163 INFO (coreLoadExecutor-5533-thread-1-processing-n:127.0.0.1:55014_) [n:127.0.0.1:55014_ c:control_collection s:shard1 r:core_node1 x:collection1] o.a.s.h.l.XMLLoader xsltCacheLifetimeSeconds=60
    [junit4] 2> 1749164 INFO (coreLoadExecutor-5533-thread-1-processing-n:127.0.0.1:55014_) [n:127.0.0.1:55014_ c:control_collection s:shard1 r:core_node1 x:collection1] o.a.s.h.l.XMLLoader xsltCacheLifetimeSeconds=60
    [junit4] 2> 1749166 INFO (coreLoadExecutor-5533-thread-1-processing-n:127.0.0.1:55014_) [n:127.0.0.1:55014_ c:control_collection s:shard1 r:core_node1 x:collection1] o.a.s.h.l.XMLLoader xsltCacheLifetimeSeconds=60
    [junit4] 2> 1749171 INFO (coreLoadExecutor-5533-thread-1-processing-n:127.0.0.1:55014_) [n:127.0.0.1:55014_ c:control_collection s:shard1 r:core_node1 x:collection1] o.a.s.c.RequestHandlers Registered paths: /admin/mbeans,standard,/update/json/docs,/admin/luke,/export,/get,/admin/properties,/update/json,/admin/threads,/dump,/update/csv,/sql,/graph,/admin/segments,/admin/system,/replication,/config,/stream,/schema,/admin/plugins,/admin/logging,/admin/ping,/update,/admin/file
    [junit4] 2> 1749171 INFO (coreLoadExecutor-5533-thread-1-processing-n:127.0.0.1:55014_) [n:127.0.0.1:55014_ c:control_collection s:shard1 r:core_node1 x:collection1] o.a.s.c.SolrCore Using default statsCache cache: org.apache.solr.search.stats.LocalStatsCache
    [junit4] 2> 1749172 INFO (coreLoadExecutor-5533-thread-1-processing-n:127.0.0.1:55014_) [n:127.0.0.1:55014_ c:control_collection s:shard1 r:core_node1 x:collection1] o.a.s.u.UpdateHandler Using UpdateLog implementation: org.apache.solr.update.UpdateLog
    [junit4] 2> 1749172 INFO (coreLoadExecutor-5533-thread-1-processing-n:127.0.0.1:55014_) [n:127.0.0.1:55014_ c:control_collection s:shard1 r:core_node1 x:collection1] o.a.s.u.UpdateLog Initializing UpdateLog: dataDir= defaultSyncLevel=FLUSH numRecordsToKeep=100 maxNumLogsToKeep=10 numVersionBuckets=65536
    [junit4] 2> 1749175 INFO (coreLoadExecutor-5533-thread-1-processing-n:127.0.0.1:55014_) [n:127.0.0.1:55014_ c:control_collection s:shard1 r:core_node1 x:collection1] o.a.s.u.CommitTracker Hard AutoCommit: disabled
    [junit4] 2> 1749175 INFO (coreLoadExecutor-5533-thread-1-processing-n:127.0.0.1:55014_) [n:127.0.0.1:55014_ c:control_collection s:shard1 r:core_node1 x:collection1] o.a.s.u.CommitTracker Soft AutoCommit: disabled
    [junit4] 2> 1749176 INFO (coreLoadExecutor-5533-thread-1-processing-n:127.0.0.1:55014_) [n:127.0.0.1:55014_ c:control_collection s:shard1 r:core_node1 x:collection1] o.a.s.u.RandomMergePolicy RandomMergePolicy wrapping class org.apache.lucene.index.TieredMergePolicy: [TieredMergePolicy: maxMergeAtOnce=16, maxMergeAtOnceExplicit=38, maxMergedSegmentMB=31.6884765625, floorSegmentMB=2.072265625, forceMergeDeletesPctAllowed=26.296862048163828, segmentsPerTier=47.0, maxCFSSegmentSizeMB=8.796093022207999E12, noCFSRatio=0.6486826517759627
    [junit4] 2> 1749177 INFO (coreLoadExecutor-5533-thread-1-processing-n:127.0.0.1:55014_) [n:127.0.0.1:55014_ c:control_collection s:shard1 r:core_node1 x:collection1] o.a.s.c.SolrDeletionPolicy SolrDeletionPolicy.onInit: commits: num=1
    [junit4] 2> commit{dir=MockDirectoryWrapper(RAMDirectory@5575d6ef lockFactory=org.apache.lucene.store.SingleInstanceLockFactory@3e34e020),segFN=segments_1,generation=1}
    [junit4] 2> 1749177 INFO (coreLoadExecutor-5533-thread-1-processing-n:127.0.0.1:55014_) [n:127.0.0.1:55014_ c:control_collection s:shard1 r:core_node1 x:collection1] o.a.s.c.SolrDeletionPolicy newest commit generation = 1
    [junit4] 2> 1749177 INFO (coreLoadExecutor-5533-thread-1-processing-n:127.0.0.1:55014_) [n:127.0.0.1:55014_ c:control_collection s:shard1 r:core_node1 x:collection1] o.a.s.s.SolrIndexSearcher Opening [Searcher@70c51d41[collection1] main]
    [junit4] 2> 1749177 INFO (coreLoadExecutor-5533-thread-1-processing-n:127.0.0.1:55014_) [n:127.0.0.1:55014_ c:control_collection s:shard1 r:core_node1 x:collection1] o.a.s.c.c.ZkStateReader Load collection config from: [/collections/control_collection]
    [junit4] 2> 1749179 INFO (coreLoadExecutor-5533-thread-1-processing-n:127.0.0.1:55014_) [n:127.0.0.1:55014_ c:control_collection s:shard1 r:core_node1 x:collection1] o.a.s.c.c.ZkStateReader path=[/collections/control_collection] [configName]=[conf1] specified config exists in ZooKeeper
    [junit4] 2> 1749179 INFO (coreLoadExecutor-5533-thread-1-processing-n:127.0.0.1:55014_) [n:127.0.0.1:55014_ c:control_collection s:shard1 r:core_node1 x:collection1] o.a.s.r.ManagedResourceStorage Setting up ZooKeeper-based storage for the RestManager with znodeBase: /configs/conf1
    [junit4] 2> 1749180 INFO (coreLoadExecutor-5533-thread-1-processing-n:127.0.0.1:55014_) [n:127.0.0.1:55014_ c:control_collection s:shard1 r:core_node1 x:collection1] o.a.s.r.ManagedResourceStorage Configured ZooKeeperStorageIO with znodeBase: /configs/conf1
    [junit4] 2> 1749180 INFO (coreLoadExecutor-5533-thread-1-processing-n:127.0.0.1:55014_) [n:127.0.0.1:55014_ c:control_collection s:shard1 r:core_node1 x:collection1] o.a.s.r.RestManager Initializing RestManager with initArgs: {}
    [junit4] 2> 1749180 INFO (coreLoadExecutor-5533-thread-1-processing-n:127.0.0.1:55014_) [n:127.0.0.1:55014_ c:control_collection s:shard1 r:core_node1 x:collection1] o.a.s.r.ManagedResourceStorage Reading _rest_managed.json using ZooKeeperStorageIO:path=/configs/conf1
    [junit4] 2> 1749181 INFO (coreLoadExecutor-5533-thread-1-processing-n:127.0.0.1:55014_) [n:127.0.0.1:55014_ c:control_collection s:shard1 r:core_node1 x:collection1] o.a.s.r.ManagedResourceStorage No data found for znode /configs/conf1/_rest_managed.json
    [junit4] 2> 1749181 INFO (coreLoadExecutor-5533-thread-1-processing-n:127.0.0.1:55014_) [n:127.0.0.1:55014_ c:control_collection s:shard1 r:core_node1 x:collection1] o.a.s.r.ManagedResourceStorage Loaded null at path _rest_managed.json using ZooKeeperStorageIO:path=/configs/conf1
    [junit4] 2> 1749181 INFO (coreLoadExecutor-5533-thread-1-processing-n:127.0.0.1:55014_) [n:127.0.0.1:55014_ c:control_collection s:shard1 r:core_node1 x:collection1] o.a.s.r.RestManager Initializing 0 registered ManagedResources
    [junit4] 2> 1749181 INFO (coreLoadExecutor-5533-thread-1-processing-n:127.0.0.1:55014_) [n:127.0.0.1:55014_ c:control_collection s:shard1 r:core_node1 x:collection1] o.a.s.h.ReplicationHandler Commits will be reserved for 10000
    [junit4] 2> 1749182 INFO (searcherExecutor-5534-thread-1-processing-n:127.0.0.1:55014_ x:collection1 s:shard1 c:control_collection r:core_node1) [n:127.0.0.1:55014_ c:control_collection s:shard1 r:core_node1 x:collection1] o.a.s.c.SolrCore [collection1] Registered new searcher Searcher@70c51d41[collection1] main{ExitableDirectoryReader(UninvertingDirectoryReader())}
    [junit4] 2> 1749182 INFO (coreLoadExecutor-5533-thread-1-processing-n:127.0.0.1:55014_) [n:127.0.0.1:55014_ c:control_collection s:shard1 r:core_node1 x:collection1] o.a.s.u.UpdateLog Looking up max value of version field to seed version buckets
    [junit4] 2> 1749182 INFO (coreLoadExecutor-5533-thread-1-processing-n:127.0.0.1:55014_) [n:127.0.0.1:55014_ c:control_collection s:shard1 r:core_node1 x:collection1] o.a.s.u.VersionInfo Refreshing highest value of _version_ for 65536 version buckets from index
    [junit4] 2> 1749182 INFO (coreLoadExecutor-5533-thread-1-processing-n:127.0.0.1:55014_) [n:127.0.0.1:55014_ c:control_collection s:shard1 r:core_node1 x:collection1] o.a.s.u.VersionInfo No terms found for _version_, cannot seed version bucket highest value from index
    [junit4] 2> 1749182 INFO (coreLoadExecutor-5533-thread-1-processing-n:127.0.0.1:55014_) [n:127.0.0.1:55014_ c:control_collection s:shard1 r:core_node1 x:collection1] o.a.s.u.UpdateLog Could not find max version in index or recent updates, using new clock 1537445437516021760
    [junit4] 2> 1749184 INFO (coreLoadExecutor-5533-thread-1-processing-n:127.0.0.1:55014_) [n:127.0.0.1:55014_ c:control_collection s:shard1 r:core_node1 x:collection1] o.a.s.u.UpdateLog Took 2.0ms to seed version buckets with highest version 1537445437516021760
    [junit4] 2> 1749185 INFO (coreLoadExecutor-5533-thread-1-processing-n:127.0.0.1:55014_) [n:127.0.0.1:55014_ c:control_collection s:shard1 r:core_node1 x:collection1] o.a.s.c.ZkController watch zkdir /configs/conf1
    [junit4] 2> 1749185 INFO (coreLoadExecutor-5533-thread-1-processing-n:127.0.0.1:55014_) [n:127.0.0.1:55014_ c:control_collection s:shard1 r:core_node1 x:collection1] o.a.s.c.CoreContainer registering core: collection1
    [junit4] 2> 1749186 INFO (coreZkRegister-5527-thread-1-processing-n:127.0.0.1:55014_ x:collection1 s:shard1 c:control_collection r:core_node1) [n:127.0.0.1:55014_ c:control_collection s:shard1 r:core_node1 x:collection1] o.a.s.c.ZkController Register replica - core:collection1 address:https://127.0.0.1:55014 collection:control_collection shard:shard1
    [junit4] 2> 1749188 INFO (coreZkRegister-5527-thread-1-processing-n:127.0.0.1:55014_ x:collection1 s:shard1 c:control_collection r:core_node1) [n:127.0.0.1:55014_ c:control_collection s:shard1 r:core_node1 x:collection1] o.a.s.c.c.SolrZkClient makePath: /collections/control_collection/leader_elect/shard1/election
    [junit4] 2> 1749196 INFO (coreZkRegister-5527-thread-1-processing-n:127.0.0.1:55014_ x:collection1 s:shard1 c:control_collection r:core_node1) [n:127.0.0.1:55014_ c:control_collection s:shard1 r:core_node1 x:collection1] o.a.s.c.LeaderElector Joined leadership election with path: /collections/control_collection/leader_elect/shard1/election/96090339624288263-core_node1-n_0000000000
    [junit4] 2> 1749197 INFO (coreZkRegister-5527-thread-1-processing-n:127.0.0.1:55014_ x:collection1 s:shard1 c:control_collection r:core_node1) [n:127.0.0.1:55014_ c:control_collection s:shard1 r:core_node1 x:collection1] o.a.s.c.ShardLeaderElectionContext Running the leader process for shard=shard1 and weAreReplacement=false and leaderVoteWait=180000
    [junit4] 2> 1749200 INFO (coreZkRegister-5527-thread-1-processing-n:127.0.0.1:55014_ x:collection1 s:shard1 c:control_collection r:core_node1) [n:127.0.0.1:55014_ c:control_collection s:shard1 r:core_node1 x:collection1] o.a.s.c.ShardLeaderElectionContext Enough replicas found to continue.
    [junit4] 2> 1749200 INFO (coreZkRegister-5527-thread-1-processing-n:127.0.0.1:55014_ x:collection1 s:shard1 c:control_collection r:core_node1) [n:127.0.0.1:55014_ c:control_collection s:shard1 r:core_node1 x:collection1] o.a.s.c.ShardLeaderElectionContext I may be the new leader - try and sync
    [junit4] 2> 1749200 INFO (coreZkRegister-5527-thread-1-processing-n:127.0.0.1:55014_ x:collection1 s:shard1 c:control_collection r:core_node1) [n:127.0.0.1:55014_ c:control_collection s:shard1 r:core_node1 x:collection1] o.a.s.c.SyncStrategy Sync replicas to https://127.0.0.1:55014/collection1/
    [junit4] 2> 1749200 INFO (coreZkRegister-5527-thread-1-processing-n:127.0.0.1:55014_ x:collection1 s:shard1 c:control_collection r:core_node1) [n:127.0.0.1:55014_ c:control_collection s:shard1 r:core_node1 x:collection1] o.a.s.c.SyncStrategy Sync Success - now sync replicas to me
    [junit4] 2> 1749200 INFO (coreZkRegister-5527-thread-1-processing-n:127.0.0.1:55014_ x:collection1 s:shard1 c:control_collection r:core_node1) [n:127.0.0.1:55014_ c:control_collection s:shard1 r:core_node1 x:collection1] o.a.s.c.SyncStrategy https://127.0.0.1:55014/collection1/ has no replicas
    [junit4] 2> 1749200 INFO (OverseerStateUpdate-96090339624288263-127.0.0.1:55014_-n_0000000000) [n:127.0.0.1:55014_ ] o.a.s.c.Overseer processMessage: queueSize: 1, message = {
    [junit4] 2> "operation":"leader",
    [junit4] 2> "shard":"shard1",
    [junit4] 2> "collection":"control_collection"} current state version: 1
    [junit4] 2> 1749202 INFO (coreZkRegister-5527-thread-1-processing-n:127.0.0.1:55014_ x:collection1 s:shard1 c:control_collection r:core_node1) [n:127.0.0.1:55014_ c:control_collection s:shard1 r:core_node1 x:collection1] o.a.s.c.c.SolrZkClient makePath: /collections/control_collection/leaders/shard1
    [junit4] 2> 1749207 INFO (coreZkRegister-5527-thread-1-processing-n:127.0.0.1:55014_ x:collection1 s:shard1 c:control_collection r:core_node1) [n:127.0.0.1:55014_ c:control_collection s:shard1 r:core_node1 x:collection1] o.a.s.c.ShardLeaderElectionContextBase Creating leader registration node /collections/control_collection/leaders/shard1/leader after winning as /collections/control_collection/leader_elect/shard1/election/96090339624288263-core_node1-n_0000000000
    [junit4] 2> 1749211 INFO (coreZkRegister-5527-thread-1-processing-n:127.0.0.1:55014_ x:collection1 s:shard1 c:control_collection r:core_node1) [n:127.0.0.1:55014_ c:control_collection s:shard1 r:core_node1 x:collection1] o.a.s.c.ShardLeaderElectionContext I am the new leader: https://127.0.0.1:55014/collection1/ shard1
    [junit4] 2> 1749212 INFO (OverseerStateUpdate-96090339624288263-127.0.0.1:55014_-n_0000000000) [n:127.0.0.1:55014_ ] o.a.s.c.Overseer processMessage: queueSize: 1, message = {
    [junit4] 2> "operation":"leader",
    [junit4] 2> "shard":"shard1",
    [junit4] 2> "collection":"control_collection",
    [junit4] 2> "base_url":"https:

[...truncated too long message...]

oolExecutor.java:1127)
    [junit4] > at java.util.concurrent.ThreadPoolExecutor$Worker.run(ThreadPoolExecutor.java:617)
    [junit4] > at java.lang.Thread.run(Thread.java:745)
    [junit4] > 3) Thread[id=13270, name=zkCallback-2028-thread-4, state=TIMED_WAITING, group=TGRP-CollectionsAPIDistributedZkTest]
    [junit4] > at sun.misc.Unsafe.park(Native Method)
    [junit4] > at java.util.concurrent.locks.LockSupport.parkNanos(LockSupport.java:215)
    [junit4] > at java.util.concurrent.SynchronousQueue$TransferStack.awaitFulfill(SynchronousQueue.java:460)
    [junit4] > at java.util.concurrent.SynchronousQueue$TransferStack.transfer(SynchronousQueue.java:362)
    [junit4] > at java.util.concurrent.SynchronousQueue.poll(SynchronousQueue.java:941)
    [junit4] > at java.util.concurrent.ThreadPoolExecutor.getTask(ThreadPoolExecutor.java:1066)
    [junit4] > at java.util.concurrent.ThreadPoolExecutor.runWorker(ThreadPoolExecutor.java:1127)
    [junit4] > at java.util.concurrent.ThreadPoolExecutor$Worker.run(ThreadPoolExecutor.java:617)
    [junit4] > at java.lang.Thread.run(Thread.java:745)
    [junit4] > 4) Thread[id=13143, name=TEST-CollectionsAPIDistributedZkTest.test-seed#[7CEC55EDA2CDFB13]-EventThread, state=WAITING, group=TGRP-CollectionsAPIDistributedZkTest]
    [junit4] > at sun.misc.Unsafe.park(Native Method)
    [junit4] > at java.util.concurrent.locks.LockSupport.park(LockSupport.java:175)
    [junit4] > at java.util.concurrent.locks.AbstractQueuedSynchronizer$ConditionObject.await(AbstractQueuedSynchronizer.java:2039)
    [junit4] > at java.util.concurrent.LinkedBlockingQueue.take(LinkedBlockingQueue.java:442)
    [junit4] > at org.apache.zookeeper.ClientCnxn$EventThread.run(ClientCnxn.java:494)
    [junit4] > 5) Thread[id=13141, name=Connection evictor, state=TIMED_WAITING, group=TGRP-CollectionsAPIDistributedZkTest]
    [junit4] > at java.lang.Thread.sleep(Native Method)
    [junit4] > at org.apache.http.impl.client.IdleConnectionEvictor$1.run(IdleConnectionEvictor.java:66)
    [junit4] > at java.lang.Thread.run(Thread.java:745)
    [junit4] > 6) Thread[id=13142, name=TEST-CollectionsAPIDistributedZkTest.test-seed#[7CEC55EDA2CDFB13]-SendThread(127.0.0.1:55008), state=TIMED_WAITING, group=TGRP-CollectionsAPIDistributedZkTest]
    [junit4] > at java.lang.Thread.sleep(Native Method)
    [junit4] > at org.apache.zookeeper.ClientCnxn$SendThread.run(ClientCnxn.java:994)
    [junit4] > 7) Thread[id=13224, name=zkCallback-2028-thread-2, state=TIMED_WAITING, group=TGRP-CollectionsAPIDistributedZkTest]
    [junit4] > at sun.misc.Unsafe.park(Native Method)
    [junit4] > at java.util.concurrent.locks.LockSupport.parkNanos(LockSupport.java:215)
    [junit4] > at java.util.concurrent.SynchronousQueue$TransferStack.awaitFulfill(SynchronousQueue.java:460)
    [junit4] > at java.util.concurrent.SynchronousQueue$TransferStack.transfer(SynchronousQueue.java:362)
    [junit4] > at java.util.concurrent.SynchronousQueue.poll(SynchronousQueue.java:941)
    [junit4] > at java.util.concurrent.ThreadPoolExecutor.getTask(ThreadPoolExecutor.java:1066)
    [junit4] > at java.util.concurrent.ThreadPoolExecutor.runWorker(ThreadPoolExecutor.java:1127)
    [junit4] > at java.util.concurrent.ThreadPoolExecutor$Worker.run(ThreadPoolExecutor.java:617)
    [junit4] > at java.lang.Thread.run(Thread.java:745)
    [junit4] > at __randomizedtesting.SeedInfo.seed([7CEC55EDA2CDFB13]:0)Throwable #2: com.carrotsearch.randomizedtesting.ThreadLeakError: There are still zombie threads that couldn't be terminated:
    [junit4] > 1) Thread[id=13269, name=zkCallback-2028-thread-3, state=TIMED_WAITING, group=TGRP-CollectionsAPIDistributedZkTest]
    [junit4] > at sun.misc.Unsafe.park(Native Method)
    [junit4] > at java.util.concurrent.locks.LockSupport.parkNanos(LockSupport.java:215)
    [junit4] > at java.util.concurrent.SynchronousQueue$TransferStack.awaitFulfill(SynchronousQueue.java:460)
    [junit4] > at java.util.concurrent.SynchronousQueue$TransferStack.transfer(SynchronousQueue.java:362)
    [junit4] > at java.util.concurrent.SynchronousQueue.poll(SynchronousQueue.java:941)
    [junit4] > at java.util.concurrent.ThreadPoolExecutor.getTask(ThreadPoolExecutor.java:1066)
    [junit4] > at java.util.concurrent.ThreadPoolExecutor.runWorker(ThreadPoolExecutor.java:1127)
    [junit4] > at java.util.concurrent.ThreadPoolExecutor$Worker.run(ThreadPoolExecutor.java:617)
    [junit4] > at java.lang.Thread.run(Thread.java:745)
    [junit4] > 2) Thread[id=13144, name=zkCallback-2028-thread-1, state=TIMED_WAITING, group=TGRP-CollectionsAPIDistributedZkTest]
    [junit4] > at sun.misc.Unsafe.park(Native Method)
    [junit4] > at java.util.concurrent.locks.LockSupport.parkNanos(LockSupport.java:215)
    [junit4] > at java.util.concurrent.SynchronousQueue$TransferStack.awaitFulfill(SynchronousQueue.java:460)
    [junit4] > at java.util.concurrent.SynchronousQueue$TransferStack.transfer(SynchronousQueue.java:362)
    [junit4] > at java.util.concurrent.SynchronousQueue.poll(SynchronousQueue.java:941)
    [junit4] > at java.util.concurrent.ThreadPoolExecutor.getTask(ThreadPoolExecutor.java:1066)
    [junit4] > at java.util.concurrent.ThreadPoolExecutor.runWorker(ThreadPoolExecutor.java:1127)
    [junit4] > at java.util.concurrent.ThreadPoolExecutor$Worker.run(ThreadPoolExecutor.java:617)
    [junit4] > at java.lang.Thread.run(Thread.java:745)
    [junit4] > 3) Thread[id=13270, name=zkCallback-2028-thread-4, state=TIMED_WAITING, group=TGRP-CollectionsAPIDistributedZkTest]
    [junit4] > at sun.misc.Unsafe.park(Native Method)
    [junit4] > at java.util.concurrent.locks.LockSupport.parkNanos(LockSupport.java:215)
    [junit4] > at java.util.concurrent.SynchronousQueue$TransferStack.awaitFulfill(SynchronousQueue.java:460)
    [junit4] > at java.util.concurrent.SynchronousQueue$TransferStack.transfer(SynchronousQueue.java:362)
    [junit4] > at java.util.concurrent.SynchronousQueue.poll(SynchronousQueue.java:941)
    [junit4] > at java.util.concurrent.ThreadPoolExecutor.getTask(ThreadPoolExecutor.java:1066)
    [junit4] > at java.util.concurrent.ThreadPoolExecutor.runWorker(ThreadPoolExecutor.java:1127)
    [junit4] > at java.util.concurrent.ThreadPoolExecutor$Worker.run(ThreadPoolExecutor.java:617)
    [junit4] > at java.lang.Thread.run(Thread.java:745)
    [junit4] > 4) Thread[id=13142, name=TEST-CollectionsAPIDistributedZkTest.test-seed#[7CEC55EDA2CDFB13]-SendThread(127.0.0.1:55008), state=TIMED_WAITING, group=TGRP-CollectionsAPIDistributedZkTest]
    [junit4] > at java.lang.Thread.sleep(Native Method)
    [junit4] > at org.apache.zookeeper.client.StaticHostProvider.next(StaticHostProvider.java:101)
    [junit4] > at org.apache.zookeeper.ClientCnxn$SendThread.startConnect(ClientCnxn.java:940)
    [junit4] > at org.apache.zookeeper.ClientCnxn$SendThread.run(ClientCnxn.java:1003)
    [junit4] > 5) Thread[id=13224, name=zkCallback-2028-thread-2, state=TIMED_WAITING, group=TGRP-CollectionsAPIDistributedZkTest]
    [junit4] > at sun.misc.Unsafe.park(Native Method)
    [junit4] > at java.util.concurrent.locks.LockSupport.parkNanos(LockSupport.java:215)
    [junit4] > at java.util.concurrent.SynchronousQueue$TransferStack.awaitFulfill(SynchronousQueue.java:460)
    [junit4] > at java.util.concurrent.SynchronousQueue$TransferStack.transfer(SynchronousQueue.java:362)
    [junit4] > at java.util.concurrent.SynchronousQueue.poll(SynchronousQueue.java:941)
    [junit4] > at java.util.concurrent.ThreadPoolExecutor.getTask(ThreadPoolExecutor.java:1066)
    [junit4] > at java.util.concurrent.ThreadPoolExecutor.runWorker(ThreadPoolExecutor.java:1127)
    [junit4] > at java.util.concurrent.ThreadPoolExecutor$Worker.run(ThreadPoolExecutor.java:617)
    [junit4] > at java.lang.Thread.run(Thread.java:745)
    [junit4] > at __randomizedtesting.SeedInfo.seed([7CEC55EDA2CDFB13]:0)
    [junit4] Completed [309/614 (1!)] on J0 in 115.54s, 1 test, 3 errors <<< FAILURES!

[...truncated 1009 lines...]
BUILD FAILED
/Users/jenkins/workspace/Lucene-Solr-master-MacOSX/build.xml:740: The following error occurred while executing this line:
/Users/jenkins/workspace/Lucene-Solr-master-MacOSX/build.xml:684: The following error occurred while executing this line:
/Users/jenkins/workspace/Lucene-Solr-master-MacOSX/build.xml:59: The following error occurred while executing this line:
/Users/jenkins/workspace/Lucene-Solr-master-MacOSX/solr/build.xml:233: The following error occurred while executing this line:
/Users/jenkins/workspace/Lucene-Solr-master-MacOSX/solr/common-build.xml:531: The following error occurred while executing this line:
/Users/jenkins/workspace/Lucene-Solr-master-MacOSX/lucene/common-build.xml:1427: The following error occurred while executing this line:
/Users/jenkins/workspace/Lucene-Solr-master-MacOSX/lucene/common-build.xml:984: There were test failures: 614 suites (10 ignored), 2584 tests, 2 suite-level errors, 1 error, 1135 ignored (63 assumptions) [seed: 7CEC55EDA2CDFB13]

Total time: 58 minutes 34 seconds
Build step 'Invoke Ant' marked build as failure
Archiving artifacts
[WARNINGS] Skipping publisher since build result is FAILURE
Recording test results
Email was triggered for: Failure - Any
Sending email for trigger: Failure - Any

Search Discussions

Related Discussions

Discussion Navigation
viewthread | post
posts ‹ prev | 1 of 1 | next ›
Discussion Overview
groupdev @
categorieslucene
postedJun 18, '16 at 4:01a
activeJun 18, '16 at 4:01a
posts1
users1
websitelucene.apache.org

1 user in discussion

Policeman Jenkins Server: 1 post

People

Translate

site design / logo © 2017 Grokbase