Grokbase Groups Lucene dev June 2016
FAQ
Build: http://jenkins.thetaphi.de/job/Lucene-Solr-master-Windows/5918/
Java: 32bit/jdk1.8.0_92 -client -XX:+UseSerialGC

2 tests failed.
FAILED: junit.framework.TestSuite.org.apache.solr.schema.TestManagedSchemaAPI

Error Message:
ObjectTracker found 8 object(s) that were not released!!! [MockDirectoryWrapper, MockDirectoryWrapper, MockDirectoryWrapper, MockDirectoryWrapper, MDCAwareThreadPoolExecutor, TransactionLog, MDCAwareThreadPoolExecutor, TransactionLog]

Stack Trace:
java.lang.AssertionError: ObjectTracker found 8 object(s) that were not released!!! [MockDirectoryWrapper, MockDirectoryWrapper, MockDirectoryWrapper, MockDirectoryWrapper, MDCAwareThreadPoolExecutor, TransactionLog, MDCAwareThreadPoolExecutor, TransactionLog]
  at __randomizedtesting.SeedInfo.seed([ECF6C003A73DEE0A]:0)
  at org.junit.Assert.fail(Assert.java:93)
  at org.junit.Assert.assertTrue(Assert.java:43)
  at org.junit.Assert.assertNull(Assert.java:551)
  at org.apache.solr.SolrTestCaseJ4.teardownTestCases(SolrTestCaseJ4.java:256)
  at sun.reflect.GeneratedMethodAccessor17.invoke(Unknown Source)
  at sun.reflect.DelegatingMethodAccessorImpl.invoke(DelegatingMethodAccessorImpl.java:43)
  at java.lang.reflect.Method.invoke(Method.java:498)
  at com.carrotsearch.randomizedtesting.RandomizedRunner.invoke(RandomizedRunner.java:1764)
  at com.carrotsearch.randomizedtesting.RandomizedRunner$7.evaluate(RandomizedRunner.java:834)
  at com.carrotsearch.randomizedtesting.rules.StatementAdapter.evaluate(StatementAdapter.java:36)
  at com.carrotsearch.randomizedtesting.rules.SystemPropertiesRestoreRule$1.evaluate(SystemPropertiesRestoreRule.java:57)
  at org.apache.lucene.util.AbstractBeforeAfterRule$1.evaluate(AbstractBeforeAfterRule.java:45)
  at com.carrotsearch.randomizedtesting.rules.StatementAdapter.evaluate(StatementAdapter.java:36)
  at org.apache.lucene.util.TestRuleStoreClassName$1.evaluate(TestRuleStoreClassName.java:41)
  at com.carrotsearch.randomizedtesting.rules.NoShadowingOrOverridesOnMethodsRule$1.evaluate(NoShadowingOrOverridesOnMethodsRule.java:40)
  at com.carrotsearch.randomizedtesting.rules.NoShadowingOrOverridesOnMethodsRule$1.evaluate(NoShadowingOrOverridesOnMethodsRule.java:40)
  at com.carrotsearch.randomizedtesting.rules.StatementAdapter.evaluate(StatementAdapter.java:36)
  at com.carrotsearch.randomizedtesting.rules.StatementAdapter.evaluate(StatementAdapter.java:36)
  at com.carrotsearch.randomizedtesting.rules.StatementAdapter.evaluate(StatementAdapter.java:36)
  at org.apache.lucene.util.TestRuleAssertionsRequired$1.evaluate(TestRuleAssertionsRequired.java:53)
  at org.apache.lucene.util.TestRuleMarkFailure$1.evaluate(TestRuleMarkFailure.java:47)
  at org.apache.lucene.util.TestRuleIgnoreAfterMaxFailures$1.evaluate(TestRuleIgnoreAfterMaxFailures.java:64)
  at org.apache.lucene.util.TestRuleIgnoreTestSuites$1.evaluate(TestRuleIgnoreTestSuites.java:54)
  at com.carrotsearch.randomizedtesting.rules.StatementAdapter.evaluate(StatementAdapter.java:36)
  at com.carrotsearch.randomizedtesting.ThreadLeakControl$StatementRunner.run(ThreadLeakControl.java:367)
  at java.lang.Thread.run(Thread.java:745)


FAILED: junit.framework.TestSuite.org.apache.solr.schema.TestManagedSchemaAPI

Error Message:
Could not remove the following files (in the order of attempts): C:\Users\jenkins\workspace\Lucene-Solr-master-Windows\solr\build\solr-core\test\J0\temp\solr.schema.TestManagedSchemaAPI_ECF6C003A73DEE0A-001\tempDir-001\node1\testschemaapi_shard1_replica2\data\tlog\tlog.0000000000000000000: java.nio.file.FileSystemException: C:\Users\jenkins\workspace\Lucene-Solr-master-Windows\solr\build\solr-core\test\J0\temp\solr.schema.TestManagedSchemaAPI_ECF6C003A73DEE0A-001\tempDir-001\node1\testschemaapi_shard1_replica2\data\tlog\tlog.0000000000000000000: The process cannot access the file because it is being used by another process. C:\Users\jenkins\workspace\Lucene-Solr-master-Windows\solr\build\solr-core\test\J0\temp\solr.schema.TestManagedSchemaAPI_ECF6C003A73DEE0A-001\tempDir-001\node1\testschemaapi_shard1_replica2\data\tlog: java.nio.file.DirectoryNotEmptyException: C:\Users\jenkins\workspace\Lucene-Solr-master-Windows\solr\build\solr-core\test\J0\temp\solr.schema.TestManagedSchemaAPI_ECF6C003A73DEE0A-001\tempDir-001\node1\testschemaapi_shard1_replica2\data\tlog C:\Users\jenkins\workspace\Lucene-Solr-master-Windows\solr\build\solr-core\test\J0\temp\solr.schema.TestManagedSchemaAPI_ECF6C003A73DEE0A-001\tempDir-001\node1\testschemaapi_shard1_replica2\data: java.nio.file.DirectoryNotEmptyException: C:\Users\jenkins\workspace\Lucene-Solr-master-Windows\solr\build\solr-core\test\J0\temp\solr.schema.TestManagedSchemaAPI_ECF6C003A73DEE0A-001\tempDir-001\node1\testschemaapi_shard1_replica2\data C:\Users\jenkins\workspace\Lucene-Solr-master-Windows\solr\build\solr-core\test\J0\temp\solr.schema.TestManagedSchemaAPI_ECF6C003A73DEE0A-001\tempDir-001\node1\testschemaapi_shard1_replica2: java.nio.file.DirectoryNotEmptyException: C:\Users\jenkins\workspace\Lucene-Solr-master-Windows\solr\build\solr-core\test\J0\temp\solr.schema.TestManagedSchemaAPI_ECF6C003A73DEE0A-001\tempDir-001\node1\testschemaapi_shard1_replica2 C:\Users\jenkins\workspace\Lucene-Solr-master-Windows\solr\build\solr-core\test\J0\temp\solr.schema.TestManagedSchemaAPI_ECF6C003A73DEE0A-001\tempDir-001\node1: java.nio.file.DirectoryNotEmptyException: C:\Users\jenkins\workspace\Lucene-Solr-master-Windows\solr\build\solr-core\test\J0\temp\solr.schema.TestManagedSchemaAPI_ECF6C003A73DEE0A-001\tempDir-001\node1 C:\Users\jenkins\workspace\Lucene-Solr-master-Windows\solr\build\solr-core\test\J0\temp\solr.schema.TestManagedSchemaAPI_ECF6C003A73DEE0A-001\tempDir-001\node2\testschemaapi_shard1_replica1\data\tlog\tlog.0000000000000000001: java.nio.file.FileSystemException: C:\Users\jenkins\workspace\Lucene-Solr-master-Windows\solr\build\solr-core\test\J0\temp\solr.schema.TestManagedSchemaAPI_ECF6C003A73DEE0A-001\tempDir-001\node2\testschemaapi_shard1_replica1\data\tlog\tlog.0000000000000000001: The process cannot access the file because it is being used by another process. C:\Users\jenkins\workspace\Lucene-Solr-master-Windows\solr\build\solr-core\test\J0\temp\solr.schema.TestManagedSchemaAPI_ECF6C003A73DEE0A-001\tempDir-001\node2\testschemaapi_shard1_replica1\data\tlog: java.nio.file.DirectoryNotEmptyException: C:\Users\jenkins\workspace\Lucene-Solr-master-Windows\solr\build\solr-core\test\J0\temp\solr.schema.TestManagedSchemaAPI_ECF6C003A73DEE0A-001\tempDir-001\node2\testschemaapi_shard1_replica1\data\tlog C:\Users\jenkins\workspace\Lucene-Solr-master-Windows\solr\build\solr-core\test\J0\temp\solr.schema.TestManagedSchemaAPI_ECF6C003A73DEE0A-001\tempDir-001\node2\testschemaapi_shard1_replica1\data: java.nio.file.DirectoryNotEmptyException: C:\Users\jenkins\workspace\Lucene-Solr-master-Windows\solr\build\solr-core\test\J0\temp\solr.schema.TestManagedSchemaAPI_ECF6C003A73DEE0A-001\tempDir-001\node2\testschemaapi_shard1_replica1\data C:\Users\jenkins\workspace\Lucene-Solr-master-Windows\solr\build\solr-core\test\J0\temp\solr.schema.TestManagedSchemaAPI_ECF6C003A73DEE0A-001\tempDir-001\node2\testschemaapi_shard1_replica1: java.nio.file.DirectoryNotEmptyException: C:\Users\jenkins\workspace\Lucene-Solr-master-Windows\solr\build\solr-core\test\J0\temp\solr.schema.TestManagedSchemaAPI_ECF6C003A73DEE0A-001\tempDir-001\node2\testschemaapi_shard1_replica1 C:\Users\jenkins\workspace\Lucene-Solr-master-Windows\solr\build\solr-core\test\J0\temp\solr.schema.TestManagedSchemaAPI_ECF6C003A73DEE0A-001\tempDir-001\node2: java.nio.file.DirectoryNotEmptyException: C:\Users\jenkins\workspace\Lucene-Solr-master-Windows\solr\build\solr-core\test\J0\temp\solr.schema.TestManagedSchemaAPI_ECF6C003A73DEE0A-001\tempDir-001\node2 C:\Users\jenkins\workspace\Lucene-Solr-master-Windows\solr\build\solr-core\test\J0\temp\solr.schema.TestManagedSchemaAPI_ECF6C003A73DEE0A-001\tempDir-001: java.nio.file.DirectoryNotEmptyException: C:\Users\jenkins\workspace\Lucene-Solr-master-Windows\solr\build\solr-core\test\J0\temp\solr.schema.TestManagedSchemaAPI_ECF6C003A73DEE0A-001\tempDir-001 C:\Users\jenkins\workspace\Lucene-Solr-master-Windows\solr\build\solr-core\test\J0\temp\solr.schema.TestManagedSchemaAPI_ECF6C003A73DEE0A-001: java.nio.file.DirectoryNotEmptyException: C:\Users\jenkins\workspace\Lucene-Solr-master-Windows\solr\build\solr-core\test\J0\temp\solr.schema.TestManagedSchemaAPI_ECF6C003A73DEE0A-001

Stack Trace:
java.io.IOException: Could not remove the following files (in the order of attempts):
    C:\Users\jenkins\workspace\Lucene-Solr-master-Windows\solr\build\solr-core\test\J0\temp\solr.schema.TestManagedSchemaAPI_ECF6C003A73DEE0A-001\tempDir-001\node1\testschemaapi_shard1_replica2\data\tlog\tlog.0000000000000000000: java.nio.file.FileSystemException: C:\Users\jenkins\workspace\Lucene-Solr-master-Windows\solr\build\solr-core\test\J0\temp\solr.schema.TestManagedSchemaAPI_ECF6C003A73DEE0A-001\tempDir-001\node1\testschemaapi_shard1_replica2\data\tlog\tlog.0000000000000000000: The process cannot access the file because it is being used by another process.

    C:\Users\jenkins\workspace\Lucene-Solr-master-Windows\solr\build\solr-core\test\J0\temp\solr.schema.TestManagedSchemaAPI_ECF6C003A73DEE0A-001\tempDir-001\node1\testschemaapi_shard1_replica2\data\tlog: java.nio.file.DirectoryNotEmptyException: C:\Users\jenkins\workspace\Lucene-Solr-master-Windows\solr\build\solr-core\test\J0\temp\solr.schema.TestManagedSchemaAPI_ECF6C003A73DEE0A-001\tempDir-001\node1\testschemaapi_shard1_replica2\data\tlog
    C:\Users\jenkins\workspace\Lucene-Solr-master-Windows\solr\build\solr-core\test\J0\temp\solr.schema.TestManagedSchemaAPI_ECF6C003A73DEE0A-001\tempDir-001\node1\testschemaapi_shard1_replica2\data: java.nio.file.DirectoryNotEmptyException: C:\Users\jenkins\workspace\Lucene-Solr-master-Windows\solr\build\solr-core\test\J0\temp\solr.schema.TestManagedSchemaAPI_ECF6C003A73DEE0A-001\tempDir-001\node1\testschemaapi_shard1_replica2\data
    C:\Users\jenkins\workspace\Lucene-Solr-master-Windows\solr\build\solr-core\test\J0\temp\solr.schema.TestManagedSchemaAPI_ECF6C003A73DEE0A-001\tempDir-001\node1\testschemaapi_shard1_replica2: java.nio.file.DirectoryNotEmptyException: C:\Users\jenkins\workspace\Lucene-Solr-master-Windows\solr\build\solr-core\test\J0\temp\solr.schema.TestManagedSchemaAPI_ECF6C003A73DEE0A-001\tempDir-001\node1\testschemaapi_shard1_replica2
    C:\Users\jenkins\workspace\Lucene-Solr-master-Windows\solr\build\solr-core\test\J0\temp\solr.schema.TestManagedSchemaAPI_ECF6C003A73DEE0A-001\tempDir-001\node1: java.nio.file.DirectoryNotEmptyException: C:\Users\jenkins\workspace\Lucene-Solr-master-Windows\solr\build\solr-core\test\J0\temp\solr.schema.TestManagedSchemaAPI_ECF6C003A73DEE0A-001\tempDir-001\node1
    C:\Users\jenkins\workspace\Lucene-Solr-master-Windows\solr\build\solr-core\test\J0\temp\solr.schema.TestManagedSchemaAPI_ECF6C003A73DEE0A-001\tempDir-001\node2\testschemaapi_shard1_replica1\data\tlog\tlog.0000000000000000001: java.nio.file.FileSystemException: C:\Users\jenkins\workspace\Lucene-Solr-master-Windows\solr\build\solr-core\test\J0\temp\solr.schema.TestManagedSchemaAPI_ECF6C003A73DEE0A-001\tempDir-001\node2\testschemaapi_shard1_replica1\data\tlog\tlog.0000000000000000001: The process cannot access the file because it is being used by another process.

    C:\Users\jenkins\workspace\Lucene-Solr-master-Windows\solr\build\solr-core\test\J0\temp\solr.schema.TestManagedSchemaAPI_ECF6C003A73DEE0A-001\tempDir-001\node2\testschemaapi_shard1_replica1\data\tlog: java.nio.file.DirectoryNotEmptyException: C:\Users\jenkins\workspace\Lucene-Solr-master-Windows\solr\build\solr-core\test\J0\temp\solr.schema.TestManagedSchemaAPI_ECF6C003A73DEE0A-001\tempDir-001\node2\testschemaapi_shard1_replica1\data\tlog
    C:\Users\jenkins\workspace\Lucene-Solr-master-Windows\solr\build\solr-core\test\J0\temp\solr.schema.TestManagedSchemaAPI_ECF6C003A73DEE0A-001\tempDir-001\node2\testschemaapi_shard1_replica1\data: java.nio.file.DirectoryNotEmptyException: C:\Users\jenkins\workspace\Lucene-Solr-master-Windows\solr\build\solr-core\test\J0\temp\solr.schema.TestManagedSchemaAPI_ECF6C003A73DEE0A-001\tempDir-001\node2\testschemaapi_shard1_replica1\data
    C:\Users\jenkins\workspace\Lucene-Solr-master-Windows\solr\build\solr-core\test\J0\temp\solr.schema.TestManagedSchemaAPI_ECF6C003A73DEE0A-001\tempDir-001\node2\testschemaapi_shard1_replica1: java.nio.file.DirectoryNotEmptyException: C:\Users\jenkins\workspace\Lucene-Solr-master-Windows\solr\build\solr-core\test\J0\temp\solr.schema.TestManagedSchemaAPI_ECF6C003A73DEE0A-001\tempDir-001\node2\testschemaapi_shard1_replica1
    C:\Users\jenkins\workspace\Lucene-Solr-master-Windows\solr\build\solr-core\test\J0\temp\solr.schema.TestManagedSchemaAPI_ECF6C003A73DEE0A-001\tempDir-001\node2: java.nio.file.DirectoryNotEmptyException: C:\Users\jenkins\workspace\Lucene-Solr-master-Windows\solr\build\solr-core\test\J0\temp\solr.schema.TestManagedSchemaAPI_ECF6C003A73DEE0A-001\tempDir-001\node2
    C:\Users\jenkins\workspace\Lucene-Solr-master-Windows\solr\build\solr-core\test\J0\temp\solr.schema.TestManagedSchemaAPI_ECF6C003A73DEE0A-001\tempDir-001: java.nio.file.DirectoryNotEmptyException: C:\Users\jenkins\workspace\Lucene-Solr-master-Windows\solr\build\solr-core\test\J0\temp\solr.schema.TestManagedSchemaAPI_ECF6C003A73DEE0A-001\tempDir-001
    C:\Users\jenkins\workspace\Lucene-Solr-master-Windows\solr\build\solr-core\test\J0\temp\solr.schema.TestManagedSchemaAPI_ECF6C003A73DEE0A-001: java.nio.file.DirectoryNotEmptyException: C:\Users\jenkins\workspace\Lucene-Solr-master-Windows\solr\build\solr-core\test\J0\temp\solr.schema.TestManagedSchemaAPI_ECF6C003A73DEE0A-001

  at org.apache.lucene.util.IOUtils.rm(IOUtils.java:323)
  at org.apache.lucene.util.TestRuleTemporaryFilesCleanup.afterAlways(TestRuleTemporaryFilesCleanup.java:216)
  at com.carrotsearch.randomizedtesting.rules.TestRuleAdapter$1.afterAlways(TestRuleAdapter.java:31)
  at com.carrotsearch.randomizedtesting.rules.StatementAdapter.evaluate(StatementAdapter.java:43)
  at com.carrotsearch.randomizedtesting.rules.StatementAdapter.evaluate(StatementAdapter.java:36)
  at org.apache.lucene.util.TestRuleAssertionsRequired$1.evaluate(TestRuleAssertionsRequired.java:53)
  at org.apache.lucene.util.TestRuleMarkFailure$1.evaluate(TestRuleMarkFailure.java:47)
  at org.apache.lucene.util.TestRuleIgnoreAfterMaxFailures$1.evaluate(TestRuleIgnoreAfterMaxFailures.java:64)
  at org.apache.lucene.util.TestRuleIgnoreTestSuites$1.evaluate(TestRuleIgnoreTestSuites.java:54)
  at com.carrotsearch.randomizedtesting.rules.StatementAdapter.evaluate(StatementAdapter.java:36)
  at com.carrotsearch.randomizedtesting.ThreadLeakControl$StatementRunner.run(ThreadLeakControl.java:367)
  at java.lang.Thread.run(Thread.java:745)




Build Log:
[...truncated 10759 lines...]
    [junit4] Suite: org.apache.solr.schema.TestManagedSchemaAPI
    [junit4] 2> Creating dataDir: C:\Users\jenkins\workspace\Lucene-Solr-master-Windows\solr\build\solr-core\test\J0\temp\solr.schema.TestManagedSchemaAPI_ECF6C003A73DEE0A-001\init-core-data-001
    [junit4] 2> 282221 INFO (SUITE-TestManagedSchemaAPI-seed#[ECF6C003A73DEE0A]-worker) [ ] o.a.s.SolrTestCaseJ4 Randomized ssl (false) and clientAuth (false) via: @org.apache.solr.util.RandomizeSSL(reason=, value=NaN, ssl=NaN, clientAuth=NaN)
    [junit4] 2> 282223 INFO (SUITE-TestManagedSchemaAPI-seed#[ECF6C003A73DEE0A]-worker) [ ] o.a.s.c.ZkTestServer STARTING ZK TEST SERVER
    [junit4] 2> 282223 INFO (Thread-565) [ ] o.a.s.c.ZkTestServer client port:0.0.0.0/0.0.0.0:0
    [junit4] 2> 282223 INFO (Thread-565) [ ] o.a.s.c.ZkTestServer Starting server
    [junit4] 2> 282324 INFO (SUITE-TestManagedSchemaAPI-seed#[ECF6C003A73DEE0A]-worker) [ ] o.a.s.c.ZkTestServer start zk server on port:53532
    [junit4] 2> 282324 INFO (SUITE-TestManagedSchemaAPI-seed#[ECF6C003A73DEE0A]-worker) [ ] o.a.s.c.c.SolrZkClient Using default ZkCredentialsProvider
    [junit4] 2> 282326 INFO (SUITE-TestManagedSchemaAPI-seed#[ECF6C003A73DEE0A]-worker) [ ] o.a.s.c.c.ConnectionManager Waiting for client to connect to ZooKeeper
    [junit4] 2> 282337 INFO (zkCallback-7346-thread-1) [ ] o.a.s.c.c.ConnectionManager Watcher org.apache.solr.common.cloud.ConnectionManager@12b8e03 name:ZooKeeperConnection Watcher:127.0.0.1:53532 got event WatchedEvent state:SyncConnected type:None path:null path:null type:None
    [junit4] 2> 282337 INFO (SUITE-TestManagedSchemaAPI-seed#[ECF6C003A73DEE0A]-worker) [ ] o.a.s.c.c.ConnectionManager Client is connected to ZooKeeper
    [junit4] 2> 282337 INFO (SUITE-TestManagedSchemaAPI-seed#[ECF6C003A73DEE0A]-worker) [ ] o.a.s.c.c.SolrZkClient Using default ZkACLProvider
    [junit4] 2> 282337 INFO (SUITE-TestManagedSchemaAPI-seed#[ECF6C003A73DEE0A]-worker) [ ] o.a.s.c.c.SolrZkClient makePath: /solr/solr.xml
    [junit4] 2> 282356 INFO (jetty-launcher-7345-thread-1) [ ] o.e.j.s.Server jetty-9.3.8.v20160314
    [junit4] 2> 282358 INFO (jetty-launcher-7345-thread-2) [ ] o.e.j.s.Server jetty-9.3.8.v20160314
    [junit4] 2> 282358 INFO (jetty-launcher-7345-thread-1) [ ] o.e.j.s.h.ContextHandler Started o.e.j.s.ServletContextHandler@a87448{/solr,null,AVAILABLE}
    [junit4] 2> 282359 INFO (jetty-launcher-7345-thread-2) [ ] o.e.j.s.h.ContextHandler Started o.e.j.s.ServletContextHandler@9e8445{/solr,null,AVAILABLE}
    [junit4] 2> 282362 INFO (jetty-launcher-7345-thread-1) [ ] o.e.j.s.ServerConnector Started ServerConnector@1827f27{HTTP/1.1,[http/1.1]}{127.0.0.1:53536}
    [junit4] 2> 282362 INFO (jetty-launcher-7345-thread-2) [ ] o.e.j.s.ServerConnector Started ServerConnector@18b18d7{HTTP/1.1,[http/1.1]}{127.0.0.1:53537}
    [junit4] 2> 282362 INFO (jetty-launcher-7345-thread-1) [ ] o.e.j.s.Server Started @286555ms
    [junit4] 2> 282362 INFO (jetty-launcher-7345-thread-2) [ ] o.e.j.s.Server Started @286555ms
    [junit4] 2> 282365 INFO (jetty-launcher-7345-thread-2) [ ] o.a.s.c.s.e.JettySolrRunner Jetty properties: {hostContext=/solr, hostPort=53537}
    [junit4] 2> 282363 INFO (jetty-launcher-7345-thread-1) [ ] o.a.s.c.s.e.JettySolrRunner Jetty properties: {hostContext=/solr, hostPort=53536}
    [junit4] 2> 282365 INFO (jetty-launcher-7345-thread-2) [ ] o.a.s.s.SolrDispatchFilter SolrDispatchFilter.init(): sun.misc.Launcher$AppClassLoader@1d16e93
    [junit4] 2> 282365 INFO (jetty-launcher-7345-thread-2) [ ] o.a.s.c.SolrResourceLoader new SolrResourceLoader for directory: 'C:\Users\jenkins\workspace\Lucene-Solr-master-Windows\solr\build\solr-core\test\J0\temp\solr.schema.TestManagedSchemaAPI_ECF6C003A73DEE0A-001\tempDir-001\node2'
    [junit4] 2> 282365 INFO (jetty-launcher-7345-thread-2) [ ] o.a.s.c.SolrResourceLoader JNDI not configured for solr (NoInitialContextEx)
    [junit4] 2> 282365 INFO (jetty-launcher-7345-thread-2) [ ] o.a.s.c.SolrResourceLoader solr home defaulted to 'solr/' (could not find system property or JNDI)
    [junit4] 2> 282366 INFO (jetty-launcher-7345-thread-2) [ ] o.a.s.c.c.SolrZkClient Using default ZkCredentialsProvider
    [junit4] 2> 282369 INFO (jetty-launcher-7345-thread-1) [ ] o.a.s.s.SolrDispatchFilter SolrDispatchFilter.init(): sun.misc.Launcher$AppClassLoader@1d16e93
    [junit4] 2> 282369 INFO (jetty-launcher-7345-thread-1) [ ] o.a.s.c.SolrResourceLoader new SolrResourceLoader for directory: 'C:\Users\jenkins\workspace\Lucene-Solr-master-Windows\solr\build\solr-core\test\J0\temp\solr.schema.TestManagedSchemaAPI_ECF6C003A73DEE0A-001\tempDir-001\node1'
    [junit4] 2> 282369 INFO (jetty-launcher-7345-thread-2) [ ] o.a.s.c.c.ConnectionManager Waiting for client to connect to ZooKeeper
    [junit4] 2> 282369 INFO (jetty-launcher-7345-thread-1) [ ] o.a.s.c.SolrResourceLoader JNDI not configured for solr (NoInitialContextEx)
    [junit4] 2> 282369 INFO (jetty-launcher-7345-thread-1) [ ] o.a.s.c.SolrResourceLoader solr home defaulted to 'solr/' (could not find system property or JNDI)
    [junit4] 2> 282370 INFO (jetty-launcher-7345-thread-1) [ ] o.a.s.c.c.SolrZkClient Using default ZkCredentialsProvider
    [junit4] 2> 282371 INFO (jetty-launcher-7345-thread-1) [ ] o.a.s.c.c.ConnectionManager Waiting for client to connect to ZooKeeper
    [junit4] 2> 282372 INFO (zkCallback-7347-thread-1) [ ] o.a.s.c.c.ConnectionManager Watcher org.apache.solr.common.cloud.ConnectionManager@17eee65 name:ZooKeeperConnection Watcher:127.0.0.1:53532/solr got event WatchedEvent state:SyncConnected type:None path:null path:null type:None
    [junit4] 2> 282372 INFO (jetty-launcher-7345-thread-2) [ ] o.a.s.c.c.ConnectionManager Client is connected to ZooKeeper
    [junit4] 2> 282373 INFO (jetty-launcher-7345-thread-2) [ ] o.a.s.c.c.SolrZkClient Using default ZkACLProvider
    [junit4] 2> 282374 INFO (jetty-launcher-7345-thread-2) [ ] o.a.s.s.SolrDispatchFilter solr.xml found in ZooKeeper. Loading...
    [junit4] 2> 282377 INFO (zkCallback-7348-thread-1) [ ] o.a.s.c.c.ConnectionManager Watcher org.apache.solr.common.cloud.ConnectionManager@7d53cc name:ZooKeeperConnection Watcher:127.0.0.1:53532/solr got event WatchedEvent state:SyncConnected type:None path:null path:null type:None
    [junit4] 2> 282377 INFO (jetty-launcher-7345-thread-1) [ ] o.a.s.c.c.ConnectionManager Client is connected to ZooKeeper
    [junit4] 2> 282377 INFO (jetty-launcher-7345-thread-1) [ ] o.a.s.c.c.SolrZkClient Using default ZkACLProvider
    [junit4] 2> 282379 INFO (jetty-launcher-7345-thread-1) [ ] o.a.s.s.SolrDispatchFilter solr.xml found in ZooKeeper. Loading...
    [junit4] 2> 282391 INFO (jetty-launcher-7345-thread-2) [ ] o.a.s.c.CorePropertiesLocator Config-defined core root directory: C:\Users\jenkins\workspace\Lucene-Solr-master-Windows\solr\build\solr-core\test\J0\temp\solr.schema.TestManagedSchemaAPI_ECF6C003A73DEE0A-001\tempDir-001\node2\.
    [junit4] 2> 282391 INFO (jetty-launcher-7345-thread-2) [ ] o.a.s.c.CoreContainer New CoreContainer 25143935
    [junit4] 2> 282391 INFO (jetty-launcher-7345-thread-2) [ ] o.a.s.c.CoreContainer Loading cores into CoreContainer [instanceDir=C:\Users\jenkins\workspace\Lucene-Solr-master-Windows\solr\build\solr-core\test\J0\temp\solr.schema.TestManagedSchemaAPI_ECF6C003A73DEE0A-001\tempDir-001\node2]
    [junit4] 2> 282391 WARN (jetty-launcher-7345-thread-2) [ ] o.a.s.c.CoreContainer Couldn't add files from C:\Users\jenkins\workspace\Lucene-Solr-master-Windows\solr\build\solr-core\test\J0\temp\solr.schema.TestManagedSchemaAPI_ECF6C003A73DEE0A-001\tempDir-001\node2\lib to classpath: C:\Users\jenkins\workspace\Lucene-Solr-master-Windows\solr\build\solr-core\test\J0\temp\solr.schema.TestManagedSchemaAPI_ECF6C003A73DEE0A-001\tempDir-001\node2\lib
    [junit4] 2> 282391 INFO (jetty-launcher-7345-thread-2) [ ] o.a.s.h.c.HttpShardHandlerFactory created with socketTimeout : 90000,urlScheme : ,connTimeout : 15000,maxConnectionsPerHost : 20,maxConnections : 10000,corePoolSize : 0,maximumPoolSize : 2147483647,maxThreadIdleTime : 5,sizeOfQueue : -1,fairnessPolicy : false,
    [junit4] 2> 282396 WARN (NIOServerCxn.Factory:0.0.0.0/0.0.0.0:0) [ ] o.a.z.s.NIOServerCnxn caught end of stream exception
    [junit4] 2> EndOfStreamException: Unable to read additional data from client sessionid 0x15562df256f0001, likely client has closed socket
    [junit4] 2> at org.apache.zookeeper.server.NIOServerCnxn.doIO(NIOServerCnxn.java:228)
    [junit4] 2> at org.apache.zookeeper.server.NIOServerCnxnFactory.run(NIOServerCnxnFactory.java:208)
    [junit4] 2> at java.lang.Thread.run(Thread.java:745)
    [junit4] 2> 282398 INFO (jetty-launcher-7345-thread-2) [ ] o.a.s.u.UpdateShardHandler Creating UpdateShardHandler HTTP client with params:
    [junit4] 2> 282399 INFO (jetty-launcher-7345-thread-2) [ ] o.a.s.l.LogWatcher SLF4J impl is org.slf4j.impl.Log4jLoggerFactory
    [junit4] 2> 282399 INFO (jetty-launcher-7345-thread-2) [ ] o.a.s.l.LogWatcher Registering Log Listener [Log4j (org.slf4j.impl.Log4jLoggerFactory)]
    [junit4] 2> 282399 INFO (jetty-launcher-7345-thread-2) [ ] o.a.s.c.ZkContainer Zookeeper client=127.0.0.1:53532/solr
    [junit4] 2> 282399 INFO (jetty-launcher-7345-thread-2) [ ] o.a.s.c.ZkController zkHost includes chroot
    [junit4] 2> 282399 INFO (jetty-launcher-7345-thread-2) [ ] o.a.s.c.c.SolrZkClient Using default ZkCredentialsProvider
    [junit4] 2> 282400 INFO (jetty-launcher-7345-thread-2) [ ] o.a.s.c.c.ConnectionManager Waiting for client to connect to ZooKeeper
    [junit4] 2> 282402 INFO (jetty-launcher-7345-thread-1) [ ] o.a.s.c.CorePropertiesLocator Config-defined core root directory: C:\Users\jenkins\workspace\Lucene-Solr-master-Windows\solr\build\solr-core\test\J0\temp\solr.schema.TestManagedSchemaAPI_ECF6C003A73DEE0A-001\tempDir-001\node1\.
    [junit4] 2> 282403 INFO (jetty-launcher-7345-thread-1) [ ] o.a.s.c.CoreContainer New CoreContainer 13081511
    [junit4] 2> 282403 INFO (jetty-launcher-7345-thread-1) [ ] o.a.s.c.CoreContainer Loading cores into CoreContainer [instanceDir=C:\Users\jenkins\workspace\Lucene-Solr-master-Windows\solr\build\solr-core\test\J0\temp\solr.schema.TestManagedSchemaAPI_ECF6C003A73DEE0A-001\tempDir-001\node1]
    [junit4] 2> 282403 WARN (jetty-launcher-7345-thread-1) [ ] o.a.s.c.CoreContainer Couldn't add files from C:\Users\jenkins\workspace\Lucene-Solr-master-Windows\solr\build\solr-core\test\J0\temp\solr.schema.TestManagedSchemaAPI_ECF6C003A73DEE0A-001\tempDir-001\node1\lib to classpath: C:\Users\jenkins\workspace\Lucene-Solr-master-Windows\solr\build\solr-core\test\J0\temp\solr.schema.TestManagedSchemaAPI_ECF6C003A73DEE0A-001\tempDir-001\node1\lib
    [junit4] 2> 282403 INFO (jetty-launcher-7345-thread-1) [ ] o.a.s.h.c.HttpShardHandlerFactory created with socketTimeout : 90000,urlScheme : ,connTimeout : 15000,maxConnectionsPerHost : 20,maxConnections : 10000,corePoolSize : 0,maximumPoolSize : 2147483647,maxThreadIdleTime : 5,sizeOfQueue : -1,fairnessPolicy : false,
    [junit4] 2> 282406 INFO (jetty-launcher-7345-thread-1) [ ] o.a.s.u.UpdateShardHandler Creating UpdateShardHandler HTTP client with params:
    [junit4] 2> 282407 INFO (jetty-launcher-7345-thread-1) [ ] o.a.s.l.LogWatcher SLF4J impl is org.slf4j.impl.Log4jLoggerFactory
    [junit4] 2> 282407 INFO (jetty-launcher-7345-thread-1) [ ] o.a.s.l.LogWatcher Registering Log Listener [Log4j (org.slf4j.impl.Log4jLoggerFactory)]
    [junit4] 2> 282407 INFO (jetty-launcher-7345-thread-1) [ ] o.a.s.c.ZkContainer Zookeeper client=127.0.0.1:53532/solr
    [junit4] 2> 282407 INFO (jetty-launcher-7345-thread-1) [ ] o.a.s.c.ZkController zkHost includes chroot
    [junit4] 2> 282407 INFO (jetty-launcher-7345-thread-1) [ ] o.a.s.c.c.SolrZkClient Using default ZkCredentialsProvider
    [junit4] 2> 282408 INFO (jetty-launcher-7345-thread-1) [ ] o.a.s.c.c.ConnectionManager Waiting for client to connect to ZooKeeper
    [junit4] 2> 282409 INFO (zkCallback-7351-thread-1) [ ] o.a.s.c.c.ConnectionManager Watcher org.apache.solr.common.cloud.ConnectionManager@4cf869 name:ZooKeeperConnection Watcher:127.0.0.1:53532 got event WatchedEvent state:SyncConnected type:None path:null path:null type:None
    [junit4] 2> 282410 INFO (jetty-launcher-7345-thread-2) [ ] o.a.s.c.c.ConnectionManager Client is connected to ZooKeeper
    [junit4] 2> 282411 INFO (jetty-launcher-7345-thread-2) [ ] o.a.s.c.c.SolrZkClient Using default ZkACLProvider
    [junit4] 2> 282413 WARN (NIOServerCxn.Factory:0.0.0.0/0.0.0.0:0) [ ] o.a.z.s.NIOServerCnxn caught end of stream exception
    [junit4] 2> EndOfStreamException: Unable to read additional data from client sessionid 0x15562df256f0003, likely client has closed socket
    [junit4] 2> at org.apache.zookeeper.server.NIOServerCnxn.doIO(NIOServerCnxn.java:228)
    [junit4] 2> at org.apache.zookeeper.server.NIOServerCnxnFactory.run(NIOServerCnxnFactory.java:208)
    [junit4] 2> at java.lang.Thread.run(Thread.java:745)
    [junit4] 2> 282415 INFO (jetty-launcher-7345-thread-2) [n:127.0.0.1:53537_solr ] o.a.s.c.ZkController Added new OnReconnect listener org.apache.solr.cloud.ZkController$$Lambda$63/17222482@1341dc6
    [junit4] 2> 282416 INFO (jetty-launcher-7345-thread-2) [n:127.0.0.1:53537_solr ] o.a.s.c.c.ConnectionManager Waiting for client to connect to ZooKeeper
    [junit4] 2> 282415 INFO (zkCallback-7354-thread-1) [ ] o.a.s.c.c.ConnectionManager Watcher org.apache.solr.common.cloud.ConnectionManager@6412cf name:ZooKeeperConnection Watcher:127.0.0.1:53532 got event WatchedEvent state:SyncConnected type:None path:null path:null type:None
    [junit4] 2> 282417 INFO (jetty-launcher-7345-thread-1) [ ] o.a.s.c.c.ConnectionManager Client is connected to ZooKeeper
    [junit4] 2> 282418 INFO (jetty-launcher-7345-thread-1) [ ] o.a.s.c.c.SolrZkClient Using default ZkACLProvider
    [junit4] 2> 282420 INFO (jetty-launcher-7345-thread-1) [n:127.0.0.1:53536_solr ] o.a.s.c.ZkController Added new OnReconnect listener org.apache.solr.cloud.ZkController$$Lambda$63/17222482@1de10ef
    [junit4] 2> 282420 INFO (jetty-launcher-7345-thread-1) [n:127.0.0.1:53536_solr ] o.a.s.c.c.ConnectionManager Waiting for client to connect to ZooKeeper
    [junit4] 2> 282422 INFO (zkCallback-7355-thread-1-processing-n:127.0.0.1:53537_solr) [n:127.0.0.1:53537_solr ] o.a.s.c.c.ConnectionManager Watcher org.apache.solr.common.cloud.ConnectionManager@57616 name:ZooKeeperConnection Watcher:127.0.0.1:53532/solr got event WatchedEvent state:SyncConnected type:None path:null path:null type:None
    [junit4] 2> 282422 INFO (jetty-launcher-7345-thread-2) [n:127.0.0.1:53537_solr ] o.a.s.c.c.ConnectionManager Client is connected to ZooKeeper
    [junit4] 2> 282423 INFO (zkCallback-7356-thread-1-processing-n:127.0.0.1:53536_solr) [n:127.0.0.1:53536_solr ] o.a.s.c.c.ConnectionManager Watcher org.apache.solr.common.cloud.ConnectionManager@1e0cabc name:ZooKeeperConnection Watcher:127.0.0.1:53532/solr got event WatchedEvent state:SyncConnected type:None path:null path:null type:None
    [junit4] 2> 282423 INFO (jetty-launcher-7345-thread-1) [n:127.0.0.1:53536_solr ] o.a.s.c.c.ConnectionManager Client is connected to ZooKeeper
    [junit4] 2> 282424 INFO (jetty-launcher-7345-thread-2) [n:127.0.0.1:53537_solr ] o.a.s.c.c.SolrZkClient makePath: /overseer/queue
    [junit4] 2> 282425 INFO (jetty-launcher-7345-thread-1) [n:127.0.0.1:53536_solr ] o.a.s.c.c.SolrZkClient makePath: /overseer/queue
    [junit4] 2> 282427 INFO (jetty-launcher-7345-thread-2) [n:127.0.0.1:53537_solr ] o.a.s.c.c.SolrZkClient makePath: /overseer/collection-queue-work
    [junit4] 2> 282433 INFO (jetty-launcher-7345-thread-1) [n:127.0.0.1:53536_solr ] o.a.s.c.c.SolrZkClient makePath: /overseer/collection-map-running
    [junit4] 2> 282433 INFO (jetty-launcher-7345-thread-2) [n:127.0.0.1:53537_solr ] o.a.s.c.c.SolrZkClient makePath: /overseer/collection-map-running
    [junit4] 2> 282439 INFO (jetty-launcher-7345-thread-2) [n:127.0.0.1:53537_solr ] o.a.s.c.c.SolrZkClient makePath: /overseer/collection-map-completed
    [junit4] 2> 282439 INFO (jetty-launcher-7345-thread-1) [n:127.0.0.1:53536_solr ] o.a.s.c.c.SolrZkClient makePath: /overseer/collection-map-completed
    [junit4] 2> 282442 INFO (jetty-launcher-7345-thread-2) [n:127.0.0.1:53537_solr ] o.a.s.c.c.SolrZkClient makePath: /overseer/collection-map-failure
    [junit4] 2> 282442 INFO (jetty-launcher-7345-thread-1) [n:127.0.0.1:53536_solr ] o.a.s.c.c.SolrZkClient makePath: /overseer/collection-map-failure
    [junit4] 2> 282445 INFO (jetty-launcher-7345-thread-2) [n:127.0.0.1:53537_solr ] o.a.s.c.c.SolrZkClient makePath: /live_nodes
    [junit4] 2> 282445 INFO (jetty-launcher-7345-thread-1) [n:127.0.0.1:53536_solr ] o.a.s.c.c.SolrZkClient makePath: /live_nodes
    [junit4] 2> 282447 INFO (jetty-launcher-7345-thread-2) [n:127.0.0.1:53537_solr ] o.a.s.c.c.SolrZkClient makePath: /collections
    [junit4] 2> 282448 INFO (jetty-launcher-7345-thread-1) [n:127.0.0.1:53536_solr ] o.a.s.c.c.SolrZkClient makePath: /collections
    [junit4] 2> 282450 INFO (jetty-launcher-7345-thread-2) [n:127.0.0.1:53537_solr ] o.a.s.c.c.SolrZkClient makePath: /aliases.json
    [junit4] 2> 282450 INFO (jetty-launcher-7345-thread-1) [n:127.0.0.1:53536_solr ] o.a.s.c.c.SolrZkClient makePath: /aliases.json
    [junit4] 2> 282452 INFO (jetty-launcher-7345-thread-2) [n:127.0.0.1:53537_solr ] o.a.s.c.c.SolrZkClient makePath: /clusterstate.json
    [junit4] 2> 282452 INFO (jetty-launcher-7345-thread-1) [n:127.0.0.1:53536_solr ] o.a.s.c.c.SolrZkClient makePath: /clusterstate.json
    [junit4] 2> 282455 INFO (jetty-launcher-7345-thread-2) [n:127.0.0.1:53537_solr ] o.a.s.c.c.SolrZkClient makePath: /security.json
    [junit4] 2> 282455 INFO (jetty-launcher-7345-thread-1) [n:127.0.0.1:53536_solr ] o.a.s.c.c.SolrZkClient makePath: /security.json
    [junit4] 2> 282457 INFO (jetty-launcher-7345-thread-2) [n:127.0.0.1:53537_solr ] o.a.s.c.c.ZkStateReader Updating cluster state from ZooKeeper...
    [junit4] 2> 282457 INFO (jetty-launcher-7345-thread-1) [n:127.0.0.1:53536_solr ] o.a.s.c.c.ZkStateReader Updating cluster state from ZooKeeper...
    [junit4] 2> 282458 INFO (jetty-launcher-7345-thread-2) [n:127.0.0.1:53537_solr ] o.a.s.c.c.ZkStateReader Loaded empty cluster properties
    [junit4] 2> 282458 INFO (jetty-launcher-7345-thread-1) [n:127.0.0.1:53536_solr ] o.a.s.c.c.ZkStateReader Loaded empty cluster properties
    [junit4] 2> 282459 INFO (jetty-launcher-7345-thread-2) [n:127.0.0.1:53537_solr ] o.a.s.c.c.ZkStateReader Updated live nodes from ZooKeeper... (0) -> (0)
    [junit4] 2> 282460 INFO (jetty-launcher-7345-thread-1) [n:127.0.0.1:53536_solr ] o.a.s.c.c.ZkStateReader Updated live nodes from ZooKeeper... (0) -> (0)
    [junit4] 2> 282464 INFO (jetty-launcher-7345-thread-2) [n:127.0.0.1:53537_solr ] o.a.s.c.c.SolrZkClient makePath: /overseer_elect
    [junit4] 2> 282465 INFO (jetty-launcher-7345-thread-1) [n:127.0.0.1:53536_solr ] o.a.s.c.c.SolrZkClient makePath: /overseer_elect
    [junit4] 2> 282466 INFO (jetty-launcher-7345-thread-2) [n:127.0.0.1:53537_solr ] o.a.s.c.c.SolrZkClient makePath: /overseer_elect/election
    [junit4] 2> 282466 INFO (jetty-launcher-7345-thread-1) [n:127.0.0.1:53536_solr ] o.a.s.c.c.SolrZkClient makePath: /overseer_elect/election
    [junit4] 2> 282468 INFO (jetty-launcher-7345-thread-1) [n:127.0.0.1:53536_solr ] o.a.s.c.Overseer Overseer (id=null) closing
    [junit4] 2> 282469 INFO (jetty-launcher-7345-thread-2) [n:127.0.0.1:53537_solr ] o.a.s.c.Overseer Overseer (id=null) closing
    [junit4] 2> 282469 INFO (jetty-launcher-7345-thread-2) [n:127.0.0.1:53537_solr ] o.a.s.c.LeaderElector Joined leadership election with path: /overseer_elect/election/96091677603594245-127.0.0.1:53537_solr-n_0000000001
    [junit4] 2> 282469 INFO (jetty-launcher-7345-thread-1) [n:127.0.0.1:53536_solr ] o.a.s.c.LeaderElector Joined leadership election with path: /overseer_elect/election/96091677603594246-127.0.0.1:53536_solr-n_000000000
    [junit4] 2> 282471 INFO (jetty-launcher-7345-thread-1) [n:127.0.0.1:53536_solr ] o.a.s.c.OverseerElectionContext I am going to be the leader 127.0.0.1:53536_solr
    [junit4] 2> 282471 INFO (jetty-launcher-7345-thread-1) [n:127.0.0.1:53536_solr ] o.a.s.c.c.SolrZkClient makePath: /overseer_elect/leader
    [junit4] 2> 282471 INFO (jetty-launcher-7345-thread-2) [n:127.0.0.1:53537_solr ] o.a.s.c.LeaderElector Watching path /overseer_elect/election/96091677603594246-127.0.0.1:53536_solr-n_0000000000 to know if I could be the leader
    [junit4] 2> 282472 INFO (jetty-launcher-7345-thread-2) [n:127.0.0.1:53537_solr ] o.a.s.c.ZkController Register node as live in ZooKeeper:/live_nodes/127.0.0.1:53537_solr
    [junit4] 2> 282473 INFO (jetty-launcher-7345-thread-2) [n:127.0.0.1:53537_solr ] o.a.s.c.c.SolrZkClient makePath: /live_nodes/127.0.0.1:53537_solr
    [junit4] 2> 282474 INFO (jetty-launcher-7345-thread-1) [n:127.0.0.1:53536_solr ] o.a.s.c.Overseer Overseer (id=96091677603594246-127.0.0.1:53536_solr-n_0000000000) starting
    [junit4] 2> 282475 INFO (zkCallback-7355-thread-1-processing-n:127.0.0.1:53537_solr) [n:127.0.0.1:53537_solr ] o.a.s.c.c.ZkStateReader A live node change: [WatchedEvent state:SyncConnected type:NodeChildrenChanged path:/live_nodes], has occurred - updating... (live nodes size: [0])
    [junit4] 2> 282476 INFO (zkCallback-7356-thread-1-processing-n:127.0.0.1:53536_solr) [n:127.0.0.1:53536_solr ] o.a.s.c.c.ZkStateReader A live node change: [WatchedEvent state:SyncConnected type:NodeChildrenChanged path:/live_nodes], has occurred - updating... (live nodes size: [0])
    [junit4] 2> 282478 INFO (zkCallback-7355-thread-1-processing-n:127.0.0.1:53537_solr) [n:127.0.0.1:53537_solr ] o.a.s.c.c.ZkStateReader Updated live nodes from ZooKeeper... (0) -> (1)
    [junit4] 2> 282501 INFO (zkCallback-7356-thread-1-processing-n:127.0.0.1:53536_solr) [n:127.0.0.1:53536_solr ] o.a.s.c.c.ZkStateReader Updated live nodes from ZooKeeper... (0) -> (1)
    [junit4] 2> 282503 INFO (jetty-launcher-7345-thread-1) [n:127.0.0.1:53536_solr ] o.a.s.c.c.SolrZkClient makePath: /overseer/queue-work
    [junit4] 2> 282510 INFO (jetty-launcher-7345-thread-2) [n:127.0.0.1:53537_solr ] o.a.s.c.CoreContainer Security conf doesn't exist. Skipping setup for authorization module.
    [junit4] 2> 282510 INFO (jetty-launcher-7345-thread-2) [n:127.0.0.1:53537_solr ] o.a.s.c.CoreContainer No authentication plugin used.
    [junit4] 2> 282512 INFO (jetty-launcher-7345-thread-2) [n:127.0.0.1:53537_solr ] o.a.s.c.CorePropertiesLocator Looking for core definitions underneath C:\Users\jenkins\workspace\Lucene-Solr-master-Windows\solr\build\solr-core\test\J0\temp\solr.schema.TestManagedSchemaAPI_ECF6C003A73DEE0A-001\tempDir-001\node2\.
    [junit4] 2> 282512 INFO (jetty-launcher-7345-thread-2) [n:127.0.0.1:53537_solr ] o.a.s.c.CorePropertiesLocator Found 0 core definitions
    [junit4] 2> 282513 INFO (jetty-launcher-7345-thread-2) [n:127.0.0.1:53537_solr ] o.a.s.s.SolrDispatchFilter user.dir=C:\Users\jenkins\workspace\Lucene-Solr-master-Windows\solr\build\solr-core\test\J0
    [junit4] 2> 282513 INFO (jetty-launcher-7345-thread-2) [n:127.0.0.1:53537_solr ] o.a.s.s.SolrDispatchFilter SolrDispatchFilter.init() done
    [junit4] 2> 282520 INFO (jetty-launcher-7345-thread-1) [n:127.0.0.1:53536_solr ] o.a.s.c.OverseerAutoReplicaFailoverThread Starting OverseerAutoReplicaFailoverThread autoReplicaFailoverWorkLoopDelay=10000 autoReplicaFailoverWaitAfterExpiration=30000 autoReplicaFailoverBadNodeExpiration=60000
    [junit4] 2> 282522 INFO (jetty-launcher-7345-thread-1) [n:127.0.0.1:53536_solr ] o.a.s.c.ZkController Publish node=127.0.0.1:53536_solr as DOWN
    [junit4] 2> 282522 INFO (OverseerCollectionConfigSetProcessor-96091677603594246-127.0.0.1:53536_solr-n_0000000000) [n:127.0.0.1:53536_solr ] o.a.s.c.OverseerTaskProcessor Process current queue of overseer operations
    [junit4] 2> 282524 INFO (OverseerStateUpdate-96091677603594246-127.0.0.1:53536_solr-n_0000000000) [n:127.0.0.1:53536_solr ] o.a.s.c.Overseer Starting to work on the main queue
    [junit4] 2> 282527 INFO (OverseerStateUpdate-96091677603594246-127.0.0.1:53536_solr-n_0000000000) [n:127.0.0.1:53536_solr ] o.a.s.c.c.ZkStateReader Updated live nodes from ZooKeeper... (1) -> (1)
    [junit4] 2> 282528 INFO (OverseerStateUpdate-96091677603594246-127.0.0.1:53536_solr-n_0000000000) [n:127.0.0.1:53536_solr ] o.a.s.c.Overseer processMessage: queueSize: 1, message = {
    [junit4] 2> "operation":"downnode",
    [junit4] 2> "node_name":"127.0.0.1:53536_solr"} current state version: 0
    [junit4] 2> 282528 INFO (OverseerStateUpdate-96091677603594246-127.0.0.1:53536_solr-n_0000000000) [n:127.0.0.1:53536_solr ] o.a.s.c.o.NodeMutator DownNode state invoked for node: 127.0.0.1:53536_solr
    [junit4] 2> 283526 INFO (jetty-launcher-7345-thread-1) [n:127.0.0.1:53536_solr ] o.a.s.c.ZkController Register node as live in ZooKeeper:/live_nodes/127.0.0.1:53536_solr
    [junit4] 2> 283527 INFO (jetty-launcher-7345-thread-1) [n:127.0.0.1:53536_solr ] o.a.s.c.c.SolrZkClient makePath: /live_nodes/127.0.0.1:53536_solr
    [junit4] 2> 283528 INFO (zkCallback-7355-thread-1-processing-n:127.0.0.1:53537_solr) [n:127.0.0.1:53537_solr ] o.a.s.c.c.ZkStateReader A live node change: [WatchedEvent state:SyncConnected type:NodeChildrenChanged path:/live_nodes], has occurred - updating... (live nodes size: [1])
    [junit4] 2> 283528 INFO (zkCallback-7356-thread-1-processing-n:127.0.0.1:53536_solr) [n:127.0.0.1:53536_solr ] o.a.s.c.c.ZkStateReader A live node change: [WatchedEvent state:SyncConnected type:NodeChildrenChanged path:/live_nodes], has occurred - updating... (live nodes size: [1])
    [junit4] 2> 283528 INFO (zkCallback-7355-thread-1-processing-n:127.0.0.1:53537_solr) [n:127.0.0.1:53537_solr ] o.a.s.c.c.ZkStateReader Updated live nodes from ZooKeeper... (1) -> (2)
    [junit4] 2> 283529 INFO (zkCallback-7356-thread-1-processing-n:127.0.0.1:53536_solr) [n:127.0.0.1:53536_solr ] o.a.s.c.c.ZkStateReader Updated live nodes from ZooKeeper... (1) -> (2)
    [junit4] 2> 283550 INFO (jetty-launcher-7345-thread-1) [n:127.0.0.1:53536_solr ] o.a.s.c.CoreContainer Security conf doesn't exist. Skipping setup for authorization module.
    [junit4] 2> 283550 INFO (jetty-launcher-7345-thread-1) [n:127.0.0.1:53536_solr ] o.a.s.c.CoreContainer No authentication plugin used.
    [junit4] 2> 283551 INFO (jetty-launcher-7345-thread-1) [n:127.0.0.1:53536_solr ] o.a.s.c.CorePropertiesLocator Looking for core definitions underneath C:\Users\jenkins\workspace\Lucene-Solr-master-Windows\solr\build\solr-core\test\J0\temp\solr.schema.TestManagedSchemaAPI_ECF6C003A73DEE0A-001\tempDir-001\node1\.
    [junit4] 2> 283552 INFO (jetty-launcher-7345-thread-1) [n:127.0.0.1:53536_solr ] o.a.s.c.CorePropertiesLocator Found 0 core definitions
    [junit4] 2> 283553 INFO (jetty-launcher-7345-thread-1) [n:127.0.0.1:53536_solr ] o.a.s.s.SolrDispatchFilter user.dir=C:\Users\jenkins\workspace\Lucene-Solr-master-Windows\solr\build\solr-core\test\J0
    [junit4] 2> 283553 INFO (jetty-launcher-7345-thread-1) [n:127.0.0.1:53536_solr ] o.a.s.s.SolrDispatchFilter SolrDispatchFilter.init() done
    [junit4] 2> 283554 INFO (SUITE-TestManagedSchemaAPI-seed#[ECF6C003A73DEE0A]-worker) [ ] o.a.s.c.c.SolrZkClient Using default ZkCredentialsProvider
    [junit4] 2> 283555 INFO (SUITE-TestManagedSchemaAPI-seed#[ECF6C003A73DEE0A]-worker) [ ] o.a.s.c.c.ConnectionManager Waiting for client to connect to ZooKeeper
    [junit4] 2> 283557 INFO (zkCallback-7359-thread-1) [ ] o.a.s.c.c.ConnectionManager Watcher org.apache.solr.common.cloud.ConnectionManager@1e19e51 name:ZooKeeperConnection Watcher:127.0.0.1:53532 got event WatchedEvent state:SyncConnected type:None path:null path:null type:None
    [junit4] 2> 283557 INFO (SUITE-TestManagedSchemaAPI-seed#[ECF6C003A73DEE0A]-worker) [ ] o.a.s.c.c.ConnectionManager Client is connected to ZooKeeper
    [junit4] 2> 283557 INFO (SUITE-TestManagedSchemaAPI-seed#[ECF6C003A73DEE0A]-worker) [ ] o.a.s.c.c.SolrZkClient Using default ZkACLProvider
    [junit4] 2> 283559 WARN (NIOServerCxn.Factory:0.0.0.0/0.0.0.0:0) [ ] o.a.z.s.NIOServerCnxn caught end of stream exception
    [junit4] 2> EndOfStreamException: Unable to read additional data from client sessionid 0x15562df256f0007, likely client has closed socket
    [junit4] 2> at org.apache.zookeeper.server.NIOServerCnxn.doIO(NIOServerCnxn.java:228)
    [junit4] 2> at org.apache.zookeeper.server.NIOServerCnxnFactory.run(NIOServerCnxnFactory.java:208)
    [junit4] 2> at java.lang.Thread.run(Thread.java:745)
    [junit4] 2> 283560 INFO (SUITE-TestManagedSchemaAPI-seed#[ECF6C003A73DEE0A]-worker) [ ] o.a.s.c.s.i.CloudSolrClient Final constructed zkHost string: 127.0.0.1:53532/solr
    [junit4] 2> 283561 INFO (SUITE-TestManagedSchemaAPI-seed#[ECF6C003A73DEE0A]-worker) [ ] o.a.s.c.c.SolrZkClient Using default ZkCredentialsProvider
    [junit4] 2> 283562 INFO (SUITE-TestManagedSchemaAPI-seed#[ECF6C003A73DEE0A]-worker) [ ] o.a.s.c.c.ConnectionManager Waiting for client to connect to ZooKeeper
    [junit4] 2> 283564 INFO (zkCallback-7362-thread-1) [ ] o.a.s.c.c.ConnectionManager Watcher org.apache.solr.common.cloud.ConnectionManager@1a374c2 name:ZooKeeperConnection Watcher:127.0.0.1:53532/solr got event WatchedEvent state:SyncConnected type:None path:null path:null type:None
    [junit4] 2> 283564 INFO (SUITE-TestManagedSchemaAPI-seed#[ECF6C003A73DEE0A]-worker) [ ] o.a.s.c.c.ConnectionManager Client is connected to ZooKeeper
    [junit4] 2> 283565 INFO (SUITE-TestManagedSchemaAPI-seed#[ECF6C003A73DEE0A]-worker) [ ] o.a.s.c.c.SolrZkClient Using default ZkACLProvider
    [junit4] 2> 283565 INFO (SUITE-TestManagedSchemaAPI-seed#[ECF6C003A73DEE0A]-worker) [ ] o.a.s.c.c.ZkStateReader Updating cluster state from ZooKeeper...
    [junit4] 2> 283566 INFO (SUITE-TestManagedSchemaAPI-seed#[ECF6C003A73DEE0A]-worker) [ ] o.a.s.c.c.ZkStateReader Loaded empty cluster properties
    [junit4] 2> 283567 INFO (SUITE-TestManagedSchemaAPI-seed#[ECF6C003A73DEE0A]-worker) [ ] o.a.s.c.c.ZkStateReader Updated live nodes from ZooKeeper... (0) -> (2)
    [junit4] 2> 283571 INFO (SUITE-TestManagedSchemaAPI-seed#[ECF6C003A73DEE0A]-worker) [ ] o.a.s.c.c.SolrZkClient makePath: /configs/conf1/managed-schema
    [junit4] 2> 283576 INFO (SUITE-TestManagedSchemaAPI-seed#[ECF6C003A73DEE0A]-worker) [ ] o.a.s.c.c.SolrZkClient makePath: /configs/conf1/solrconfig.xml
    [junit4] 2> 283615 INFO (TEST-TestManagedSchemaAPI.test-seed#[ECF6C003A73DEE0A]) [ ] o.a.s.SolrTestCaseJ4 ###Starting test
    [junit4] 2> 283620 INFO (qtp18956935-27567) [n:127.0.0.1:53536_solr ] o.a.s.h.a.CollectionsHandler Invoked Collection Action :create with params replicationFactor=2&collection.configName=conf1&name=testschemaapi&action=CREATE&numShards=1&wt=javabin&version=2 and sendToOCPQueue=true
    [junit4] 2> 283627 INFO (OverseerCollectionConfigSetProcessor-96091677603594246-127.0.0.1:53536_solr-n_0000000000) [n:127.0.0.1:53536_solr ] o.a.s.c.OverseerTaskProcessor Overseer Collection Message Handler: Get the message id:/overseer/collection-queue-work/qn-0000000000 message:{
    [junit4] 2> "name":"testschemaapi",
    [junit4] 2> "fromApi":"true",
    [junit4] 2> "replicationFactor":"2",
    [junit4] 2> "collection.configName":"conf1",
    [junit4] 2> "numShards":"1",
    [junit4] 2> "stateFormat":"2",
    [junit4] 2> "operation":"create"}
    [junit4] 2> 283628 INFO (OverseerThreadFactory-2208-thread-1-processing-n:127.0.0.1:53536_solr) [n:127.0.0.1:53536_solr ] o.a.s.c.OverseerCollectionMessageHandler OverseerCollectionMessageHandler.processMessage : create , {
    [junit4] 2> "name":"testschemaapi",
    [junit4] 2> "fromApi":"true",
    [junit4] 2> "replicationFactor":"2",
    [junit4] 2> "collection.configName":"conf1",
    [junit4] 2> "numShards":"1",
    [junit4] 2> "stateFormat":"2",
    [junit4] 2> "operation":"create"}
    [junit4] 2> 283628 INFO (OverseerThreadFactory-2208-thread-1-processing-n:127.0.0.1:53536_solr) [n:127.0.0.1:53536_solr ] o.a.s.c.OverseerCollectionMessageHandler Create collection testschemaapi
    [junit4] 2> 283628 INFO (OverseerThreadFactory-2208-thread-1-processing-n:127.0.0.1:53536_solr) [n:127.0.0.1:53536_solr ] o.a.s.c.OverseerCollectionMessageHandler creating collections conf node /collections/testschemaapi
    [junit4] 2> 283630 INFO (OverseerThreadFactory-2208-thread-1-processing-n:127.0.0.1:53536_solr) [n:127.0.0.1:53536_solr ] o.a.s.c.c.SolrZkClient makePath: /collections/testschemaapi
    [junit4] 2> 283632 INFO (zkCallback-7362-thread-1) [ ] o.a.s.c.c.ZkStateReader A collections change: [WatchedEvent state:SyncConnected type:NodeChildrenChanged path:/collections], has occurred - updating...
    [junit4] 2> 283633 INFO (zkCallback-7355-thread-1-processing-n:127.0.0.1:53537_solr) [n:127.0.0.1:53537_solr ] o.a.s.c.c.ZkStateReader A collections change: [WatchedEvent state:SyncConnected type:NodeChildrenChanged path:/collections], has occurred - updating...
    [junit4] 2> 283633 INFO (zkCallback-7356-thread-1-processing-n:127.0.0.1:53536_solr) [n:127.0.0.1:53536_solr ] o.a.s.c.c.ZkStateReader A collections change: [WatchedEvent state:SyncConnected type:NodeChildrenChanged path:/collections], has occurred - updating...
    [junit4] 2> 283640 INFO (OverseerStateUpdate-96091677603594246-127.0.0.1:53536_solr-n_0000000000) [n:127.0.0.1:53536_solr ] o.a.s.c.Overseer processMessage: queueSize: 1, message = {
    [junit4] 2> "name":"testschemaapi",
    [junit4] 2> "fromApi":"true",
    [junit4] 2> "replicationFactor":"2",
    [junit4] 2> "collection.configName":"conf1",
    [junit4] 2> "numShards":"1",
    [junit4] 2> "stateFormat":"2",
    [junit4] 2> "operation":"create"} current state version: 0
    [junit4] 2> 283640 INFO (OverseerStateUpdate-96091677603594246-127.0.0.1:53536_solr-n_0000000000) [n:127.0.0.1:53536_solr ] o.a.s.c.o.ClusterStateMutator building a new cName: testschemaapi
    [junit4] 2> 283643 INFO (OverseerStateUpdate-96091677603594246-127.0.0.1:53536_solr-n_0000000000) [n:127.0.0.1:53536_solr ] o.a.s.c.o.ZkStateWriter going to create_collection /collections/testschemaapi/state.json
    [junit4] 2> 283739 INFO (OverseerThreadFactory-2208-thread-1-processing-n:127.0.0.1:53536_solr) [n:127.0.0.1:53536_solr ] o.a.s.c.OverseerCollectionMessageHandler Creating SolrCores for new collection testschemaapi, shardNames [shard1] , replicationFactor : 2
    [junit4] 2> 283740 INFO (OverseerThreadFactory-2208-thread-1-processing-n:127.0.0.1:53536_solr) [n:127.0.0.1:53536_solr ] o.a.s.c.OverseerCollectionMessageHandler Creating core testschemaapi_shard1_replica1 as part of shard shard1 of collection testschemaapi on 127.0.0.1:53537_solr
    [junit4] 2> 283740 INFO (OverseerThreadFactory-2208-thread-1-processing-n:127.0.0.1:53536_solr) [n:127.0.0.1:53536_solr ] o.a.s.c.OverseerCollectionMessageHandler Creating core testschemaapi_shard1_replica2 as part of shard shard1 of collection testschemaapi on 127.0.0.1:53536_solr
    [junit4] 2> 283747 INFO (qtp16226598-27576) [n:127.0.0.1:53537_solr ] o.a.s.h.a.CoreAdminOperation core create command qt=/admin/cores&collection.configName=conf1&name=testschemaapi_shard1_replica1&action=CREATE&numShards=1&collection=testschemaapi&shard=shard1&wt=javabin&version=2
    [junit4] 2> 283748 INFO (qtp18956935-27566) [n:127.0.0.1:53536_solr ] o.a.s.h.a.CoreAdminOperation core create command qt=/admin/cores&collection.configName=conf1&name=testschemaapi_shard1_replica2&action=CREATE&numShards=1&collection=testschemaapi&shard=shard1&wt=javabin&version=2
    [junit4] 2> 283749 INFO (qtp16226598-27576) [n:127.0.0.1:53537_solr ] o.a.s.c.CoreDescriptor Created CoreDescriptor: {name=testschemaapi_shard1_replica1, collection.configName=conf1, config=solrconfig.xml, transient=false, schema=schema.xml, loadOnStartup=true, configSetProperties=configsetprops.json, collection=testschemaapi, numShards=1, dataDir=data\, shard=shard1}
    [junit4] 2> 283750 INFO (qtp18956935-27566) [n:127.0.0.1:53536_solr ] o.a.s.c.CoreDescriptor Created CoreDescriptor: {name=testschemaapi_shard1_replica2, collection.configName=conf1, config=solrconfig.xml, transient=false, schema=schema.xml, loadOnStartup=true, configSetProperties=configsetprops.json, collection=testschemaapi, numShards=1, dataDir=data\, shard=shard1}
    [junit4] 2> 283750 INFO (qtp16226598-27576) [n:127.0.0.1:53537_solr c:testschemaapi s:shard1 x:testschemaapi_shard1_replica1] o.a.s.c.ZkController publishing state=down
    [junit4] 2> 283751 INFO (qtp18956935-27566) [n:127.0.0.1:53536_solr c:testschemaapi s:shard1 x:testschemaapi_shard1_replica2] o.a.s.c.ZkController publishing state=down
    [junit4] 2> 283752 INFO (qtp16226598-27576) [n:127.0.0.1:53537_solr c:testschemaapi s:shard1 x:testschemaapi_shard1_replica1] o.a.s.c.ZkController Registering watch for collection testschemaapi
    [junit4] 2> 283753 INFO (qtp18956935-27566) [n:127.0.0.1:53536_solr c:testschemaapi s:shard1 x:testschemaapi_shard1_replica2] o.a.s.c.ZkController Registering watch for collection testschemaapi
    [junit4] 2> 283753 INFO (qtp16226598-27576) [n:127.0.0.1:53537_solr c:testschemaapi s:shard1 x:testschemaapi_shard1_replica1] o.a.s.c.c.ZkStateReader Add data for [testschemaapi] ver [0]
    [junit4] 2> 283753 INFO (qtp18956935-27566) [n:127.0.0.1:53536_solr c:testschemaapi s:shard1 x:testschemaapi_shard1_replica2] o.a.s.c.c.ZkStateReader Add data for [testschemaapi] ver [0]
    [junit4] 2> 283754 INFO (qtp18956935-27566) [n:127.0.0.1:53536_solr c:testschemaapi s:shard1 x:testschemaapi_shard1_replica2] o.a.s.c.ZkController look for our core node name
    [junit4] 2> 283754 INFO (qtp16226598-27576) [n:127.0.0.1:53537_solr c:testschemaapi s:shard1 x:testschemaapi_shard1_replica1] o.a.s.c.ZkController look for our core node name
    [junit4] 2> 283758 INFO (OverseerStateUpdate-96091677603594246-127.0.0.1:53536_solr-n_0000000000) [n:127.0.0.1:53536_solr ] o.a.s.c.Overseer processMessage: queueSize: 2, message = {
    [junit4] 2> "core":"testschemaapi_shard1_replica1",
    [junit4] 2> "roles":null,
    [junit4] 2> "base_url":"http://127.0.0.1:53537/solr",
    [junit4] 2> "node_name":"127.0.0.1:53537_solr",
    [junit4] 2> "numShards":"1",
    [junit4] 2> "state":"down",
    [junit4] 2> "shard":"shard1",
    [junit4] 2> "collection":"testschemaapi",
    [junit4] 2> "operation":"state"} current state version: 0
    [junit4] 2> 283758 INFO (OverseerStateUpdate-96091677603594246-127.0.0.1:53536_solr-n_0000000000) [n:127.0.0.1:53536_solr ] o.a.s.c.o.ReplicaMutator Update state numShards=1 message={
    [junit4] 2> "core":"testschemaapi_shard1_replica1",
    [junit4] 2> "roles":null,
    [junit4] 2> "base_url":"http://127.0.0.1:53537/solr",
    [junit4] 2> "node_name":"127.0.0.1:53537_solr",
    [junit4] 2> "numShards":"1",
    [junit4] 2> "state":"down",
    [junit4] 2> "shard":"shard1",
    [junit4] 2> "collection":"testschemaapi",
    [junit4] 2> "operation":"state"}
    [junit4] 2> 283764 INFO (OverseerStateUpdate-96091677603594246-127.0.0.1:53536_solr-n_0000000000) [n:127.0.0.1:53536_solr ] o.a.s.c.Overseer processMessage: queueSize: 1, message = {
    [junit4] 2> "core":"testschemaapi_shard1_replica2",
    [junit4] 2> "roles":null,
    [junit4] 2> "base_url":"http://127.0.0.1:53536/solr",
    [junit4] 2> "node_name":"127.0.0.1:53536_solr",
    [junit4] 2> "numShards":"1",
    [junit4] 2> "state":"down",
    [junit4] 2> "shard":"shard1",
    [junit4] 2> "collection":"testschemaapi",
    [junit4] 2> "operation":"state"} current state version: 0
    [junit4] 2> 283764 INFO (OverseerStateUpdate-96091677603594246-127.0.0.1:53536_solr-n_0000000000) [n:127.0.0.1:53536_solr ] o.a.s.c.o.ReplicaMutator Update state numShards=1 message={
    [junit4] 2> "core":"testschemaapi_shard1_replica2",
    [junit4] 2> "roles":null,
    [junit4] 2> "base_url":"http://127.0.0.1:53536/solr",
    [junit4] 2> "node_name":"127.0.0.1:53536_solr",
    [junit4] 2> "numShards":"1",
    [junit4] 2> "state":"down",
    [junit4] 2> "shard":"shard1",
    [junit4] 2> "collection":"testschemaapi",
    [junit4] 2> "operation":"state"}
    [junit4] 2> 283871 INFO (OverseerStateUpdate-96091677603594246-127.0.0.1:53536_solr-n_0000000000) [n:127.0.0.1:53536_solr ] o.a.s.c.o.ZkStateWriter going to update_collection /collections/testschemaapi/state.json version: 0
    [junit4] 2> 283871 INFO (zkCallback-7355-thread-1-processing-n:127.0.0.1:53537_solr) [n:127.0.0.1:53537_solr ] o.a.s.c.c.ZkStateReader A cluster state change: [WatchedEvent state:SyncConnected type:NodeDataChanged path:/collections/testschemaapi/state.json] for collection [testschemaapi] has occurred - updating... (live nodes size: [2])
    [junit4] 2> 283872 INFO (zkCallback-7356-thread-3-processing-n:127.0.0.1:53536_solr) [n:127.0.0.1:53536_solr ] o.a.s.c.c.ZkStateReader A cluster state change: [WatchedEvent state:SyncConnected type:NodeDataChanged path:/collections/testschemaapi/state.json] for collection [testschemaapi] has occurred - updating... (live nodes size: [2])
    [junit4] 2> 283872 INFO (zkCallback-7355-thread-1-processing-n:127.0.0.1:53537_solr) [n:127.0.0.1:53537_solr ] o.a.s.c.c.ZkStateReader Updating data for [testschemaapi] from [0] to [1]
    [junit4] 2> 283873 INFO (zkCallback-7356-thread-3-processing-n:127.0.0.1:53536_solr) [n:127.0.0.1:53536_solr ] o.a.s.c.c.ZkStateReader Updating data for [testschemaapi] from [0] to [1]
    [junit4] 2> 284754 INFO (qtp16226598-27576) [n:127.0.0.1:53537_solr c:testschemaapi s:shard1 x:testschemaapi_shard1_replica1] o.a.s.c.ZkController waiting to find shard id in clusterstate for testschemaapi_shard1_replica1
    [junit4] 2> 284754 INFO (qtp18956935-27566) [n:127.0.0.1:53536_solr c:testschemaapi s:shard1 x:testschemaapi_shard1_replica2] o.a.s.c.ZkController waiting to find shard id in clusterstate for testschemaapi_shard1_replica2
    [junit4] 2> 284754 INFO (qtp18956935-27566) [n:127.0.0.1:53536_solr c:testschemaapi s:shard1 x:testschemaapi_shard1_replica2] o.a.s.c.ZkController Check for collection zkNode:testschemaapi
    [junit4] 2> 284754 INFO (qtp16226598-27576) [n:127.0.0.1:53537_solr c:testschemaapi s:shard1 x:testschemaapi_shard1_replica1] o.a.s.c.ZkController Check for collection zkNode:testschemaapi
    [junit4] 2> 284755 INFO (qtp18956935-27566) [n:127.0.0.1:53536_solr c:testschemaapi s:shard1 x:testschemaapi_shard1_replica2] o.a.s.c.ZkController Collection zkNode exists
    [junit4] 2> 284755 INFO (qtp18956935-27566) [n:127.0.0.1:53536_solr c:testschemaapi s:shard1 x:testschemaapi_shard1_replica2] o.a.s.c.c.ZkStateReader Load collection config from: [/collections/testschemaapi]
    [junit4] 2> 284756 INFO (qtp18956935-27566) [n:127.0.0.1:53536_solr c:testschemaapi s:shard1 x:testschemaapi_shard1_replica2] o.a.s.c.c.ZkStateReader path=[/collections/testschemaapi] [configName]=[conf1] specified config exists in ZooKeeper
    [junit4] 2> 284757 INFO (qtp16226598-27576) [n:127.0.0.1:53537_solr c:testschemaapi s:shard1 x:testschemaapi_shard1_replica1] o.a.s.c.ZkController Collection zkNode exists
    [junit4] 2> 284757 INFO (qtp16226598-27576) [n:127.0.0.1:53537_solr c:testschemaapi s:shard1 x:testschemaapi_shard1_replica1] o.a.s.c.c.ZkStateReader Load collection config from: [/collections/testschemaapi]
    [junit4] 2> 284758 INFO (qtp18956935-27566) [n:127.0.0.1:53536_solr c:testschemaapi s:shard1 x:testschemaapi_shard1_replica2] o.a.s.c.SolrResourceLoader new SolrResourceLoader for directory: 'C:\Users\jenkins\workspace\Lucene-Solr-master-Windows\solr\build\solr-core\test\J0\temp\solr.schema.TestManagedSchemaAPI_ECF6C003A73DEE0A-001\tempDir-001\node1\testschemaapi_shard1_replica2'
    [junit4] 2> 284758 INFO (qtp18956935-27566) [n:127.0.0.1:53536_solr c:testschemaapi s:shard1 x:testschemaapi_shard1_replica2] o.a.s.c.SolrResourceLoader JNDI not configured for solr (NoInitialContextEx)
    [junit4] 2> 284758 INFO (qtp18956935-27566) [n:127.0.0.1:53536_solr c:testschemaapi s:shard1 x:testschemaapi_shard1_replica2] o.a.s.c.SolrResourceLoader solr home defaulted to 'solr/' (could not find system property or JNDI)
    [junit4] 2> 284758 INFO (qtp16226598-27576) [n:127.0.0.1:53537_solr c:testschemaapi s:shard1 x:testschemaapi_shard1_replica1] o.a.s.c.c.ZkStateReader path=[/collections/testschemaapi] [configName]=[conf1] specified config exists in ZooKeeper
    [junit4] 2> 284758 INFO (qtp16226598-27576) [n:127.0.0.1:53537_solr c:testschemaapi s:shard1 x:testschemaapi_shard1_replica1] o.a.s.c.SolrResourceLoader new SolrResourceLoader for directory: 'C:\Users\jenkins\workspace\Lucene-Solr-master-Windows\solr\build\solr-core\test\J0\temp\solr.schema.TestManagedSchemaAPI_ECF6C003A73DEE0A-001\tempDir-001\node2\testschemaapi_shard1_replica1'
    [junit4] 2> 284758 INFO (qtp16226598-27576) [n:127.0.0.1:53537_solr c:testschemaapi s:shard1 x:testschemaapi_shard1_replica1] o.a.s.c.SolrResourceLoader JNDI not configured for solr (NoInitialContextEx)
    [junit4] 2> 284758 INFO (qtp16226598-27576) [n:127.0.0.1:53537_solr c:testschemaapi s:shard1 x:testschemaapi_shard1_replica1] o.a.s.c.SolrResourceLoader solr home defaulted to 'solr/' (could not find system property or JNDI)
    [junit4] 2> 284762 INFO (qtp18956935-27566) [n:127.0.0.1:53536_solr c:testschemaapi s:shard1 x:testschemaapi_shard1_replica2] o.a.s.c.Config loaded config solrconfig.xml with version 0
    [junit4] 2> 284765 INFO (qtp16226598-27576) [n:127.0.0.1:53537_solr c:testschemaapi s:shard1 x:testschemaapi_shard1_replica1] o.a.s.c.Config loaded config solrconfig.xml with version 0
    [junit4] 2> 284777 INFO (qtp16226598-27576) [n:127.0.0.1:53537_solr c:testschemaapi s:shard1 x:testschemaapi_shard1_replica1] o.a.s.c.SolrConfig current version of requestparams : -1
    [junit4] 2> 284778 INFO (qtp18956935-27566) [n:127.0.0.1:53536_solr c:testschemaapi s:shard1 x:testschemaapi_shard1_replica2] o.a.s.c.SolrConfig current version of requestparams : -1
    [junit4] 2> 284796 INFO (qtp16226598-27576) [n:127.0.0.1:53537_solr c:testschemaapi s:shard1 x:testschemaapi_shard1_replica1] o.a.s.c.SolrConfig Using Lucene MatchVersion: 7.0.0
    [junit4] 2> 284798 INFO (qtp18956935-27566) [n:127.0.0.1:53536_solr c:testschemaapi s:shard1 x:testschemaapi_shard1_replica2] o.a.s.c.SolrConfig Using Lucene MatchVersion: 7.0.0
    [junit4] 2> 284816 INFO (qtp16226598-27576) [n:127.0.0.1:53537_solr c:testschemaapi s:shard1 x:testschemaapi_shard1_replica1] o.a.s.c.SolrConfig Loaded SolrConfig: solrconfig.xml
    [junit4] 2> 284816 INFO (qtp18956935-27566) [n:127.0.0.1:53536_solr c:testschemaapi s:shard1 x:testschemaapi_shard1_replica2] o.a.s.c.SolrConfig Loaded SolrConfig: solrconfig.xml
    [junit4] 2> 284839 INFO (qtp16226598-27576) [n:127.0.0.1:53537_solr c:testschemaapi s:shard1 x:testschemaapi_shard1_replica1] o.a.s.s.IndexSchema [testschemaapi_shard1_replica1] Schema name=minimal
    [junit4] 2> 284839 INFO (qtp18956935-27566) [n:127.0.0.1:53536_solr c:testschemaapi s:shard1 x:testschemaapi_shard1_replica2] o.a.s.s.IndexSchema [testschemaapi_shard1_replica2] Schema name=minimal
    [junit4] 2> 284846 INFO (qtp16226598-27576) [n:127.0.0.1:53537_solr c:testschemaapi s:shard1 x:testschemaapi_shard1_replica1] o.a.s.s.IndexSchema unique key field: id
    [junit4] 2> 284846 INFO (qtp18956935-27566) [n:127.0.0.1:53536_solr c:testschemaapi s:shard1 x:testschemaapi_shard1_replica2] o.a.s.s.IndexSchema unique key field: id
    [junit4] 2> 284855 INFO (qtp16226598-27576) [n:127.0.0.1:53537_solr c:testschemaapi s:shard1 x:testschemaapi_shard1_replica1] o.a.s.c.ConfigSetProperties Did not find ConfigSet properties, assuming default properties: Can't find resource 'configsetprops.json' in classpath or '/configs/conf1', cwd=C:\Users\jenkins\workspace\Lucene-Solr-master-Windows\solr\build\solr-core\test\J0
    [junit4] 2> 284855 INFO (qtp16226598-27576) [n:127.0.0.1:53537_solr c:testschemaapi s:shard1 x:testschemaapi_shard1_replica1] o.a.s.c.CoreContainer Creating SolrCore 'testschemaapi_shard1_replica1' using configuration from collection testschemaapi
    [junit4] 2> 284855 INFO (qtp18956935-27566) [n:127.0.0.1:53536_solr c:testschemaapi s:shard1 x:testschemaapi_shard1_replica2] o.a.s.c.ConfigSetProperties Did not find ConfigSet properties, assuming default properties: Can't find resource 'configsetprops.json' in classpath or '/configs/conf1', cwd=C:\Users\jenkins\workspace\Lucene-Solr-master-Windows\solr\build\solr-core\test\J0
    [junit4] 2> 284855 INFO (qtp18956935-27566) [n:127.0.0.1:53536_solr c:testschemaapi s:shard1 x:testschemaapi_shard1_replica2] o.a.s.c.CoreContainer Creating SolrCore 'testschemaapi_shard1_replica2' using configuration from collection testschemaapi
    [junit4] 2> 284856 INFO (qtp16226598-27576) [n:127.0.0.1:53537_solr c:testschemaapi s:shard1 r:core_node1 x:testschemaapi_shard1_replica1] o.a.s.c.SolrCore org.apache.solr.core.MockDirectoryFactory
    [junit4] 2> 284856 INFO (qtp18956935-27566) [n:127.0.0.1:53536_solr c:testschemaapi s:shard1 r:core_node2 x:testschemaapi_shard1_replica2] o.a.s.c.SolrCore org.apache.solr.core.MockDirectoryFactory
    [junit4] 2> 284856 INFO (qtp16226598-27576) [n:127.0.0.1:53537_solr c:testschemaapi s:shard1 r:core_node1 x:testschemaapi_shard1_replica1] o.a.s.c.SolrCore [[testschemaapi_shard1_replica1] ] Opening new SolrCore at [C:\Users\jenkins\workspace\Lucene-Solr-master-Windows\solr\build\solr-core\test\J0\temp\solr.schema.TestManagedSchemaAPI_ECF6C003A73DEE0A-001\tempDir-001\node2\testschemaapi_shard1_replica1], dataDir=[C:\Users\jenkins\workspace\Lucene-Solr-master-Windows\solr\build\solr-core\test\J0\temp\solr.schema.TestManagedSchemaAPI_ECF6C003A73DEE0A-001\tempDir-001\node2\.\testschemaapi_shard1_replica1\data\]
    [junit4] 2> 284856 INFO (qtp18956935-27566) [n:127.0.0.1:53536_solr c:testschemaapi s:shard1 r:core_node2 x:testschemaapi_shard1_replica2] o.a.s.c.SolrCore [[testschemaapi_shard1_replica2] ] Opening new SolrCore at [C:\Users\jenkins\workspace\Lucene-Solr-master-Windows\solr\build\solr-core\test\J0\temp\solr.schema.TestManagedSchemaAPI_ECF6C003A73DEE0A-001\tempDir-001\node1\testschemaapi_shard1_replica2], dataDir=[C:\Users\jenkins\workspace\Lucene-Solr-master-Windows\solr\build\solr-core\test\J0\temp\solr.schema.TestManagedSchemaAPI_ECF6C003A73DEE0A-001\tempDir-001\node1\.\testschemaapi_shard1_replica2\data\]
    [junit4] 2> 284856 INFO (qtp18956935-27566) [n:127.0.0.1:53536_solr c:testschemaapi s:shard1 r:core_node2 x:testschemaapi_shard1_replica2] o.a.s.c.SolrCore JMX monitoring not detected for core: testschemaapi_shard1_replica2
    [junit4] 2> 284856 INFO (qtp16226598-27576) [n:127.0.0.1:53537_solr c:testschemaapi s:shard1 r:core_node1 x:testschemaapi_shard1_replica1] o.a.s.c.SolrCore JMX monitoring not detected for core: testschemaapi_shard1_replica1
    [junit4] 2> 284857 INFO (qtp18956935-27566) [n:127.0.0.1:53536_solr c:testschemaapi s:shard1 r:core_node2 x:testschemaapi_shard1_replica2] o.a.s.c.CachingDirectoryFactory return new directory for C:\Users\jenkins\workspace\Lucene-Solr-master-Windows\solr\build\solr-core\test\J0\temp\solr.schema.TestManagedSchemaAPI_ECF6C003A73DEE0A-001\tempDir-001\node1\.\testschemaapi_shard1_replica2\data\
    [junit4] 2> 284857 INFO (qtp16226598-27576) [n:127.0.0.1:53537_solr c:testschemaapi s:shard1 r:core_node1 x:testschemaapi_shard1_replica1] o.a.s.c.CachingDirectoryFactory return new directory for C:\Users\jenkins\workspace\Lucene-Solr-master-Windows\solr\build\solr-core\test\J0\temp\solr.schema.TestManagedSchemaAPI_ECF6C003A73DEE0A-001\tempDir-001\node2\.\testschemaapi_shard1_replica1\data\
    [junit4] 2> 284857 INFO (qtp18956935-27566) [n:127.0.0.1:53536_solr c:testschemaapi s:shard1 r:core_node2 x:testschemaapi_shard1_replica2] o.a.s.c.SolrCore New index directory detected: old=null new=C:\Users\jenkins\workspace\Lucene-Solr-master-Windows\solr\build\solr-core\test\J0\temp\solr.schema.TestManagedSchemaAPI_ECF6C003A73DEE0A-001\tempDir-001\node1\.\testschemaapi_shard1_replica2\data\index/
    [junit4] 2> 284857 INFO (qtp16226598-27576) [n:127.0.0.1:53537_solr c:testschemaapi s:shard1 r:core_node1 x:testschemaapi_shard1_replica1] o.a.s.c.SolrCore New index directory detected: old=null new=C:\Users\jenkins\workspace\Lucene-Solr-master-Windows\solr\build\solr-core\test\J0\temp\solr.schema.TestManagedSchemaAPI_ECF6C003A73DEE0A-001\tempDir-001\node2\.\testschemaapi_shard1_replica1\data\index/
    [junit4] 2> 284857 WARN (qtp16226598-27576) [n:127.0.0.1:53537_solr c:testschemaapi s:shard1 r:core_node1 x:testschemaapi_shard1_replica1] o.a.s.c.SolrCore [testschemaapi_shard1_replica1] Solr index directory 'C:\Users\jenkins\workspace\Lucene-Solr-master-Windows\solr\build\solr-core\test\J0\temp\solr.schema.TestManagedSchemaAPI_ECF6C003A73DEE0A-001\tempDir-001\node2\.\testschemaapi_shard1_replica1\data\index' doesn't exist. Creating new index...
    [junit4] 2> 284857 WARN (qtp18956935-27566) [n:127.0.0.1:53536_solr c:testschemaapi s:shard1 r:core_node2 x:testschemaapi_shard1_replica2] o.a.s.c.SolrCore [testschemaapi_shard1_replica2] Solr index directory 'C:\Users\jenkins\workspace\Lucene-Solr-master-Windows\solr\build\solr-core\test\J0\temp\solr.schema.TestManagedSchemaAPI_ECF6C003A73DEE0A-001\tempDir-001\node1\.\testschemaapi_shard1_replica2\data\index' doesn't exist. Creating new index...
    [junit4] 2> 284861 INFO (qtp16226598-27576) [n:127.0.0.1:53537_solr c:testschemaapi s:shard1 r:core_node1 x:testschemaapi_shard1_replica1] o.a.s.c.CachingDirectoryFactory return new directory for C:\Users\jenkins\workspace\Lucene-Solr-master-Windows\solr\build\solr-core\test\J0\temp\solr.schema.TestManagedSchemaAPI_ECF6C003A73DEE0A-001\tempDir-001\node2\.\testschemaapi_shard1_replica1\data\index
    [junit4] 2> 284861 INFO (qtp18956935-27566) [n:127.0.0.1:53536_solr c:testschemaapi s:shard1 r:core_node2 x:testschemaapi_shard1_replica2] o.a.s.c.CachingDirectoryFactory return new directory for C:\Users\jenkins\workspace\Lucene-Solr-master-Windows\solr\build\solr-core\test\J0\temp\solr.schema.TestManagedSchemaAPI_ECF6C003A73DEE0A-001\tempDir-001\node1\.\testschemaapi_shard1_replica2\data\index
    [junit4] 2> 284862 INFO (qtp18956935-27566) [n:127.0.0.1:53536_solr c:testschemaapi s:shard1 r:core_node2 x:testschemaapi_shard1_replica2] o.a.s.c.SolrDeletionPolicy SolrDeletionPolicy.onCommit: commits: num=1
    [junit4] 2> commit{dir=MockDirectoryWrapper(RAMDirectory@12cbe58 lockFactory=org.apache.lucene.store.SingleInstanceLockFactory@1be0bc5),segFN=segments_1,generation=1}
    [junit4] 2> 284862 INFO (qtp18956935-27566) [n:127.0.0.1:53536_solr c:testschemaapi s:shard1 r:core_node2 x:testschemaapi_shard1_replica2] o.a.s.c.SolrDeletionPolicy newest commit generation = 1
    [junit4] 2> 284862 INFO (qtp16226598-27576) [n:127.0.0.1:53537_solr c:testschemaapi s:shard1 r:core_node1 x:testschemaapi_shard1_replica1] o.a.s.c.SolrDeletionPolicy SolrDeletionPolicy.onCommit: commits: num=1
    [junit4] 2> commit{dir=MockDirectoryWrapper(RAMDirectory@1360511 lockFactory=org.apache.lucene.store.SingleInstanceLockFactory@b1344),segFN=segments_1,generation=1}
    [junit4] 2> 284863 INFO (qtp16226598-27576) [n:127.0.0.1:53537_solr c:testschemaapi s:shard1 r:core_node1 x:testschemaapi_shard1_replica1] o.a.s.c.SolrDeletionPolicy newest commit generation = 1
    [junit4] 2> 284865 INFO (OldIndexDirectoryCleanupThreadForCore-testschemaapi_shard1_replica2) [n:127.0.0.1:53536_solr c:testschemaapi s:shard1 r:core_node2 x:testschemaapi_shard1_replica2] o.a.s.c.SolrCore Looking for old index directories to cleanup for core testschemaapi_shard1_replica2 in C:\Users\jenkins\workspace\Lucene-Solr-master-Windows\solr\build\solr-core\test\J0\temp\solr.schema.TestManagedSchemaAPI_ECF6C003A73DEE0A-001\tempDir-001\node1\.\testschemaapi_shard1_replica2\data\
    [junit4] 2> 284865 WARN (OldIndexDirectoryCleanupThreadForCore-testschemaapi_shard1_replica2) [n:127.0.0.1:53536_solr c:testschemaapi s:shard1 r:core_node2 x:testschemaapi_shard1_replica2] o.a.s.c.DirectoryFactory C:\Users\jenkins\workspace\Lucene-Solr-master-Windows\solr\build\solr-core\test\J0\temp\solr.schema.TestManagedSchemaAPI_ECF6C003A73DEE0A-001\tempDir-001\node1\.\testschemaapi_shard1_replica2\data\ does not point to a valid data directory; skipping clean-up of old index directories.
    [junit4] 2> 284865 INFO (qtp16226598-27576) [n:127.0.0.1:53537_solr c:testschemaapi s:shard1 r:core_node1 x:testschemaapi_shard1_replica1] o.a.s.c.SolrCore no updateRequestProcessorChain defined as default, creating implicit default
    [junit4] 2> 284866 INFO (OldIndexDirectoryCleanupThreadForCore-testschemaapi_shard1_replica1) [n:127.0.0.1:53537_solr c:testschemaapi s:shard1 r:core_node1 x:testschemaapi_shard1_replica1] o.a.s.c.SolrCore Looking for old index directories to cleanup for core testschemaapi_shard1_replica1 in C:\Users\jenkins\workspace\Lucene-Solr-master-Windows\solr\build\solr-core\test\J0\temp\solr.schema.TestManagedSchemaAPI_ECF6C003A73DEE0A-001\tempDir-001\node2\.\testschemaapi_shard1_replica1\data\
    [junit4] 2> 284868 WARN (OldIndexDirectoryCleanupThreadForCore-testschemaapi_shard1_replica1) [n:127.0.0.1:53537_solr c:testschemaapi s:shard1 r:core_node1 x:testschemaapi_shard1_replica1] o.a.s.c.DirectoryFactory C:\Users\jenkins\workspace\Lucene-Solr-master-Windows\solr\build\solr-core\test\J0\temp\solr.schema.TestManagedSchemaAPI_ECF6C003A73DEE0A-001\tempDir-001\node2\.\testschemaapi_shard1_replica1\data\ does not point to a valid data directory; skipping clean-up of old index directories.
    [junit4] 2> 284873 INFO (qtp18956935-27566) [n:127.0.0.1:53536_solr c:testschemaapi s:shard1 r:core_node2 x:testschemaapi_shard1_replica2] o.a.s.c.SolrCore no updateRequestProcessorChain defined as default, creating implicit default
    [junit4] 2> 284876 INFO (qtp16226598-27576) [n:127.0.0.1:53537_solr c:testschemaapi s:shard1 r:core_node1 x:testschemaapi_shard1_replica1] o.a.s.h.l.XMLLoader xsltCacheLifetimeSeconds=60
    [junit4] 2> 284876 INFO (qtp18956935-27566) [n:127.0.0.1:53536_solr c:testschemaapi s:shard1 r:core_node2 x:testschemaapi_shard1_replica2] o.a.s.h.l.XMLLoader xsltCacheLifetimeSeconds=60
    [junit4] 2> 284878 INFO (qtp16226598-27576) [n:127.0.0.1:53537_solr c:testschemaapi s:shard1 r:core_node1 x:testschemaapi_shard1_replica1] o.a.s.h.l.XMLLoader xsltCacheLifetimeSeconds=60
    [junit4] 2> 284878 INFO (qtp18956935-27566) [n:127.0.0.1:53536_solr c:testschemaapi s:shard1 r:core_node2 x:testschemaapi_shard1_replica2] o.a.s.h.l.XMLLoader xsltCacheLifetimeSeconds=60
    [junit4] 2> 284880 INFO (qtp16226598-27576) [n:127.0.0.1:53537_solr c:testschemaapi s:shard1 r:core_node1 x:testschemaapi_shard1_replica1] o.a.s.h.l.XMLLoader xsltCacheLifetimeSeconds=60
    [junit4] 2> 284881 INFO (qtp18956935-27566) [n:127.0.0.1:53536_solr c:testschemaapi s:shard1 r:core_node2 x:testschemaapi_shard1_replica2] o.a.s.h.l.XMLLoader xsltCacheLifetimeSeconds=60
    [junit4] 2> 284881 INFO (qtp16226598-27576) [n:127.0.0.1:53537_solr c:testschemaapi s:shard1 r:core_node1 x:testschemaapi_shard1_replica1] o.a.s.h.l.XMLLoader xsltCacheLifetimeSeconds=60
    [junit4] 2> 284881 INFO (qtp18956935-27566) [n:127.0.0.1:53536_solr c:testschemaapi s:shard1 r:core_node2 x:testschemaapi_shard1_replica2] o.a.s.h.l.XMLLoader xsltCacheLifetimeSeconds=60
    [junit4] 2> 284886 INFO (qtp16226598-27576) [n:127.0.0.1:53537_solr c:testschemaapi s:shard1 r:core_node1 x:testschemaapi_shard1_replica1] o.a.s.c.RequestHandlers Registered paths: /admin/mbeans,/update/csv,/sql,/update/json/docs,/admin/luke,/graph,/export,/select,/admin/segments,/get,/admin/system,/replication,/admin/properties,/config,/stream,/schema,/admin/plugins,/admin/logging,/update/json,/admin/ping,/admin/threads,/update,/admin/file
    [junit4] 2> 284886 INFO (qtp18956935-27566) [n:127.0.0.1:53536_solr c:testschemaapi s:shard1 r:core_node2 x:testschemaapi_shard1_replica2] o.a.s.c.RequestHandlers Registered paths: /admin/mbeans,/update/csv,/sql,/update/json/docs,/admin/luke,/graph,/export,/select,/admin/segments,/get,/admin/system,/replication,/admin/properties,/config,/stream,/schema,/admin/plugins,/admin/logging,/update/json,/admin/ping,/admin/threads,/update,/admin/file
    [junit4] 2> 284887 INFO (qtp18956935-27566) [n:127.0.0.1:53536_solr c:testschemaapi s:shard1 r:core_node2 x:testschemaapi_shard1_replica2] o.a.s.c.SolrCore Using default statsCache cache: org.apache.solr.search.stats.LocalStatsCache
    [junit4] 2> 284887 INFO (qtp16226598-27576) [n:127.0.0.1:53537_solr c:testschemaapi s:shard1 r:core_node1 x:testschemaapi_shard1_replica1] o.a.s.c.SolrCore Using default statsCache cache: org.apache.solr.search.stats.LocalStatsCache
    [junit4] 2> 284888 INFO (qtp18956935-27566) [n:127.0.0.1:53536_solr c:testschemaapi s:shard1 r:core_node2 x:testschemaapi_shard1_replica2] o.a.s.u.UpdateHandler Using UpdateLog implementation: org.apache.solr.update.UpdateLog
    [junit4] 2> 284888 INFO (qtp18956935-27566) [n:127.0.0.1:53536_solr c:testschemaapi s:shard1 r:core_node2 x:testschemaapi_shard1_replica2] o.a.s.u.UpdateLog Initializing UpdateLog: dataDir=null defaultSyncLevel=FLUSH numRecordsToKeep=100 maxNumLogsToKeep=10 numVersionBuckets=65536
    [junit4] 2> 284888 INFO (qtp16226598-27576) [n:127.0.0.1:53537_solr c:testschemaapi s:shard1 r:core_node1 x:testschemaapi_shard1_replica1] o.a.s.u.UpdateHandler Using UpdateLog implementation: org.apache.solr.update.UpdateLog
    [junit4] 2> 284888 INFO (qtp16226598-27576) [n:127.0.0.1:53537_solr c:testschemaapi s:shard1 r:core_node1 x:testschemaapi_shard1_replica1] o.a.s.u.UpdateLog Initializing UpdateLog: dataDir=null defaultSyncLevel=FLUSH numRecordsToKeep=100 maxNumLogsToKeep=10 numVersionBuckets=65536
    [junit4] 2> 284891 INFO (qtp16226598-27576) [n:127.0.0.1:53537_solr c:testschemaapi s:shard1 r:core_node1 x:testschemaapi_shard1_replica1] o.a.s.u.CommitTracker Hard AutoCommit: disabled
    [junit4] 2> 284891 INFO (qtp16226598-27576) [n:127.0.0.1:53537_solr c:testschemaapi s:shard1 r:core_node1 x:testschemaapi_shard1_replica1] o.a.s.u.CommitTracker Soft AutoCommit: disabled
    [junit4] 2> 284891 INFO (qtp18956935-27566) [n:127.0.0.1:53536_solr c:testschemaapi s:shard1 r:core_node2 x:testschemaapi_shard1_replica2] o.a.s.u.CommitTracker Hard AutoCommit: disabled
    [junit4] 2> 284891 INFO (qtp18956935-27566) [n:127.0.0.1:53536_solr c:testschemaapi s:shard1 r:core_node2 x:testschemaapi_shard1_replica2] o.a.s.u.CommitTracker Soft AutoCommit: disabled
    [junit4] 2> 284892 INFO (qtp16226598-27576) [n:127.0.0.1:53537_solr c:testschemaapi s:shard1 r:core_node1 x:testschemaapi_shard1_replica1] o.a.s.c.SolrDeletionPolicy SolrDeletionPolicy.onInit: commits: num=1
    [junit4] 2> commit{dir=MockDirectoryWrapper(RAMDirectory@1360511 lockFactory=org.apache.lucene.store.SingleInstanceLockFactory@b1344),segFN=segments_1,generation=1}
    [junit4] 2> 284892 INFO (qtp18956935-27566) [n:127.0.0.1:53536_solr c:testschemaapi s:shard1 r:core_node2 x:testschemaapi_shard1_replica2] o.a.s.c.SolrDeletionPolicy SolrDeletionPolicy.onInit: commits: num=1
    [junit4] 2> commit{dir=MockDirectoryWrapper(RAMDirectory@12cbe58 lockFactory=org.apache.lucene.store.SingleInstanceLockFactory@1be0bc5),segFN=segments_1,generation=1}
    [junit4] 2> 284892 INFO (qtp16226598-27576) [n:127.0.0.1:53537_solr c:testschemaapi s:shard1 r:core_node1 x:testschemaapi_shard1_replica1] o.a.s.c.SolrDeletionPolicy newest commit generation = 1
    [junit4] 2> 284892 INFO (qtp18956935-27566) [n:127.0.0.1:53536_solr c:testschemaapi s:shard1 r:core_node2 x:testschemaapi_shard1_replica2] o.a.s.c.SolrDeletionPolicy newest commit generation = 1
    [junit4] 2> 284892 INFO (qtp16226598-27576) [n:127.0.0.1:53537_solr c:testschemaapi s:shard1 r:core_node1 x:testschemaapi_shard1_replica1] o.a.s.s.SolrIndexSearcher Opening [Searcher@1172377[testschemaapi_shard1_replica1] main]
    [junit4] 2> 284892 INFO (qtp18956935-27566) [n:127.0.0.1:53536_solr c:testschemaapi s:shard1 r:core_node2 x:testschemaapi_shard1_replica2] o.a.s.s.SolrIndexSearcher Opening [Searcher@6a2b60[testschemaapi_shard1_replica2] main]
    [junit4] 2> 284892 INFO (qtp16226598-27576) [n:127.0.0.1:53537_solr c:testschemaapi s:shard1 r:core_node1 x:testschemaapi_shard1_replica1] o.a.s.c.c.ZkStateReader Load collection config from: [/collections/testschemaapi]
    [junit4] 2> 284892 INFO (qtp18956935-27566) [n:127.0.0.1:53536_solr c:testschemaapi s:shard1 r:core_node2 x:testschemaapi_shard1_replica2] o.a.s.c.c.ZkStateReader Load collection config from: [/collections/testschemaapi]
    [junit4] 2> 284894 INFO (qtp18956935-27566) [n:127.0.0.1:53536_solr c:testschemaapi s:shard1 r:core_node2 x:testschemaapi_shard1_replica2] o.a.s.c.c.ZkStateReader path=[/collections/testschemaapi] [configName]=[conf1] specified config exists in ZooKeeper
    [junit4] 2> 284894 INFO (qtp16226598-27576) [n:127.0.0.1:53537_solr c:testschemaapi s:shard1 r:core_node1 x:testschemaapi_shard1_replica1] o.a.s.c.c.ZkStateReader path=[/collections/testschemaapi] [configName]=[conf1] specified config exists in ZooKeeper
    [junit4] 2> 284894 INFO (qtp16226598-27576) [n:127.0.0.1:53537_solr c:testschemaapi s:shard1 r:core_node1 x:testschemaapi_shard1_replica1] o.a.s.r.ManagedResourceStorage Setting up ZooKeeper-based storage for the RestManager with znodeBase: /configs/conf1
    [junit4] 2> 284894 INFO (qtp18956935-27566) [n:127.0.0.1:53536_solr c:testschemaapi s:shard1 r:core_node2 x:testschemaapi_shard1_replica2] o.a.s.r.ManagedResourceStorage Setting up ZooKeeper-based storage for the RestManager with znodeBase: /configs/conf1
    [junit4] 2> 284895 INFO (qtp16226598-27576) [n:127.0.0.1:53537_solr c:testschemaapi s:shard1 r:core_node1 x:testschemaapi_shard1_replica1] o.a.s.r.ManagedResourceStorage Configured ZooKeeperStorageIO with znodeBase: /configs/conf1
    [junit4] 2> 284895 INFO (qtp18956935-27566) [n:127.0.0.1:53536_solr c:testschemaapi s:shard1 r:core_node2 x:testschemaapi_shard1_replica2] o.a.s.r.ManagedResourceStorage Configured ZooKeeperStorageIO with znodeBase: /configs/conf1
    [junit4] 2> 284895 INFO (qtp16226598-27576) [n:127.0.0.1:53537_solr c:testschemaapi s:shard1 r:core_node1 x:testschemaapi_shard1_replica1] o.a.s.r.RestManager Initializing RestManager with initArgs: {}
    [junit4] 2> 284895 INFO (qtp18956935-27566) [n:127.0.0.1:53536_solr c:testschemaapi s:shard1 r:core_node2 x:testschemaapi_shard1_replica2] o.a.s.r.RestManager Initializing RestManager with initArgs: {}
    [junit4] 2> 284895 INFO (qtp16226598-27576) [n:127.0.0.1:53537_solr c:testschemaapi s:shard1 r:core_node1 x:testschemaapi_shard1_replica1] o.a.s.r.ManagedResourceStorage Reading _rest_managed.json using ZooKeeperStorageIO:path=/configs/conf1
    [junit4] 2> 284895 INFO (qtp18956935-27566) [n:127.0.0.1:53536_solr c:testschemaapi s:shard1 r:core_node2 x:testschemaapi_shard1_replica2] o.a.s.r.ManagedResourceStorage Reading _rest_managed.json using ZooKeeperStorageIO:path=/configs/conf1
    [junit4] 2> 284895 INFO (qtp16226598-27576) [n:127.0.0.1:53537_solr c:testschemaapi s:shard1 r:core_node1 x:testschemaapi_shard1_replica1] o.a.s.r.ManagedResourceStorage No data found for znode /configs/conf1/_rest_managed.json
    [junit4] 2> 284897 INFO (qtp16226598-27576) [n:127.0.0.1:53537_solr c:testschemaapi s:shard1 r:core_node1 x:testschemaapi_shard1_replica1] o.a.s.r.ManagedResourceStorage Loaded null at path _rest_managed.json using ZooKeeperStorageIO:path=/configs/conf1
    [junit4] 2> 284897 INFO (qtp18956935-27566) [n:127.0.0.1:53536_solr c:testschemaapi s:shard1 r:core_node2 x:testschemaapi_shard1_replica2] o.a.s.r.ManagedResourceStorage No data found for znode /configs/conf1/_rest_managed.json
    [junit4] 2> 284897 INFO (qtp16226598-27576) [n:127.0.0.1:53537_solr c:testschemaapi s:shard1 r:core_node1 x:testschemaapi_shard1_replica1] o.a.s.r.RestManager Initializing 0 registered ManagedResources
    [junit4] 2> 284897 INFO (qtp16226598-27576) [n:127.0.0.1:53537_solr c:testschemaapi s:shard1 r:core_node1 x:testschemaapi_shard1_replica1] o.a.s.s.ZkIndexSchemaReader Creating ZooKeeper watch for the managed schema at /configs/conf1/managed-schema
    [junit4] 2> 284897 INFO (qtp18956935-27566) [n:127.0.0.1:53536_solr c:testschemaapi s:shard1 r:core_node2 x:testschemaapi_shard1_replica2] o.a.s.r.ManagedResourceStorage Loaded null at path _rest_managed.json using ZooKeeperStorageIO:path=/configs/conf1
    [junit4] 2> 284897 INFO (qtp18956935-27566) [n:127.0.0.1:53536_solr c:testschemaapi s:shard1 r:core_node2 x:testschemaapi_shard1_replica2] o.a.s.r.RestManager Initializing 0 registered ManagedResources
    [junit4] 2> 284897 INFO (qtp18956935-27566) [n:127.0.0.1:53536_solr c:testschemaapi s:shard1 r:core_node2 x:testschemaapi_shard1_replica2] o.a.s.s.ZkIndexSchemaReader Creating ZooKeeper watch for the managed schema at /configs/conf1/managed-schema
    [junit4] 2> 284897 INFO (qtp16226598-27576) [n:127.0.0.1:53537_solr c:testschemaapi s:shard1 r:core_node1 x:testschemaapi_shard1_replica1] o.a.s.c.ZkController Added new OnReconnect listener ZkIndexSchemaReader: /configs/conf1/managed-schema, uniqueCoreId: testschemaapi_shard1_replica1:147863922415317
    [junit4] 2> 284897 INFO (qtp16226598-27576) [n:127.0.0.1:53537_solr c:testschemaapi s:shard1 r:core_node1 x:testschemaapi_shard1_replica1] o.a.s.h.ReplicationHandler Commits will be reserved for 10000
    [junit4] 2> 284898 INFO (qtp18956935-27566) [n:127.0.0.1:53536_solr c:testschemaapi s:shard1 r:core_node2 x:testschemaapi_shard1_replica2] o.a.s.c.ZkController Added new OnReconnect listener ZkIndexSchemaReader: /configs/conf1/managed-schema, uniqueCoreId: testschemaapi_shard1_replica2:147863922674176
    [junit4] 2> 284898 INFO (qtp18956935-27566) [n:127.0.0.1:53536_solr c:testschemaapi s:shard1 r:core_node2 x:testschemaapi_shard1_replica2] o.a.s.h.ReplicationHandler Commits will be reserved for 10000
    [junit4] 2> 284898 INFO (searcherExecutor-2211-thread-1-processing-n:127.0.0.1:53537_solr x:testschemaapi_shard1_replica1 s:shard1 c:testschemaapi r:core_node1) [n:127.0.0.1:53537_solr c:testschemaapi s:shard1 r:core_node1 x:testschemaapi_shard1_replica1] o.a.s.c.SolrCore [testschemaapi_shard1_replica1] Registered new searcher Searcher@1172377[testschemaapi_shard1_replica1] main{ExitableDirectoryReader(UninvertingDirectoryReader())}
    [junit4] 2> 284898 INFO (qtp18956935-27566) [n:127.0.0.1:53536_solr c:testschemaapi s:shard1 r:core_node2 x:testschemaapi_shard1_replica2] o.a.s.u.UpdateLog Looking up max value of version field to seed version buckets
    [junit4] 2> 284898 INFO (searcherExecutor-2212-thread-1-processing-n:127.0.0.1:53536_solr x:testschemaapi_shard1_replica2 s:shard1 c:testschemaapi r:core_node2) [n:127.0.0.1:53536_solr c:testschemaapi s:shard1 r:core_node2 x:testschemaapi_shard1_replica2] o.a.s.c.SolrCore [testschemaapi_shard1_replica2] Registered new searcher Searcher@6a2b60[testschemaapi_shard1_replica2] main{ExitableDirectoryReader(UninvertingDirectoryReader())}
    [junit4] 2> 284898 INFO (qtp18956935-27566) [n:127.0.0.1:53536_solr c:testschemaapi s:shard1 r:core_node2 x:testschemaapi_shard1_replica2] o.a.s.u.VersionInfo Refreshing highest value of _version_ for 65536 version buckets from index
    [junit4] 2> 284898 INFO (qtp18956935-27566) [n:127.0.0.1:53536_solr c:testschemaapi s:shard1 r:core_node2 x:testschemaapi_shard1_replica2] o.a.s.u.VersionInfo No terms found for _version_, cannot seed version bucket highest value from index
    [junit4] 2> 284898 INFO (qtp16226598-27576) [n:127.0.0.1:53537_solr c:testschemaapi s:shard1 r:core_node1 x:testschemaapi_shard1_replica1] o.a.s.u.UpdateLog Looking up max value of version field to seed version buckets
    [junit4] 2> 284898 INFO (qtp18956935-27566) [n:127.0.0.1:53536_solr c:testschemaapi s:shard1 r:core_node2 x:testschemaapi_shard1_replica2] o.a.s.u.UpdateLog Could not find max version in index or recent updates, using new clock 1537466844456157184
    [junit4] 2> 284898 INFO (qtp16226598-27576) [n:127.0.0.1:53537_solr c:testschemaapi s:shard1 r:core_node1 x:testschemaapi_shard1_replica1] o.a.s.u.VersionInfo Refreshing highest value of _version_ for 65536 version buckets from index
    [junit4] 2> 284898 INFO (qtp16226598-27576) [n:127.0.0.1:53537_solr c:testschemaapi s:shard1 r:core_node1 x:testschemaapi_shard1_replica1] o.a.s.u.VersionInfo No terms found for _version_, cannot seed version bucket highest value from index
    [junit4] 2> 284898 INFO (qtp16226598-27576) [n:127.0.0.1:53537_solr c:testschemaapi s:shard1 r:core_node1 x:testschemaapi_shard1_replica1] o.a.s.u.UpdateLog Could not find max version in index or recent updates, using new clock 1537466844456157184
    [junit4] 2> 284901 INFO (qtp16226598-27576) [n:127.0.0.1:53537_solr c:testschemaapi s:shard1 r:core_node1 x:testschemaapi_shard1_replica1] o.a.s.u.UpdateLog Took 2.0ms to seed version buckets with highest version 1537466844456157184
    [junit4] 2> 284901 INFO (qtp18956935-27566) [n:127.0.0.1:53536_solr c:testschemaapi s:shard1 r:core_node2 x:testschemaapi_shard1_replica2] o.a.s.u.UpdateLog Took 3.0ms to seed version buckets with highest version 1537466844456157184
    [junit4] 2> 284901 INFO (qtp16226598-27576) [n:127.0.0.1:53537_solr c:testschemaapi s:shard1 r:core_node1 x:testschemaapi_shard1_replica1] o.a.s.c.ZkController watch zkdir /configs/

[...truncated too long message...]

roller$4.run(ZkController.java:2405)
    [junit4] 2> Caused by: org.apache.solr.common.SolrException: Could not find config name for collection:testschemaapi
    [junit4] 2> at org.apache.solr.core.SolrCore.<init>(SolrCore.java:772)
    [junit4] 2> at org.apache.solr.core.SolrCore.reload(SolrCore.java:461)
    [junit4] 2> at org.apache.solr.core.CoreContainer.reload(CoreContainer.java:937)
    [junit4] 2> ... 2 more
    [junit4] 2> Caused by: org.apache.solr.common.SolrException: Could not find config name for collection:testschemaapi
    [junit4] 2> at org.apache.solr.rest.ManagedResourceStorage.newStorageIO(ManagedResourceStorage.java:101)
    [junit4] 2> at org.apache.solr.core.SolrCore.initRestManager(SolrCore.java:2304)
    [junit4] 2> at org.apache.solr.core.SolrCore.<init>(SolrCore.java:748)
    [junit4] 2> ... 4 more
    [junit4] 2> NOTE: test params are: codec=CheapBastard, sim=RandomSimilarity(queryNorm=true,coord=yes): {}, locale=mt-MT, timezone=Etc/GMT+2
    [junit4] 2> NOTE: Windows 10 10.0 x86/Oracle Corporation 1.8.0_92 (32-bit)/cpus=3,threads=1,free=32622096,total=138485760
    [junit4] 2> NOTE: All tests run in this JVM: [TestWordDelimiterFilterFactory, TestTestInjection, StressHdfsTest, TestRandomDVFaceting, TestCSVLoader, TestNoOpRegenerator, TestMinMaxOnMultiValuedField, DataDrivenBlockJoinTest, TestLeaderElectionZkExpiry, TestTrackingShardHandlerFactory, RankQueryTest, TestGroupingSearch, TestPostingsSolrHighlighter, TestSweetSpotSimilarityFactory, TestTolerantUpdateProcessorRandomCloud, TestPerFieldSimilarityWithDefaultOverride, DocValuesMultiTest, TestSurroundQueryParser, DocumentBuilderTest, TestStressReorder, TestXIncludeConfig, TestNRTOpen, TestQueryWrapperFilter, TestArbitraryIndexDir, PrimitiveFieldTypeTest, DateRangeFieldTest, TestInfoStreamLogging, TestFreeTextSuggestions, DistributedFacetPivotSmallTest, DisMaxRequestHandlerTest, PolyFieldTest, TestStressLiveNodes, SharedFSAutoReplicaFailoverTest, TestMacros, SuggesterFSTTest, DeleteShardTest, SimpleCollectionCreateDeleteTest, SuggestComponentTest, RollingRestartTest, TestManagedSchemaAPI]
    [junit4] 2> NOTE: reproduce with: ant test -Dtestcase=TestManagedSchemaAPI -Dtests.seed=ECF6C003A73DEE0A -Dtests.slow=true -Dtests.locale=mt-MT -Dtests.timezone=Etc/GMT+2 -Dtests.asserts=true -Dtests.file.encoding=Cp1252
    [junit4] ERROR 0.00s J0 | TestManagedSchemaAPI (suite) <<<
    [junit4] > Throwable #1: java.lang.AssertionError: ObjectTracker found 8 object(s) that were not released!!! [MockDirectoryWrapper, MockDirectoryWrapper, MockDirectoryWrapper, MockDirectoryWrapper, MDCAwareThreadPoolExecutor, TransactionLog, MDCAwareThreadPoolExecutor, TransactionLog]
    [junit4] > at __randomizedtesting.SeedInfo.seed([ECF6C003A73DEE0A]:0)
    [junit4] > at org.apache.solr.SolrTestCaseJ4.teardownTestCases(SolrTestCaseJ4.java:256)
    [junit4] > at java.lang.Thread.run(Thread.java:745)Throwable #2: java.io.IOException: Could not remove the following files (in the order of attempts):
    [junit4] > C:\Users\jenkins\workspace\Lucene-Solr-master-Windows\solr\build\solr-core\test\J0\temp\solr.schema.TestManagedSchemaAPI_ECF6C003A73DEE0A-001\tempDir-001\node1\testschemaapi_shard1_replica2\data\tlog\tlog.0000000000000000000: java.nio.file.FileSystemException: C:\Users\jenkins\workspace\Lucene-Solr-master-Windows\solr\build\solr-core\test\J0\temp\solr.schema.TestManagedSchemaAPI_ECF6C003A73DEE0A-001\tempDir-001\node1\testschemaapi_shard1_replica2\data\tlog\tlog.0000000000000000000: The process cannot access the file because it is being used by another process.
    [junit4] > C:\Users\jenkins\workspace\Lucene-Solr-master-Windows\solr\build\solr-core\test\J0\temp\solr.schema.TestManagedSchemaAPI_ECF6C003A73DEE0A-001\tempDir-001\node1\testschemaapi_shard1_replica2\data\tlog: java.nio.file.DirectoryNotEmptyException: C:\Users\jenkins\workspace\Lucene-Solr-master-Windows\solr\build\solr-core\test\J0\temp\solr.schema.TestManagedSchemaAPI_ECF6C003A73DEE0A-001\tempDir-001\node1\testschemaapi_shard1_replica2\data\tlog
    [junit4] > C:\Users\jenkins\workspace\Lucene-Solr-master-Windows\solr\build\solr-core\test\J0\temp\solr.schema.TestManagedSchemaAPI_ECF6C003A73DEE0A-001\tempDir-001\node1\testschemaapi_shard1_replica2\data: java.nio.file.DirectoryNotEmptyException: C:\Users\jenkins\workspace\Lucene-Solr-master-Windows\solr\build\solr-core\test\J0\temp\solr.schema.TestManagedSchemaAPI_ECF6C003A73DEE0A-001\tempDir-001\node1\testschemaapi_shard1_replica2\data
    [junit4] > C:\Users\jenkins\workspace\Lucene-Solr-master-Windows\solr\build\solr-core\test\J0\temp\solr.schema.TestManagedSchemaAPI_ECF6C003A73DEE0A-001\tempDir-001\node1\testschemaapi_shard1_replica2: java.nio.file.DirectoryNotEmptyException: C:\Users\jenkins\workspace\Lucene-Solr-master-Windows\solr\build\solr-core\test\J0\temp\solr.schema.TestManagedSchemaAPI_ECF6C003A73DEE0A-001\tempDir-001\node1\testschemaapi_shard1_replica2
    [junit4] > C:\Users\jenkins\workspace\Lucene-Solr-master-Windows\solr\build\solr-core\test\J0\temp\solr.schema.TestManagedSchemaAPI_ECF6C003A73DEE0A-001\tempDir-001\node1: java.nio.file.DirectoryNotEmptyException: C:\Users\jenkins\workspace\Lucene-Solr-master-Windows\solr\build\solr-core\test\J0\temp\solr.schema.TestManagedSchemaAPI_ECF6C003A73DEE0A-001\tempDir-001\node1
    [junit4] > C:\Users\jenkins\workspace\Lucene-Solr-master-Windows\solr\build\solr-core\test\J0\temp\solr.schema.TestManagedSchemaAPI_ECF6C003A73DEE0A-001\tempDir-001\node2\testschemaapi_shard1_replica1\data\tlog\tlog.0000000000000000001: java.nio.file.FileSystemException: C:\Users\jenkins\workspace\Lucene-Solr-master-Windows\solr\build\solr-core\test\J0\temp\solr.schema.TestManagedSchemaAPI_ECF6C003A73DEE0A-001\tempDir-001\node2\testschemaapi_shard1_replica1\data\tlog\tlog.0000000000000000001: The process cannot access the file because it is being used by another process.
    [junit4] > C:\Users\jenkins\workspace\Lucene-Solr-master-Windows\solr\build\solr-core\test\J0\temp\solr.schema.TestManagedSchemaAPI_ECF6C003A73DEE0A-001\tempDir-001\node2\testschemaapi_shard1_replica1\data\tlog: java.nio.file.DirectoryNotEmptyException: C:\Users\jenkins\workspace\Lucene-Solr-master-Windows\solr\build\solr-core\test\J0\temp\solr.schema.TestManagedSchemaAPI_ECF6C003A73DEE0A-001\tempDir-001\node2\testschemaapi_shard1_replica1\data\tlog
    [junit4] > C:\Users\jenkins\workspace\Lucene-Solr-master-Windows\solr\build\solr-core\test\J0\temp\solr.schema.TestManagedSchemaAPI_ECF6C003A73DEE0A-001\tempDir-001\node2\testschemaapi_shard1_replica1\data: java.nio.file.DirectoryNotEmptyException: C:\Users\jenkins\workspace\Lucene-Solr-master-Windows\solr\build\solr-core\test\J0\temp\solr.schema.TestManagedSchemaAPI_ECF6C003A73DEE0A-001\tempDir-001\node2\testschemaapi_shard1_replica1\data
    [junit4] > C:\Users\jenkins\workspace\Lucene-Solr-master-Windows\solr\build\solr-core\test\J0\temp\solr.schema.TestManagedSchemaAPI_ECF6C003A73DEE0A-001\tempDir-001\node2\testschemaapi_shard1_replica1: java.nio.file.DirectoryNotEmptyException: C:\Users\jenkins\workspace\Lucene-Solr-master-Windows\solr\build\solr-core\test\J0\temp\solr.schema.TestManagedSchemaAPI_ECF6C003A73DEE0A-001\tempDir-001\node2\testschemaapi_shard1_replica1
    [junit4] > C:\Users\jenkins\workspace\Lucene-Solr-master-Windows\solr\build\solr-core\test\J0\temp\solr.schema.TestManagedSchemaAPI_ECF6C003A73DEE0A-001\tempDir-001\node2: java.nio.file.DirectoryNotEmptyException: C:\Users\jenkins\workspace\Lucene-Solr-master-Windows\solr\build\solr-core\test\J0\temp\solr.schema.TestManagedSchemaAPI_ECF6C003A73DEE0A-001\tempDir-001\node2
    [junit4] > C:\Users\jenkins\workspace\Lucene-Solr-master-Windows\solr\build\solr-core\test\J0\temp\solr.schema.TestManagedSchemaAPI_ECF6C003A73DEE0A-001\tempDir-001: java.nio.file.DirectoryNotEmptyException: C:\Users\jenkins\workspace\Lucene-Solr-master-Windows\solr\build\solr-core\test\J0\temp\solr.schema.TestManagedSchemaAPI_ECF6C003A73DEE0A-001\tempDir-001
    [junit4] > C:\Users\jenkins\workspace\Lucene-Solr-master-Windows\solr\build\solr-core\test\J0\temp\solr.schema.TestManagedSchemaAPI_ECF6C003A73DEE0A-001: java.nio.file.DirectoryNotEmptyException: C:\Users\jenkins\workspace\Lucene-Solr-master-Windows\solr\build\solr-core\test\J0\temp\solr.schema.TestManagedSchemaAPI_ECF6C003A73DEE0A-001
    [junit4] > at org.apache.lucene.util.IOUtils.rm(IOUtils.java:323)
    [junit4] > at java.lang.Thread.run(Thread.java:745)
    [junit4] Completed [72/614 (1!)] on J0 in 14.06s, 1 test, 1 failure, 1 error <<< FAILURES!

[...truncated 1784 lines...]
BUILD FAILED
C:\Users\jenkins\workspace\Lucene-Solr-master-Windows\build.xml:740: The following error occurred while executing this line:
C:\Users\jenkins\workspace\Lucene-Solr-master-Windows\build.xml:684: The following error occurred while executing this line:
C:\Users\jenkins\workspace\Lucene-Solr-master-Windows\build.xml:59: The following error occurred while executing this line:
C:\Users\jenkins\workspace\Lucene-Solr-master-Windows\solr\build.xml:233: The following error occurred while executing this line:
C:\Users\jenkins\workspace\Lucene-Solr-master-Windows\solr\common-build.xml:531: The following error occurred while executing this line:
C:\Users\jenkins\workspace\Lucene-Solr-master-Windows\lucene\common-build.xml:1427: The following error occurred while executing this line:
C:\Users\jenkins\workspace\Lucene-Solr-master-Windows\lucene\common-build.xml:984: There were test failures: 614 suites (10 ignored), 2584 tests, 2 suite-level errors, 126 ignored (82 assumptions) [seed: ECF6C003A73DEE0A]

Total time: 83 minutes 35 seconds
Build step 'Invoke Ant' marked build as failure
Archiving artifacts
[WARNINGS] Skipping publisher since build result is FAILURE
Recording test results
Email was triggered for: Failure - Any
Sending email for trigger: Failure - Any

Search Discussions

Related Discussions

Discussion Navigation
viewthread | post
posts ‹ prev | 1 of 1 | next ›
Discussion Overview
groupdev @
categorieslucene
postedJun 18, '16 at 10:35a
activeJun 18, '16 at 10:35a
posts1
users1
websitelucene.apache.org

1 user in discussion

Policeman Jenkins Server: 1 post

People

Translate

site design / logo © 2017 Grokbase