Grokbase Groups Lucene dev June 2016
FAQ
Build: http://jenkins.thetaphi.de/job/Lucene-Solr-master-Linux/17006/
Java: 64bit/jdk1.8.0_92 -XX:+UseCompressedOops -XX:+UseParallelGC

2 tests failed.
FAILED: org.apache.solr.cloud.ChaosMonkeySafeLeaderTest.test

Error Message:
java.util.concurrent.TimeoutException: Could not connect to ZooKeeper 127.0.0.1:45257/solr within 10000 ms

Stack Trace:
org.apache.solr.common.SolrException: java.util.concurrent.TimeoutException: Could not connect to ZooKeeper 127.0.0.1:45257/solr within 10000 ms
  at __randomizedtesting.SeedInfo.seed([82ED2FD3D6DF749A:AB9100978231962]:0)
  at org.apache.solr.common.cloud.SolrZkClient.(SolrZkClient.java:114)
  at org.apache.solr.common.cloud.SolrZkClient.(ZkStateReader.java:227)
  at org.apache.solr.client.solrj.impl.CloudSolrClient.connect(CloudSolrClient.java:502)
  at org.apache.solr.client.solrj.impl.CloudSolrClient.requestWithRetryOnStaleState(CloudSolrClient.java:951)
  at org.apache.solr.client.solrj.impl.CloudSolrClient.request(CloudSolrClient.java:934)
  at org.apache.solr.client.solrj.SolrClient.request(SolrClient.java:1219)
  at org.apache.solr.cloud.AbstractFullDistribZkTestBase.createCollection(AbstractFullDistribZkTestBase.java:1599)
  at org.apache.solr.cloud.AbstractFullDistribZkTestBase.createCollection(AbstractFullDistribZkTestBase.java:1620)
  at org.apache.solr.cloud.ChaosMonkeySafeLeaderTest.test(ChaosMonkeySafeLeaderTest.java:176)
  at sun.reflect.NativeMethodAccessorImpl.invoke0(Native Method)
  at sun.reflect.NativeMethodAccessorImpl.invoke(NativeMethodAccessorImpl.java:62)
  at sun.reflect.DelegatingMethodAccessorImpl.invoke(DelegatingMethodAccessorImpl.java:43)
  at java.lang.reflect.Method.invoke(Method.java:498)
  at com.carrotsearch.randomizedtesting.RandomizedRunner.invoke(RandomizedRunner.java:1764)
  at com.carrotsearch.randomizedtesting.RandomizedRunner$8.evaluate(RandomizedRunner.java:871)
  at com.carrotsearch.randomizedtesting.RandomizedRunner$9.evaluate(RandomizedRunner.java:907)
  at com.carrotsearch.randomizedtesting.RandomizedRunner$10.evaluate(RandomizedRunner.java:921)
  at org.apache.solr.BaseDistributedSearchTestCase$ShardsRepeatRule$ShardsFixedStatement.callStatement(BaseDistributedSearchTestCase.java:985)
  at org.apache.solr.BaseDistributedSearchTestCase$ShardsRepeatRule$ShardsStatement.evaluate(BaseDistributedSearchTestCase.java:960)
  at com.carrotsearch.randomizedtesting.rules.SystemPropertiesRestoreRule$1.evaluate(SystemPropertiesRestoreRule.java:57)
  at org.apache.lucene.util.TestRuleSetupTeardownChained$1.evaluate(TestRuleSetupTeardownChained.java:49)
  at org.apache.lucene.util.AbstractBeforeAfterRule$1.evaluate(AbstractBeforeAfterRule.java:45)
  at org.apache.lucene.util.TestRuleThreadAndTestName$1.evaluate(TestRuleThreadAndTestName.java:48)
  at org.apache.lucene.util.TestRuleIgnoreAfterMaxFailures$1.evaluate(TestRuleIgnoreAfterMaxFailures.java:64)
  at org.apache.lucene.util.TestRuleMarkFailure$1.evaluate(TestRuleMarkFailure.java:47)
  at com.carrotsearch.randomizedtesting.rules.StatementAdapter.evaluate(StatementAdapter.java:36)
  at com.carrotsearch.randomizedtesting.ThreadLeakControl$StatementRunner.run(ThreadLeakControl.java:367)
  at com.carrotsearch.randomizedtesting.ThreadLeakControl.forkTimeoutingTask(ThreadLeakControl.java:809)
  at com.carrotsearch.randomizedtesting.ThreadLeakControl$3.evaluate(ThreadLeakControl.java:460)
  at com.carrotsearch.randomizedtesting.RandomizedRunner.runSingleTest(RandomizedRunner.java:880)
  at com.carrotsearch.randomizedtesting.RandomizedRunner$5.evaluate(RandomizedRunner.java:781)
  at com.carrotsearch.randomizedtesting.RandomizedRunner$6.evaluate(RandomizedRunner.java:816)
  at com.carrotsearch.randomizedtesting.RandomizedRunner$7.evaluate(RandomizedRunner.java:827)
  at com.carrotsearch.randomizedtesting.rules.StatementAdapter.evaluate(StatementAdapter.java:36)
  at com.carrotsearch.randomizedtesting.rules.SystemPropertiesRestoreRule$1.evaluate(SystemPropertiesRestoreRule.java:57)
  at org.apache.lucene.util.AbstractBeforeAfterRule$1.evaluate(AbstractBeforeAfterRule.java:45)
  at com.carrotsearch.randomizedtesting.rules.StatementAdapter.evaluate(StatementAdapter.java:36)
  at org.apache.lucene.util.TestRuleStoreClassName$1.evaluate(TestRuleStoreClassName.java:41)
  at com.carrotsearch.randomizedtesting.rules.NoShadowingOrOverridesOnMethodsRule$1.evaluate(NoShadowingOrOverridesOnMethodsRule.java:40)
  at com.carrotsearch.randomizedtesting.rules.NoShadowingOrOverridesOnMethodsRule$1.evaluate(NoShadowingOrOverridesOnMethodsRule.java:40)
  at com.carrotsearch.randomizedtesting.rules.StatementAdapter.evaluate(StatementAdapter.java:36)
  at com.carrotsearch.randomizedtesting.rules.StatementAdapter.evaluate(StatementAdapter.java:36)
  at com.carrotsearch.randomizedtesting.rules.StatementAdapter.evaluate(StatementAdapter.java:36)
  at org.apache.lucene.util.TestRuleAssertionsRequired$1.evaluate(TestRuleAssertionsRequired.java:53)
  at org.apache.lucene.util.TestRuleMarkFailure$1.evaluate(TestRuleMarkFailure.java:47)
  at org.apache.lucene.util.TestRuleIgnoreAfterMaxFailures$1.evaluate(TestRuleIgnoreAfterMaxFailures.java:64)
  at org.apache.lucene.util.TestRuleIgnoreTestSuites$1.evaluate(TestRuleIgnoreTestSuites.java:54)
  at com.carrotsearch.randomizedtesting.rules.StatementAdapter.evaluate(StatementAdapter.java:36)
  at com.carrotsearch.randomizedtesting.ThreadLeakControl$StatementRunner.run(ThreadLeakControl.java:367)
  at java.lang.Thread.run(Thread.java:745)
Caused by: java.util.concurrent.TimeoutException: Could not connect to ZooKeeper 127.0.0.1:45257/solr within 10000 ms
  at org.apache.solr.common.cloud.ConnectionManager.waitForConnected(ConnectionManager.java:228)
  at org.apache.solr.common.cloud.SolrZkClient.<init>(SolrZkClient.java:172)
  ... 51 more


FAILED: org.apache.solr.schema.TestManagedSchemaAPI.test

Error Message:
Error from server at https://127.0.0.1:34064/solr/testschemaapi_shard1_replica2: ERROR: [doc=2] unknown field 'myNewField1'

Stack Trace:
org.apache.solr.client.solrj.impl.CloudSolrClient$RouteException: Error from server at https://127.0.0.1:34064/solr/testschemaapi_shard1_replica2: ERROR: [doc=2] unknown field 'myNewField1'
  at __randomizedtesting.SeedInfo.seed([82ED2FD3D6DF749A:AB9100978231962]:0)
  at org.apache.solr.client.solrj.impl.CloudSolrClient.directUpdate(CloudSolrClient.java:697)
  at org.apache.solr.client.solrj.impl.CloudSolrClient.sendRequest(CloudSolrClient.java:1109)
  at org.apache.solr.client.solrj.impl.CloudSolrClient.requestWithRetryOnStaleState(CloudSolrClient.java:998)
  at org.apache.solr.client.solrj.impl.CloudSolrClient.request(CloudSolrClient.java:934)
  at org.apache.solr.schema.TestManagedSchemaAPI.testAddFieldAndDocument(TestManagedSchemaAPI.java:86)
  at org.apache.solr.schema.TestManagedSchemaAPI.test(TestManagedSchemaAPI.java:55)
  at sun.reflect.NativeMethodAccessorImpl.invoke0(Native Method)
  at sun.reflect.NativeMethodAccessorImpl.invoke(NativeMethodAccessorImpl.java:62)
  at sun.reflect.DelegatingMethodAccessorImpl.invoke(DelegatingMethodAccessorImpl.java:43)
  at java.lang.reflect.Method.invoke(Method.java:498)
  at com.carrotsearch.randomizedtesting.RandomizedRunner.invoke(RandomizedRunner.java:1764)
  at com.carrotsearch.randomizedtesting.RandomizedRunner$8.evaluate(RandomizedRunner.java:871)
  at com.carrotsearch.randomizedtesting.RandomizedRunner$9.evaluate(RandomizedRunner.java:907)
  at com.carrotsearch.randomizedtesting.RandomizedRunner$10.evaluate(RandomizedRunner.java:921)
  at com.carrotsearch.randomizedtesting.rules.SystemPropertiesRestoreRule$1.evaluate(SystemPropertiesRestoreRule.java:57)
  at org.apache.lucene.util.TestRuleSetupTeardownChained$1.evaluate(TestRuleSetupTeardownChained.java:49)
  at org.apache.lucene.util.AbstractBeforeAfterRule$1.evaluate(AbstractBeforeAfterRule.java:45)
  at org.apache.lucene.util.TestRuleThreadAndTestName$1.evaluate(TestRuleThreadAndTestName.java:48)
  at org.apache.lucene.util.TestRuleIgnoreAfterMaxFailures$1.evaluate(TestRuleIgnoreAfterMaxFailures.java:64)
  at org.apache.lucene.util.TestRuleMarkFailure$1.evaluate(TestRuleMarkFailure.java:47)
  at com.carrotsearch.randomizedtesting.rules.StatementAdapter.evaluate(StatementAdapter.java:36)
  at com.carrotsearch.randomizedtesting.ThreadLeakControl$StatementRunner.run(ThreadLeakControl.java:367)
  at com.carrotsearch.randomizedtesting.ThreadLeakControl.forkTimeoutingTask(ThreadLeakControl.java:809)
  at com.carrotsearch.randomizedtesting.ThreadLeakControl$3.evaluate(ThreadLeakControl.java:460)
  at com.carrotsearch.randomizedtesting.RandomizedRunner.runSingleTest(RandomizedRunner.java:880)
  at com.carrotsearch.randomizedtesting.RandomizedRunner$5.evaluate(RandomizedRunner.java:781)
  at com.carrotsearch.randomizedtesting.RandomizedRunner$6.evaluate(RandomizedRunner.java:816)
  at com.carrotsearch.randomizedtesting.RandomizedRunner$7.evaluate(RandomizedRunner.java:827)
  at com.carrotsearch.randomizedtesting.rules.StatementAdapter.evaluate(StatementAdapter.java:36)
  at com.carrotsearch.randomizedtesting.rules.SystemPropertiesRestoreRule$1.evaluate(SystemPropertiesRestoreRule.java:57)
  at org.apache.lucene.util.AbstractBeforeAfterRule$1.evaluate(AbstractBeforeAfterRule.java:45)
  at com.carrotsearch.randomizedtesting.rules.StatementAdapter.evaluate(StatementAdapter.java:36)
  at org.apache.lucene.util.TestRuleStoreClassName$1.evaluate(TestRuleStoreClassName.java:41)
  at com.carrotsearch.randomizedtesting.rules.NoShadowingOrOverridesOnMethodsRule$1.evaluate(NoShadowingOrOverridesOnMethodsRule.java:40)
  at com.carrotsearch.randomizedtesting.rules.NoShadowingOrOverridesOnMethodsRule$1.evaluate(NoShadowingOrOverridesOnMethodsRule.java:40)
  at com.carrotsearch.randomizedtesting.rules.StatementAdapter.evaluate(StatementAdapter.java:36)
  at com.carrotsearch.randomizedtesting.rules.StatementAdapter.evaluate(StatementAdapter.java:36)
  at com.carrotsearch.randomizedtesting.rules.StatementAdapter.evaluate(StatementAdapter.java:36)
  at org.apache.lucene.util.TestRuleAssertionsRequired$1.evaluate(TestRuleAssertionsRequired.java:53)
  at org.apache.lucene.util.TestRuleMarkFailure$1.evaluate(TestRuleMarkFailure.java:47)
  at org.apache.lucene.util.TestRuleIgnoreAfterMaxFailures$1.evaluate(TestRuleIgnoreAfterMaxFailures.java:64)
  at org.apache.lucene.util.TestRuleIgnoreTestSuites$1.evaluate(TestRuleIgnoreTestSuites.java:54)
  at com.carrotsearch.randomizedtesting.rules.StatementAdapter.evaluate(StatementAdapter.java:36)
  at com.carrotsearch.randomizedtesting.ThreadLeakControl$StatementRunner.run(ThreadLeakControl.java:367)
  at java.lang.Thread.run(Thread.java:745)
Caused by: org.apache.solr.client.solrj.impl.HttpSolrClient$RemoteSolrException: Error from server at https://127.0.0.1:34064/solr/testschemaapi_shard1_replica2: ERROR: [doc=2] unknown field 'myNewField1'
  at org.apache.solr.client.solrj.impl.HttpSolrClient.executeMethod(HttpSolrClient.java:606)
  at org.apache.solr.client.solrj.impl.HttpSolrClient.request(HttpSolrClient.java:259)
  at org.apache.solr.client.solrj.impl.HttpSolrClient.request(HttpSolrClient.java:248)
  at org.apache.solr.client.solrj.impl.LBHttpSolrClient.doRequest(LBHttpSolrClient.java:413)
  at org.apache.solr.client.solrj.impl.LBHttpSolrClient.request(LBHttpSolrClient.java:366)
  at org.apache.solr.client.solrj.impl.CloudSolrClient.lambda$directUpdate$0(CloudSolrClient.java:674)
  at java.util.concurrent.FutureTask.run(FutureTask.java:266)
  at org.apache.solr.common.util.ExecutorUtil$MDCAwareThreadPoolExecutor.lambda$execute$0(ExecutorUtil.java:229)
  at java.util.concurrent.ThreadPoolExecutor.runWorker(ThreadPoolExecutor.java:1142)
  at java.util.concurrent.ThreadPoolExecutor$Worker.run(ThreadPoolExecutor.java:617)
  ... 1 more




Build Log:
[...truncated 11292 lines...]
    [junit4] Suite: org.apache.solr.cloud.ChaosMonkeySafeLeaderTest
    [junit4] 2> Creating dataDir: /home/jenkins/workspace/Lucene-Solr-master-Linux/solr/build/solr-core/test/J1/temp/solr.cloud.ChaosMonkeySafeLeaderTest_82ED2FD3D6DF749A-001/init-core-data-001
    [junit4] 2> 1066080 INFO (SUITE-ChaosMonkeySafeLeaderTest-seed#[82ED2FD3D6DF749A]-worker) [ ] o.a.s.SolrTestCaseJ4 Randomized ssl (true) and clientAuth (true) via: @org.apache.solr.util.RandomizeSSL(reason=, ssl=NaN, value=NaN, clientAuth=NaN)
    [junit4] 2> 1066081 INFO (SUITE-ChaosMonkeySafeLeaderTest-seed#[82ED2FD3D6DF749A]-worker) [ ] o.a.s.BaseDistributedSearchTestCase Setting hostContext system property: /
    [junit4] 2> 1066085 INFO (TEST-ChaosMonkeySafeLeaderTest.test-seed#[82ED2FD3D6DF749A]) [ ] o.a.s.c.ZkTestServer STARTING ZK TEST SERVER
    [junit4] 2> 1066085 INFO (Thread-2681) [ ] o.a.s.c.ZkTestServer client port:0.0.0.0/0.0.0.0:0
    [junit4] 2> 1066085 INFO (Thread-2681) [ ] o.a.s.c.ZkTestServer Starting server
    [junit4] 2> 1066186 INFO (TEST-ChaosMonkeySafeLeaderTest.test-seed#[82ED2FD3D6DF749A]) [ ] o.a.s.c.ZkTestServer start zk server on port:45257
    [junit4] 2> 1066186 INFO (TEST-ChaosMonkeySafeLeaderTest.test-seed#[82ED2FD3D6DF749A]) [ ] o.a.s.c.c.SolrZkClient Using default ZkCredentialsProvider
    [junit4] 2> 1066186 INFO (TEST-ChaosMonkeySafeLeaderTest.test-seed#[82ED2FD3D6DF749A]) [ ] o.a.s.c.c.ConnectionManager Waiting for client to connect to ZooKeeper
    [junit4] 2> 1066188 INFO (zkCallback-1511-thread-1) [ ] o.a.s.c.c.ConnectionManager Watcher org.apache.solr.common.cloud.ConnectionManager@3542ff51 name:ZooKeeperConnection Watcher:127.0.0.1:45257 got event WatchedEvent state:SyncConnected type:None path:null path:null type:None
    [junit4] 2> 1066188 INFO (TEST-ChaosMonkeySafeLeaderTest.test-seed#[82ED2FD3D6DF749A]) [ ] o.a.s.c.c.ConnectionManager Client is connected to ZooKeeper
    [junit4] 2> 1066188 INFO (TEST-ChaosMonkeySafeLeaderTest.test-seed#[82ED2FD3D6DF749A]) [ ] o.a.s.c.c.SolrZkClient Using default ZkACLProvider
    [junit4] 2> 1066188 INFO (TEST-ChaosMonkeySafeLeaderTest.test-seed#[82ED2FD3D6DF749A]) [ ] o.a.s.c.c.SolrZkClient makePath: /solr
    [junit4] 2> 1066189 INFO (TEST-ChaosMonkeySafeLeaderTest.test-seed#[82ED2FD3D6DF749A]) [ ] o.a.s.c.c.SolrZkClient Using default ZkCredentialsProvider
    [junit4] 2> 1066190 INFO (TEST-ChaosMonkeySafeLeaderTest.test-seed#[82ED2FD3D6DF749A]) [ ] o.a.s.c.c.ConnectionManager Waiting for client to connect to ZooKeeper
    [junit4] 2> 1066190 INFO (zkCallback-1512-thread-1) [ ] o.a.s.c.c.ConnectionManager Watcher org.apache.solr.common.cloud.ConnectionManager@5715becc name:ZooKeeperConnection Watcher:127.0.0.1:45257/solr got event WatchedEvent state:SyncConnected type:None path:null path:null type:None
    [junit4] 2> 1066191 INFO (TEST-ChaosMonkeySafeLeaderTest.test-seed#[82ED2FD3D6DF749A]) [ ] o.a.s.c.c.ConnectionManager Client is connected to ZooKeeper
    [junit4] 2> 1066191 INFO (TEST-ChaosMonkeySafeLeaderTest.test-seed#[82ED2FD3D6DF749A]) [ ] o.a.s.c.c.SolrZkClient Using default ZkACLProvider
    [junit4] 2> 1066191 INFO (TEST-ChaosMonkeySafeLeaderTest.test-seed#[82ED2FD3D6DF749A]) [ ] o.a.s.c.c.SolrZkClient makePath: /collections/collection1
    [junit4] 2> 1066193 INFO (TEST-ChaosMonkeySafeLeaderTest.test-seed#[82ED2FD3D6DF749A]) [ ] o.a.s.c.c.SolrZkClient makePath: /collections/collection1/shards
    [junit4] 2> 1066195 INFO (TEST-ChaosMonkeySafeLeaderTest.test-seed#[82ED2FD3D6DF749A]) [ ] o.a.s.c.c.SolrZkClient makePath: /collections/control_collection
    [junit4] 2> 1066196 INFO (TEST-ChaosMonkeySafeLeaderTest.test-seed#[82ED2FD3D6DF749A]) [ ] o.a.s.c.c.SolrZkClient makePath: /collections/control_collection/shards
    [junit4] 2> 1066196 INFO (TEST-ChaosMonkeySafeLeaderTest.test-seed#[82ED2FD3D6DF749A]) [ ] o.a.s.c.AbstractZkTestCase put /home/jenkins/workspace/Lucene-Solr-master-Linux/solr/core/src/test-files/solr/collection1/conf/solrconfig-tlog.xml to /configs/conf1/solrconfig.xml
    [junit4] 2> 1066196 INFO (TEST-ChaosMonkeySafeLeaderTest.test-seed#[82ED2FD3D6DF749A]) [ ] o.a.s.c.c.SolrZkClient makePath: /configs/conf1/solrconfig.xml
    [junit4] 2> 1066197 INFO (TEST-ChaosMonkeySafeLeaderTest.test-seed#[82ED2FD3D6DF749A]) [ ] o.a.s.c.AbstractZkTestCase put /home/jenkins/workspace/Lucene-Solr-master-Linux/solr/core/src/test-files/solr/collection1/conf/schema15.xml to /configs/conf1/schema.xml
    [junit4] 2> 1066197 INFO (TEST-ChaosMonkeySafeLeaderTest.test-seed#[82ED2FD3D6DF749A]) [ ] o.a.s.c.c.SolrZkClient makePath: /configs/conf1/schema.xml
    [junit4] 2> 1066210 INFO (TEST-ChaosMonkeySafeLeaderTest.test-seed#[82ED2FD3D6DF749A]) [ ] o.a.s.c.AbstractZkTestCase put /home/jenkins/workspace/Lucene-Solr-master-Linux/solr/core/src/test-files/solr/collection1/conf/solrconfig.snippet.randomindexconfig.xml to /configs/conf1/solrconfig.snippet.randomindexconfig.xml
    [junit4] 2> 1066210 INFO (TEST-ChaosMonkeySafeLeaderTest.test-seed#[82ED2FD3D6DF749A]) [ ] o.a.s.c.c.SolrZkClient makePath: /configs/conf1/solrconfig.snippet.randomindexconfig.xml
    [junit4] 2> 1066211 INFO (TEST-ChaosMonkeySafeLeaderTest.test-seed#[82ED2FD3D6DF749A]) [ ] o.a.s.c.AbstractZkTestCase put /home/jenkins/workspace/Lucene-Solr-master-Linux/solr/core/src/test-files/solr/collection1/conf/stopwords.txt to /configs/conf1/stopwords.txt
    [junit4] 2> 1066211 INFO (TEST-ChaosMonkeySafeLeaderTest.test-seed#[82ED2FD3D6DF749A]) [ ] o.a.s.c.c.SolrZkClient makePath: /configs/conf1/stopwords.txt
    [junit4] 2> 1066212 INFO (TEST-ChaosMonkeySafeLeaderTest.test-seed#[82ED2FD3D6DF749A]) [ ] o.a.s.c.AbstractZkTestCase put /home/jenkins/workspace/Lucene-Solr-master-Linux/solr/core/src/test-files/solr/collection1/conf/protwords.txt to /configs/conf1/protwords.txt
    [junit4] 2> 1066212 INFO (TEST-ChaosMonkeySafeLeaderTest.test-seed#[82ED2FD3D6DF749A]) [ ] o.a.s.c.c.SolrZkClient makePath: /configs/conf1/protwords.txt
    [junit4] 2> 1066213 INFO (TEST-ChaosMonkeySafeLeaderTest.test-seed#[82ED2FD3D6DF749A]) [ ] o.a.s.c.AbstractZkTestCase put /home/jenkins/workspace/Lucene-Solr-master-Linux/solr/core/src/test-files/solr/collection1/conf/currency.xml to /configs/conf1/currency.xml
    [junit4] 2> 1066213 INFO (TEST-ChaosMonkeySafeLeaderTest.test-seed#[82ED2FD3D6DF749A]) [ ] o.a.s.c.c.SolrZkClient makePath: /configs/conf1/currency.xml
    [junit4] 2> 1066214 INFO (TEST-ChaosMonkeySafeLeaderTest.test-seed#[82ED2FD3D6DF749A]) [ ] o.a.s.c.AbstractZkTestCase put /home/jenkins/workspace/Lucene-Solr-master-Linux/solr/core/src/test-files/solr/collection1/conf/enumsConfig.xml to /configs/conf1/enumsConfig.xml
    [junit4] 2> 1066214 INFO (TEST-ChaosMonkeySafeLeaderTest.test-seed#[82ED2FD3D6DF749A]) [ ] o.a.s.c.c.SolrZkClient makePath: /configs/conf1/enumsConfig.xml
    [junit4] 2> 1066215 INFO (TEST-ChaosMonkeySafeLeaderTest.test-seed#[82ED2FD3D6DF749A]) [ ] o.a.s.c.AbstractZkTestCase put /home/jenkins/workspace/Lucene-Solr-master-Linux/solr/core/src/test-files/solr/collection1/conf/open-exchange-rates.json to /configs/conf1/open-exchange-rates.json
    [junit4] 2> 1066215 INFO (TEST-ChaosMonkeySafeLeaderTest.test-seed#[82ED2FD3D6DF749A]) [ ] o.a.s.c.c.SolrZkClient makePath: /configs/conf1/open-exchange-rates.json
    [junit4] 2> 1066220 INFO (TEST-ChaosMonkeySafeLeaderTest.test-seed#[82ED2FD3D6DF749A]) [ ] o.a.s.c.AbstractZkTestCase put /home/jenkins/workspace/Lucene-Solr-master-Linux/solr/core/src/test-files/solr/collection1/conf/mapping-ISOLatin1Accent.txt to /configs/conf1/mapping-ISOLatin1Accent.txt
    [junit4] 2> 1066220 INFO (TEST-ChaosMonkeySafeLeaderTest.test-seed#[82ED2FD3D6DF749A]) [ ] o.a.s.c.c.SolrZkClient makePath: /configs/conf1/mapping-ISOLatin1Accent.txt
    [junit4] 2> 1066221 INFO (TEST-ChaosMonkeySafeLeaderTest.test-seed#[82ED2FD3D6DF749A]) [ ] o.a.s.c.AbstractZkTestCase put /home/jenkins/workspace/Lucene-Solr-master-Linux/solr/core/src/test-files/solr/collection1/conf/old_synonyms.txt to /configs/conf1/old_synonyms.txt
    [junit4] 2> 1066221 INFO (TEST-ChaosMonkeySafeLeaderTest.test-seed#[82ED2FD3D6DF749A]) [ ] o.a.s.c.c.SolrZkClient makePath: /configs/conf1/old_synonyms.txt
    [junit4] 2> 1066222 INFO (TEST-ChaosMonkeySafeLeaderTest.test-seed#[82ED2FD3D6DF749A]) [ ] o.a.s.c.AbstractZkTestCase put /home/jenkins/workspace/Lucene-Solr-master-Linux/solr/core/src/test-files/solr/collection1/conf/synonyms.txt to /configs/conf1/synonyms.txt
    [junit4] 2> 1066222 INFO (TEST-ChaosMonkeySafeLeaderTest.test-seed#[82ED2FD3D6DF749A]) [ ] o.a.s.c.c.SolrZkClient makePath: /configs/conf1/synonyms.txt
    [junit4] 2> 1066223 INFO (TEST-ChaosMonkeySafeLeaderTest.test-seed#[82ED2FD3D6DF749A]) [ ] o.a.s.c.c.SolrZkClient Using default ZkCredentialsProvider
    [junit4] 2> 1066224 INFO (TEST-ChaosMonkeySafeLeaderTest.test-seed#[82ED2FD3D6DF749A]) [ ] o.a.s.c.c.ConnectionManager Waiting for client to connect to ZooKeeper
    [junit4] 2> 1066225 INFO (zkCallback-1514-thread-1) [ ] o.a.s.c.c.ConnectionManager Watcher org.apache.solr.common.cloud.ConnectionManager@4ed3aec9 name:ZooKeeperConnection Watcher:127.0.0.1:45257/solr got event WatchedEvent state:SyncConnected type:None path:null path:null type:None
    [junit4] 2> 1066225 INFO (TEST-ChaosMonkeySafeLeaderTest.test-seed#[82ED2FD3D6DF749A]) [ ] o.a.s.c.c.ConnectionManager Client is connected to ZooKeeper
    [junit4] 2> 1066225 INFO (TEST-ChaosMonkeySafeLeaderTest.test-seed#[82ED2FD3D6DF749A]) [ ] o.a.s.c.c.SolrZkClient Using default ZkACLProvider
    [junit4] 2> 1066293 INFO (TEST-ChaosMonkeySafeLeaderTest.test-seed#[82ED2FD3D6DF749A]) [ ] o.a.s.SolrTestCaseJ4 Writing core.properties file to /home/jenkins/workspace/Lucene-Solr-master-Linux/solr/build/solr-core/test/J1/temp/solr.cloud.ChaosMonkeySafeLeaderTest_82ED2FD3D6DF749A-001/control-001/cores/collection1
    [junit4] 2> 1066296 INFO (TEST-ChaosMonkeySafeLeaderTest.test-seed#[82ED2FD3D6DF749A]) [ ] o.e.j.s.Server jetty-9.3.8.v20160314
    [junit4] 2> 1066297 INFO (TEST-ChaosMonkeySafeLeaderTest.test-seed#[82ED2FD3D6DF749A]) [ ] o.e.j.s.h.ContextHandler Started o.e.j.s.ServletContextHandler@5ec138a4{/,null,AVAILABLE}
    [junit4] 2> 1066300 INFO (TEST-ChaosMonkeySafeLeaderTest.test-seed#[82ED2FD3D6DF749A]) [ ] o.e.j.s.ServerConnector Started ServerConnector@617d54a1{SSL,[ssl, http/1.1]}{127.0.0.1:42124}
    [junit4] 2> 1066300 INFO (TEST-ChaosMonkeySafeLeaderTest.test-seed#[82ED2FD3D6DF749A]) [ ] o.e.j.s.Server Started @1068209ms
    [junit4] 2> 1066300 INFO (TEST-ChaosMonkeySafeLeaderTest.test-seed#[82ED2FD3D6DF749A]) [ ] o.a.s.c.s.e.JettySolrRunner Jetty properties: {solr.data.dir=/home/jenkins/workspace/Lucene-Solr-master-Linux/solr/build/solr-core/test/J1/temp/solr.cloud.ChaosMonkeySafeLeaderTest_82ED2FD3D6DF749A-001/tempDir-001/control/data, hostContext=/, hostPort=42124, coreRootDirectory=/home/jenkins/workspace/Lucene-Solr-master-Linux/solr/build/solr-core/test/J1/temp/solr.cloud.ChaosMonkeySafeLeaderTest_82ED2FD3D6DF749A-001/control-001/cores}
    [junit4] 2> 1066300 INFO (TEST-ChaosMonkeySafeLeaderTest.test-seed#[82ED2FD3D6DF749A]) [ ] o.a.s.s.SolrDispatchFilter SolrDispatchFilter.init(): sun.misc.Launcher$AppClassLoader@73d16e93
    [junit4] 2> 1066300 INFO (TEST-ChaosMonkeySafeLeaderTest.test-seed#[82ED2FD3D6DF749A]) [ ] o.a.s.c.SolrResourceLoader new SolrResourceLoader for directory: '/home/jenkins/workspace/Lucene-Solr-master-Linux/solr/build/solr-core/test/J1/temp/solr.cloud.ChaosMonkeySafeLeaderTest_82ED2FD3D6DF749A-001/control-001'
    [junit4] 2> 1066301 INFO (TEST-ChaosMonkeySafeLeaderTest.test-seed#[82ED2FD3D6DF749A]) [ ] o.a.s.c.SolrResourceLoader JNDI not configured for solr (NoInitialContextEx)
    [junit4] 2> 1066301 INFO (TEST-ChaosMonkeySafeLeaderTest.test-seed#[82ED2FD3D6DF749A]) [ ] o.a.s.c.SolrResourceLoader solr home defaulted to 'solr/' (could not find system property or JNDI)
    [junit4] 2> 1066301 INFO (TEST-ChaosMonkeySafeLeaderTest.test-seed#[82ED2FD3D6DF749A]) [ ] o.a.s.c.c.SolrZkClient Using default ZkCredentialsProvider
    [junit4] 2> 1066301 INFO (TEST-ChaosMonkeySafeLeaderTest.test-seed#[82ED2FD3D6DF749A]) [ ] o.a.s.c.c.ConnectionManager Waiting for client to connect to ZooKeeper
    [junit4] 2> 1066303 INFO (zkCallback-1515-thread-1) [ ] o.a.s.c.c.ConnectionManager Watcher org.apache.solr.common.cloud.ConnectionManager@1ca6d683 name:ZooKeeperConnection Watcher:127.0.0.1:45257/solr got event WatchedEvent state:SyncConnected type:None path:null path:null type:None
    [junit4] 2> 1066303 INFO (TEST-ChaosMonkeySafeLeaderTest.test-seed#[82ED2FD3D6DF749A]) [ ] o.a.s.c.c.ConnectionManager Client is connected to ZooKeeper
    [junit4] 2> 1066303 INFO (TEST-ChaosMonkeySafeLeaderTest.test-seed#[82ED2FD3D6DF749A]) [ ] o.a.s.c.c.SolrZkClient Using default ZkACLProvider
    [junit4] 2> 1066304 INFO (TEST-ChaosMonkeySafeLeaderTest.test-seed#[82ED2FD3D6DF749A]) [ ] o.a.s.s.SolrDispatchFilter Loading solr.xml from SolrHome (not found in ZooKeeper)
    [junit4] 2> 1066304 INFO (TEST-ChaosMonkeySafeLeaderTest.test-seed#[82ED2FD3D6DF749A]) [ ] o.a.s.c.SolrXmlConfig Loading container configuration from /home/jenkins/workspace/Lucene-Solr-master-Linux/solr/build/solr-core/test/J1/temp/solr.cloud.ChaosMonkeySafeLeaderTest_82ED2FD3D6DF749A-001/control-001/solr.xml
    [junit4] 2> 1066309 INFO (TEST-ChaosMonkeySafeLeaderTest.test-seed#[82ED2FD3D6DF749A]) [ ] o.a.s.c.CorePropertiesLocator Config-defined core root directory: /home/jenkins/workspace/Lucene-Solr-master-Linux/solr/build/solr-core/test/J1/temp/solr.cloud.ChaosMonkeySafeLeaderTest_82ED2FD3D6DF749A-001/control-001/cores
    [junit4] 2> 1066309 INFO (TEST-ChaosMonkeySafeLeaderTest.test-seed#[82ED2FD3D6DF749A]) [ ] o.a.s.c.CoreContainer New CoreContainer 1696224881
    [junit4] 2> 1066309 INFO (TEST-ChaosMonkeySafeLeaderTest.test-seed#[82ED2FD3D6DF749A]) [ ] o.a.s.c.CoreContainer Loading cores into CoreContainer [instanceDir=/home/jenkins/workspace/Lucene-Solr-master-Linux/solr/build/solr-core/test/J1/temp/solr.cloud.ChaosMonkeySafeLeaderTest_82ED2FD3D6DF749A-001/control-001]
    [junit4] 2> 1066309 WARN (TEST-ChaosMonkeySafeLeaderTest.test-seed#[82ED2FD3D6DF749A]) [ ] o.a.s.c.CoreContainer Couldn't add files from /home/jenkins/workspace/Lucene-Solr-master-Linux/solr/build/solr-core/test/J1/temp/solr.cloud.ChaosMonkeySafeLeaderTest_82ED2FD3D6DF749A-001/control-001/lib to classpath: /home/jenkins/workspace/Lucene-Solr-master-Linux/solr/build/solr-core/test/J1/temp/solr.cloud.ChaosMonkeySafeLeaderTest_82ED2FD3D6DF749A-001/control-001/lib
    [junit4] 2> 1066309 INFO (TEST-ChaosMonkeySafeLeaderTest.test-seed#[82ED2FD3D6DF749A]) [ ] o.a.s.h.c.HttpShardHandlerFactory created with socketTimeout : 90000,urlScheme : ,connTimeout : 15000,maxConnectionsPerHost : 20,maxConnections : 10000,corePoolSize : 0,maximumPoolSize : 2147483647,maxThreadIdleTime : 5,sizeOfQueue : -1,fairnessPolicy : false,
    [junit4] 2> 1066311 INFO (TEST-ChaosMonkeySafeLeaderTest.test-seed#[82ED2FD3D6DF749A]) [ ] o.a.s.u.UpdateShardHandler Creating UpdateShardHandler HTTP client with params:
    [junit4] 2> 1066312 INFO (TEST-ChaosMonkeySafeLeaderTest.test-seed#[82ED2FD3D6DF749A]) [ ] o.a.s.l.LogWatcher SLF4J impl is org.slf4j.impl.Log4jLoggerFactory
    [junit4] 2> 1066312 INFO (TEST-ChaosMonkeySafeLeaderTest.test-seed#[82ED2FD3D6DF749A]) [ ] o.a.s.l.LogWatcher Registering Log Listener [Log4j (org.slf4j.impl.Log4jLoggerFactory)]
    [junit4] 2> 1066312 INFO (TEST-ChaosMonkeySafeLeaderTest.test-seed#[82ED2FD3D6DF749A]) [ ] o.a.s.c.ZkContainer Zookeeper client=127.0.0.1:45257/solr
    [junit4] 2> 1066312 INFO (TEST-ChaosMonkeySafeLeaderTest.test-seed#[82ED2FD3D6DF749A]) [ ] o.a.s.c.ZkController zkHost includes chroot
    [junit4] 2> 1066312 INFO (TEST-ChaosMonkeySafeLeaderTest.test-seed#[82ED2FD3D6DF749A]) [ ] o.a.s.c.c.SolrZkClient Using default ZkCredentialsProvider
    [junit4] 2> 1066312 INFO (TEST-ChaosMonkeySafeLeaderTest.test-seed#[82ED2FD3D6DF749A]) [ ] o.a.s.c.c.ConnectionManager Waiting for client to connect to ZooKeeper
    [junit4] 2> 1066313 INFO (zkCallback-1518-thread-1) [ ] o.a.s.c.c.ConnectionManager Watcher org.apache.solr.common.cloud.ConnectionManager@6ae691aa name:ZooKeeperConnection Watcher:127.0.0.1:45257 got event WatchedEvent state:SyncConnected type:None path:null path:null type:None
    [junit4] 2> 1066313 INFO (TEST-ChaosMonkeySafeLeaderTest.test-seed#[82ED2FD3D6DF749A]) [ ] o.a.s.c.c.ConnectionManager Client is connected to ZooKeeper
    [junit4] 2> 1066313 INFO (TEST-ChaosMonkeySafeLeaderTest.test-seed#[82ED2FD3D6DF749A]) [ ] o.a.s.c.c.SolrZkClient Using default ZkACLProvider
    [junit4] 2> 1066315 INFO (TEST-ChaosMonkeySafeLeaderTest.test-seed#[82ED2FD3D6DF749A]) [n:127.0.0.1:42124_ ] o.a.s.c.ZkController Added new OnReconnect listener org.apache.solr.cloud.ZkController$$Lambda$59/1902417067@101da9a6
    [junit4] 2> 1066317 INFO (TEST-ChaosMonkeySafeLeaderTest.test-seed#[82ED2FD3D6DF749A]) [n:127.0.0.1:42124_ ] o.a.s.c.c.ConnectionManager Waiting for client to connect to ZooKeeper
    [junit4] 2> 1066317 INFO (zkCallback-1519-thread-1-processing-n:127.0.0.1:42124_) [n:127.0.0.1:42124_ ] o.a.s.c.c.ConnectionManager Watcher org.apache.solr.common.cloud.ConnectionManager@756253c3 name:ZooKeeperConnection Watcher:127.0.0.1:45257/solr got event WatchedEvent state:SyncConnected type:None path:null path:null type:None
    [junit4] 2> 1066317 INFO (TEST-ChaosMonkeySafeLeaderTest.test-seed#[82ED2FD3D6DF749A]) [n:127.0.0.1:42124_ ] o.a.s.c.c.ConnectionManager Client is connected to ZooKeeper
    [junit4] 2> 1066317 INFO (TEST-ChaosMonkeySafeLeaderTest.test-seed#[82ED2FD3D6DF749A]) [n:127.0.0.1:42124_ ] o.a.s.c.c.SolrZkClient makePath: /overseer/queue
    [junit4] 2> 1066318 INFO (TEST-ChaosMonkeySafeLeaderTest.test-seed#[82ED2FD3D6DF749A]) [n:127.0.0.1:42124_ ] o.a.s.c.c.SolrZkClient makePath: /overseer/collection-queue-work
    [junit4] 2> 1066319 INFO (TEST-ChaosMonkeySafeLeaderTest.test-seed#[82ED2FD3D6DF749A]) [n:127.0.0.1:42124_ ] o.a.s.c.c.SolrZkClient makePath: /overseer/collection-map-running
    [junit4] 2> 1066319 INFO (TEST-ChaosMonkeySafeLeaderTest.test-seed#[82ED2FD3D6DF749A]) [n:127.0.0.1:42124_ ] o.a.s.c.c.SolrZkClient makePath: /overseer/collection-map-completed
    [junit4] 2> 1066320 INFO (TEST-ChaosMonkeySafeLeaderTest.test-seed#[82ED2FD3D6DF749A]) [n:127.0.0.1:42124_ ] o.a.s.c.c.SolrZkClient makePath: /overseer/collection-map-failure
    [junit4] 2> 1066320 INFO (TEST-ChaosMonkeySafeLeaderTest.test-seed#[82ED2FD3D6DF749A]) [n:127.0.0.1:42124_ ] o.a.s.c.c.SolrZkClient makePath: /live_nodes
    [junit4] 2> 1066321 INFO (TEST-ChaosMonkeySafeLeaderTest.test-seed#[82ED2FD3D6DF749A]) [n:127.0.0.1:42124_ ] o.a.s.c.c.SolrZkClient makePath: /aliases.json
    [junit4] 2> 1066321 INFO (TEST-ChaosMonkeySafeLeaderTest.test-seed#[82ED2FD3D6DF749A]) [n:127.0.0.1:42124_ ] o.a.s.c.c.SolrZkClient makePath: /clusterstate.json
    [junit4] 2> 1066321 INFO (TEST-ChaosMonkeySafeLeaderTest.test-seed#[82ED2FD3D6DF749A]) [n:127.0.0.1:42124_ ] o.a.s.c.c.SolrZkClient makePath: /security.json
    [junit4] 2> 1066322 INFO (TEST-ChaosMonkeySafeLeaderTest.test-seed#[82ED2FD3D6DF749A]) [n:127.0.0.1:42124_ ] o.a.s.c.c.ZkStateReader Updating cluster state from ZooKeeper...
    [junit4] 2> 1066322 INFO (TEST-ChaosMonkeySafeLeaderTest.test-seed#[82ED2FD3D6DF749A]) [n:127.0.0.1:42124_ ] o.a.s.c.c.ZkStateReader Loaded cluster properties: {urlScheme=https}
    [junit4] 2> 1066322 INFO (TEST-ChaosMonkeySafeLeaderTest.test-seed#[82ED2FD3D6DF749A]) [n:127.0.0.1:42124_ ] o.a.s.c.c.ZkStateReader Updated live nodes from ZooKeeper... (0) -> (0)
    [junit4] 2> 1066323 INFO (TEST-ChaosMonkeySafeLeaderTest.test-seed#[82ED2FD3D6DF749A]) [n:127.0.0.1:42124_ ] o.a.s.c.c.SolrZkClient makePath: /overseer_elect
    [junit4] 2> 1066323 INFO (TEST-ChaosMonkeySafeLeaderTest.test-seed#[82ED2FD3D6DF749A]) [n:127.0.0.1:42124_ ] o.a.s.c.c.SolrZkClient makePath: /overseer_elect/election
    [junit4] 2> 1066323 INFO (TEST-ChaosMonkeySafeLeaderTest.test-seed#[82ED2FD3D6DF749A]) [n:127.0.0.1:42124_ ] o.a.s.c.Overseer Overseer (id=null) closing
    [junit4] 2> 1066324 INFO (TEST-ChaosMonkeySafeLeaderTest.test-seed#[82ED2FD3D6DF749A]) [n:127.0.0.1:42124_ ] o.a.s.c.LeaderElector Joined leadership election with path: /overseer_elect/election/96089326966603781-127.0.0.1:42124_-n_0000000000
    [junit4] 2> 1066324 INFO (TEST-ChaosMonkeySafeLeaderTest.test-seed#[82ED2FD3D6DF749A]) [n:127.0.0.1:42124_ ] o.a.s.c.OverseerElectionContext I am going to be the leader 127.0.0.1:42124_
    [junit4] 2> 1066324 INFO (TEST-ChaosMonkeySafeLeaderTest.test-seed#[82ED2FD3D6DF749A]) [n:127.0.0.1:42124_ ] o.a.s.c.c.SolrZkClient makePath: /overseer_elect/leader
    [junit4] 2> 1066324 INFO (TEST-ChaosMonkeySafeLeaderTest.test-seed#[82ED2FD3D6DF749A]) [n:127.0.0.1:42124_ ] o.a.s.c.Overseer Overseer (id=96089326966603781-127.0.0.1:42124_-n_0000000000) starting
    [junit4] 2> 1066325 INFO (TEST-ChaosMonkeySafeLeaderTest.test-seed#[82ED2FD3D6DF749A]) [n:127.0.0.1:42124_ ] o.a.s.c.c.SolrZkClient makePath: /overseer/queue-work
    [junit4] 2> 1066328 INFO (TEST-ChaosMonkeySafeLeaderTest.test-seed#[82ED2FD3D6DF749A]) [n:127.0.0.1:42124_ ] o.a.s.c.OverseerAutoReplicaFailoverThread Starting OverseerAutoReplicaFailoverThread autoReplicaFailoverWorkLoopDelay=10000 autoReplicaFailoverWaitAfterExpiration=30000 autoReplicaFailoverBadNodeExpiration=60000
    [junit4] 2> 1066328 INFO (OverseerCollectionConfigSetProcessor-96089326966603781-127.0.0.1:42124_-n_0000000000) [n:127.0.0.1:42124_ ] o.a.s.c.OverseerTaskProcessor Process current queue of overseer operations
    [junit4] 2> 1066328 INFO (OverseerStateUpdate-96089326966603781-127.0.0.1:42124_-n_0000000000) [n:127.0.0.1:42124_ ] o.a.s.c.Overseer Starting to work on the main queue
    [junit4] 2> 1066329 INFO (TEST-ChaosMonkeySafeLeaderTest.test-seed#[82ED2FD3D6DF749A]) [n:127.0.0.1:42124_ ] o.a.s.c.ZkController Register node as live in ZooKeeper:/live_nodes/127.0.0.1:42124_
    [junit4] 2> 1066329 INFO (TEST-ChaosMonkeySafeLeaderTest.test-seed#[82ED2FD3D6DF749A]) [n:127.0.0.1:42124_ ] o.a.s.c.c.SolrZkClient makePath: /live_nodes/127.0.0.1:42124_
    [junit4] 2> 1066329 INFO (OverseerStateUpdate-96089326966603781-127.0.0.1:42124_-n_0000000000) [n:127.0.0.1:42124_ ] o.a.s.c.c.ZkStateReader Updated live nodes from ZooKeeper... (0) -> (0)
    [junit4] 2> 1066330 INFO (zkCallback-1519-thread-1-processing-n:127.0.0.1:42124_) [n:127.0.0.1:42124_ ] o.a.s.c.c.ZkStateReader A live node change: [WatchedEvent state:SyncConnected type:NodeChildrenChanged path:/live_nodes], has occurred - updating... (live nodes size: [0])
    [junit4] 2> 1066330 INFO (zkCallback-1519-thread-1-processing-n:127.0.0.1:42124_) [n:127.0.0.1:42124_ ] o.a.s.c.c.ZkStateReader Updated live nodes from ZooKeeper... (0) -> (1)
    [junit4] 2> 1066363 INFO (TEST-ChaosMonkeySafeLeaderTest.test-seed#[82ED2FD3D6DF749A]) [n:127.0.0.1:42124_ ] o.a.s.c.CoreContainer Security conf doesn't exist. Skipping setup for authorization module.
    [junit4] 2> 1066363 INFO (TEST-ChaosMonkeySafeLeaderTest.test-seed#[82ED2FD3D6DF749A]) [n:127.0.0.1:42124_ ] o.a.s.c.CoreContainer No authentication plugin used.
    [junit4] 2> 1066364 INFO (TEST-ChaosMonkeySafeLeaderTest.test-seed#[82ED2FD3D6DF749A]) [n:127.0.0.1:42124_ ] o.a.s.c.CorePropertiesLocator Looking for core definitions underneath /home/jenkins/workspace/Lucene-Solr-master-Linux/solr/build/solr-core/test/J1/temp/solr.cloud.ChaosMonkeySafeLeaderTest_82ED2FD3D6DF749A-001/control-001/cores
    [junit4] 2> 1066365 INFO (TEST-ChaosMonkeySafeLeaderTest.test-seed#[82ED2FD3D6DF749A]) [n:127.0.0.1:42124_ ] o.a.s.c.CoreDescriptor Created CoreDescriptor: {name=collection1, config=solrconfig.xml, transient=false, schema=schema.xml, loadOnStartup=true, configSetProperties=configsetprops.json, collection=control_collection, coreNodeName=, dataDir=data/, shard=}
    [junit4] 2> 1066365 INFO (TEST-ChaosMonkeySafeLeaderTest.test-seed#[82ED2FD3D6DF749A]) [n:127.0.0.1:42124_ ] o.a.s.c.CorePropertiesLocator Found core collection1 in /home/jenkins/workspace/Lucene-Solr-master-Linux/solr/build/solr-core/test/J1/temp/solr.cloud.ChaosMonkeySafeLeaderTest_82ED2FD3D6DF749A-001/control-001/cores/collection1
    [junit4] 2> 1066365 INFO (TEST-ChaosMonkeySafeLeaderTest.test-seed#[82ED2FD3D6DF749A]) [n:127.0.0.1:42124_ ] o.a.s.c.CorePropertiesLocator Found 1 core definitions
    [junit4] 2> 1066365 INFO (TEST-ChaosMonkeySafeLeaderTest.test-seed#[82ED2FD3D6DF749A]) [n:127.0.0.1:42124_ ] o.a.s.s.SolrDispatchFilter user.dir=/home/jenkins/workspace/Lucene-Solr-master-Linux/solr/build/solr-core/test/J1
    [junit4] 2> 1066365 INFO (coreLoadExecutor-3794-thread-1-processing-n:127.0.0.1:42124_) [n:127.0.0.1:42124_ c:control_collection x:collection1] o.a.s.c.ZkController publishing state=down
    [junit4] 2> 1066365 INFO (TEST-ChaosMonkeySafeLeaderTest.test-seed#[82ED2FD3D6DF749A]) [n:127.0.0.1:42124_ ] o.a.s.s.SolrDispatchFilter SolrDispatchFilter.init() done
    [junit4] 2> 1066365 INFO (coreLoadExecutor-3794-thread-1-processing-n:127.0.0.1:42124_) [n:127.0.0.1:42124_ c:control_collection x:collection1] o.a.s.c.ZkController numShards not found on descriptor - reading it from system property
    [junit4] 2> 1066366 INFO (coreLoadExecutor-3794-thread-1-processing-n:127.0.0.1:42124_) [n:127.0.0.1:42124_ c:control_collection x:collection1] o.a.s.c.ZkController Collection control_collection not visible yet, but flagging it so a watch is registered when it becomes visible
    [junit4] 2> 1066366 INFO (OverseerStateUpdate-96089326966603781-127.0.0.1:42124_-n_0000000000) [n:127.0.0.1:42124_ ] o.a.s.c.Overseer processMessage: queueSize: 1, message = {
    [junit4] 2> "core":"collection1",
    [junit4] 2> "roles":null,
    [junit4] 2> "base_url":"https://127.0.0.1:42124",
    [junit4] 2> "node_name":"127.0.0.1:42124_",
    [junit4] 2> "numShards":"1",
    [junit4] 2> "state":"down",
    [junit4] 2> "shard":null,
    [junit4] 2> "collection":"control_collection",
    [junit4] 2> "operation":"state"} current state version: 0
    [junit4] 2> 1066367 INFO (coreLoadExecutor-3794-thread-1-processing-n:127.0.0.1:42124_) [n:127.0.0.1:42124_ c:control_collection x:collection1] o.a.s.c.c.ZkStateReader Deleting data for [control_collection]
    [junit4] 2> 1066367 INFO (OverseerStateUpdate-96089326966603781-127.0.0.1:42124_-n_0000000000) [n:127.0.0.1:42124_ ] o.a.s.c.o.ReplicaMutator Update state numShards=1 message={
    [junit4] 2> "core":"collection1",
    [junit4] 2> "roles":null,
    [junit4] 2> "base_url":"https://127.0.0.1:42124",
    [junit4] 2> "node_name":"127.0.0.1:42124_",
    [junit4] 2> "numShards":"1",
    [junit4] 2> "state":"down",
    [junit4] 2> "shard":null,
    [junit4] 2> "collection":"control_collection",
    [junit4] 2> "operation":"state"}
    [junit4] 2> 1066367 INFO (OverseerStateUpdate-96089326966603781-127.0.0.1:42124_-n_0000000000) [n:127.0.0.1:42124_ ] o.a.s.c.o.ClusterStateMutator building a new cName: control_collection
    [junit4] 2> 1066367 INFO (coreLoadExecutor-3794-thread-1-processing-n:127.0.0.1:42124_) [n:127.0.0.1:42124_ c:control_collection x:collection1] o.a.s.c.ZkController look for our core node name
    [junit4] 2> 1066367 INFO (OverseerStateUpdate-96089326966603781-127.0.0.1:42124_-n_0000000000) [n:127.0.0.1:42124_ ] o.a.s.c.o.ReplicaMutator Assigning new node to shard shard=shard1
    [junit4] 2> 1066368 INFO (zkCallback-1519-thread-1-processing-n:127.0.0.1:42124_) [n:127.0.0.1:42124_ ] o.a.s.c.c.ZkStateReader A cluster state change: [WatchedEvent state:SyncConnected type:NodeDataChanged path:/clusterstate.json], has occurred - updating... (live nodes size: [1])
    [junit4] 2> 1067367 INFO (coreLoadExecutor-3794-thread-1-processing-n:127.0.0.1:42124_) [n:127.0.0.1:42124_ c:control_collection x:collection1] o.a.s.c.ZkController waiting to find shard id in clusterstate for collection1
    [junit4] 2> 1067367 INFO (coreLoadExecutor-3794-thread-1-processing-n:127.0.0.1:42124_) [n:127.0.0.1:42124_ c:control_collection x:collection1] o.a.s.c.ZkController Check for collection zkNode:control_collection
    [junit4] 2> 1067368 INFO (coreLoadExecutor-3794-thread-1-processing-n:127.0.0.1:42124_) [n:127.0.0.1:42124_ c:control_collection x:collection1] o.a.s.c.ZkController Collection zkNode exists
    [junit4] 2> 1067368 INFO (coreLoadExecutor-3794-thread-1-processing-n:127.0.0.1:42124_) [n:127.0.0.1:42124_ c:control_collection x:collection1] o.a.s.c.c.ZkStateReader Load collection config from: [/collections/control_collection]
    [junit4] 2> 1067368 INFO (coreLoadExecutor-3794-thread-1-processing-n:127.0.0.1:42124_) [n:127.0.0.1:42124_ c:control_collection x:collection1] o.a.s.c.c.ZkStateReader path=[/collections/control_collection] [configName]=[conf1] specified config exists in ZooKeeper
    [junit4] 2> 1067368 INFO (coreLoadExecutor-3794-thread-1-processing-n:127.0.0.1:42124_) [n:127.0.0.1:42124_ c:control_collection x:collection1] o.a.s.c.SolrResourceLoader new SolrResourceLoader for directory: '/home/jenkins/workspace/Lucene-Solr-master-Linux/solr/build/solr-core/test/J1/temp/solr.cloud.ChaosMonkeySafeLeaderTest_82ED2FD3D6DF749A-001/control-001/cores/collection1'
    [junit4] 2> 1067368 INFO (coreLoadExecutor-3794-thread-1-processing-n:127.0.0.1:42124_) [n:127.0.0.1:42124_ c:control_collection x:collection1] o.a.s.c.SolrResourceLoader JNDI not configured for solr (NoInitialContextEx)
    [junit4] 2> 1068416 INFO (coreLoadExecutor-3794-thread-1-processing-n:127.0.0.1:42124_) [n:127.0.0.1:42124_ c:control_collection x:collection1] o.a.s.c.SolrResourceLoader solr home defaulted to 'solr/' (could not find system property or JNDI)
    [junit4] 2> 1068417 INFO (coreLoadExecutor-3794-thread-1-processing-n:127.0.0.1:42124_) [n:127.0.0.1:42124_ c:control_collection x:collection1] o.a.s.c.Config loaded config solrconfig.xml with version 0
    [junit4] 2> 1068420 INFO (coreLoadExecutor-3794-thread-1-processing-n:127.0.0.1:42124_) [n:127.0.0.1:42124_ c:control_collection x:collection1] o.a.s.c.SolrConfig current version of requestparams : -1
    [junit4] 2> 1068423 WARN (coreLoadExecutor-3794-thread-1-processing-n:127.0.0.1:42124_) [n:127.0.0.1:42124_ c:control_collection x:collection1] o.a.s.c.Config Beginning with Solr 5.5, <mergePolicy> is deprecated, use <mergePolicyFactory> instead.
    [junit4] 2> 1068423 INFO (coreLoadExecutor-3794-thread-1-processing-n:127.0.0.1:42124_) [n:127.0.0.1:42124_ c:control_collection x:collection1] o.a.s.c.SolrConfig Using Lucene MatchVersion: 7.0.0
    [junit4] 2> 1068429 INFO (coreLoadExecutor-3794-thread-1-processing-n:127.0.0.1:42124_) [n:127.0.0.1:42124_ c:control_collection x:collection1] o.a.s.c.SolrConfig Loaded SolrConfig: solrconfig.xml
    [junit4] 2> 1068433 INFO (coreLoadExecutor-3794-thread-1-processing-n:127.0.0.1:42124_) [n:127.0.0.1:42124_ c:control_collection x:collection1] o.a.s.s.IndexSchema [collection1] Schema name=test
    [junit4] 2> 1068483 INFO (coreLoadExecutor-3794-thread-1-processing-n:127.0.0.1:42124_) [n:127.0.0.1:42124_ c:control_collection x:collection1] o.a.s.s.IndexSchema default search field in schema is text
    [junit4] 2> 1068483 INFO (coreLoadExecutor-3794-thread-1-processing-n:127.0.0.1:42124_) [n:127.0.0.1:42124_ c:control_collection x:collection1] o.a.s.s.IndexSchema unique key field: id
    [junit4] 2> 1068484 INFO (coreLoadExecutor-3794-thread-1-processing-n:127.0.0.1:42124_) [n:127.0.0.1:42124_ c:control_collection x:collection1] o.a.s.s.FileExchangeRateProvider Reloading exchange rates from file currency.xml
    [junit4] 2> 1068485 INFO (coreLoadExecutor-3794-thread-1-processing-n:127.0.0.1:42124_) [n:127.0.0.1:42124_ c:control_collection x:collection1] o.a.s.s.FileExchangeRateProvider Reloading exchange rates from file currency.xml
    [junit4] 2> 1068491 INFO (coreLoadExecutor-3794-thread-1-processing-n:127.0.0.1:42124_) [n:127.0.0.1:42124_ c:control_collection x:collection1] o.a.s.c.ConfigSetProperties Did not find ConfigSet properties, assuming default properties: Can't find resource 'configsetprops.json' in classpath or '/configs/conf1', cwd=/home/jenkins/workspace/Lucene-Solr-master-Linux/solr/build/solr-core/test/J1
    [junit4] 2> 1068491 INFO (coreLoadExecutor-3794-thread-1-processing-n:127.0.0.1:42124_) [n:127.0.0.1:42124_ c:control_collection x:collection1] o.a.s.c.CoreContainer Creating SolrCore 'collection1' using configuration from collection control_collection
    [junit4] 2> 1068491 INFO (coreLoadExecutor-3794-thread-1-processing-n:127.0.0.1:42124_) [n:127.0.0.1:42124_ c:control_collection s:shard1 r:core_node1 x:collection1] o.a.s.c.SolrCore solr.StandardDirectoryFactory
    [junit4] 2> 1068491 INFO (coreLoadExecutor-3794-thread-1-processing-n:127.0.0.1:42124_) [n:127.0.0.1:42124_ c:control_collection s:shard1 r:core_node1 x:collection1] o.a.s.c.SolrCore [[collection1] ] Opening new SolrCore at [/home/jenkins/workspace/Lucene-Solr-master-Linux/solr/build/solr-core/test/J1/temp/solr.cloud.ChaosMonkeySafeLeaderTest_82ED2FD3D6DF749A-001/control-001/cores/collection1], dataDir=[/home/jenkins/workspace/Lucene-Solr-master-Linux/solr/build/solr-core/test/J1/temp/solr.cloud.ChaosMonkeySafeLeaderTest_82ED2FD3D6DF749A-001/control-001/cores/collection1/data/]
    [junit4] 2> 1068491 INFO (coreLoadExecutor-3794-thread-1-processing-n:127.0.0.1:42124_) [n:127.0.0.1:42124_ c:control_collection s:shard1 r:core_node1 x:collection1] o.a.s.c.JmxMonitoredMap JMX monitoring is enabled. Adding Solr mbeans to JMX Server: com.sun.jmx.mbeanserver.JmxMBeanServer@46af42a7
    [junit4] 2> 1068492 INFO (coreLoadExecutor-3794-thread-1-processing-n:127.0.0.1:42124_) [n:127.0.0.1:42124_ c:control_collection s:shard1 r:core_node1 x:collection1] o.a.s.c.CachingDirectoryFactory return new directory for /home/jenkins/workspace/Lucene-Solr-master-Linux/solr/build/solr-core/test/J1/temp/solr.cloud.ChaosMonkeySafeLeaderTest_82ED2FD3D6DF749A-001/control-001/cores/collection1/data
    [junit4] 2> 1068492 INFO (coreLoadExecutor-3794-thread-1-processing-n:127.0.0.1:42124_) [n:127.0.0.1:42124_ c:control_collection s:shard1 r:core_node1 x:collection1] o.a.s.c.SolrCore New index directory detected: old=null new=/home/jenkins/workspace/Lucene-Solr-master-Linux/solr/build/solr-core/test/J1/temp/solr.cloud.ChaosMonkeySafeLeaderTest_82ED2FD3D6DF749A-001/control-001/cores/collection1/data/index/
    [junit4] 2> 1068492 WARN (coreLoadExecutor-3794-thread-1-processing-n:127.0.0.1:42124_) [n:127.0.0.1:42124_ c:control_collection s:shard1 r:core_node1 x:collection1] o.a.s.c.SolrCore [collection1] Solr index directory '/home/jenkins/workspace/Lucene-Solr-master-Linux/solr/build/solr-core/test/J1/temp/solr.cloud.ChaosMonkeySafeLeaderTest_82ED2FD3D6DF749A-001/control-001/cores/collection1/data/index' doesn't exist. Creating new index...
    [junit4] 2> 1068492 INFO (coreLoadExecutor-3794-thread-1-processing-n:127.0.0.1:42124_) [n:127.0.0.1:42124_ c:control_collection s:shard1 r:core_node1 x:collection1] o.a.s.c.CachingDirectoryFactory return new directory for /home/jenkins/workspace/Lucene-Solr-master-Linux/solr/build/solr-core/test/J1/temp/solr.cloud.ChaosMonkeySafeLeaderTest_82ED2FD3D6DF749A-001/control-001/cores/collection1/data/index
    [junit4] 2> 1068492 INFO (coreLoadExecutor-3794-thread-1-processing-n:127.0.0.1:42124_) [n:127.0.0.1:42124_ c:control_collection s:shard1 r:core_node1 x:collection1] o.a.s.u.RandomMergePolicy RandomMergePolicy wrapping class org.apache.lucene.index.LogByteSizeMergePolicy: [LogByteSizeMergePolicy: minMergeSize=1677721, mergeFactor=41, maxMergeSize=2147483648, maxMergeSizeForForcedMerge=9223372036854775807, calibrateSizeByDeletes=true, maxMergeDocs=2147483647, maxCFSSegmentSizeMB=8.796093022207999E12, noCFSRatio=0.6250256855308016]
    [junit4] 2> 1069831 INFO (coreLoadExecutor-3794-thread-1-processing-n:127.0.0.1:42124_) [n:127.0.0.1:42124_ c:control_collection s:shard1 r:core_node1 x:collection1] o.a.s.c.SolrDeletionPolicy SolrDeletionPolicy.onCommit: commits: num=1
    [junit4] 2> commit{dir=/home/jenkins/workspace/Lucene-Solr-master-Linux/solr/build/solr-core/test/J1/temp/solr.cloud.ChaosMonkeySafeLeaderTest_82ED2FD3D6DF749A-001/control-001/cores/collection1/data/index,segFN=segments_1,generation=1}
    [junit4] 2> 1069831 INFO (coreLoadExecutor-3794-thread-1-processing-n:127.0.0.1:42124_) [n:127.0.0.1:42124_ c:control_collection s:shard1 r:core_node1 x:collection1] o.a.s.c.SolrDeletionPolicy newest commit generation = 1
    [junit4] 2> 1069832 INFO (OldIndexDirectoryCleanupThreadForCore-collection1) [n:127.0.0.1:42124_ c:control_collection s:shard1 r:core_node1 x:collection1] o.a.s.c.SolrCore Looking for old index directories to cleanup for core collection1 in /home/jenkins/workspace/Lucene-Solr-master-Linux/solr/build/solr-core/test/J1/temp/solr.cloud.ChaosMonkeySafeLeaderTest_82ED2FD3D6DF749A-001/control-001/cores/collection1/data/
    [junit4] 2> 1069833 INFO (coreLoadExecutor-3794-thread-1-processing-n:127.0.0.1:42124_) [n:127.0.0.1:42124_ c:control_collection s:shard1 r:core_node1 x:collection1] o.a.s.u.p.UpdateRequestProcessorChain creating updateRequestProcessorChain "nodistrib"
    [junit4] 2> 1069833 INFO (coreLoadExecutor-3794-thread-1-processing-n:127.0.0.1:42124_) [n:127.0.0.1:42124_ c:control_collection s:shard1 r:core_node1 x:collection1] o.a.s.u.p.UpdateRequestProcessorChain creating updateRequestProcessorChain "dedupe"
    [junit4] 2> 1069833 INFO (coreLoadExecutor-3794-thread-1-processing-n:127.0.0.1:42124_) [n:127.0.0.1:42124_ c:control_collection s:shard1 r:core_node1 x:collection1] o.a.s.u.p.UpdateRequestProcessorChain inserting DistributedUpdateProcessorFactory into updateRequestProcessorChain "dedupe"
    [junit4] 2> 1069834 INFO (coreLoadExecutor-3794-thread-1-processing-n:127.0.0.1:42124_) [n:127.0.0.1:42124_ c:control_collection s:shard1 r:core_node1 x:collection1] o.a.s.u.p.UpdateRequestProcessorChain creating updateRequestProcessorChain "stored_sig"
    [junit4] 2> 1069834 INFO (coreLoadExecutor-3794-thread-1-processing-n:127.0.0.1:42124_) [n:127.0.0.1:42124_ c:control_collection s:shard1 r:core_node1 x:collection1] o.a.s.u.p.UpdateRequestProcessorChain inserting DistributedUpdateProcessorFactory into updateRequestProcessorChain "stored_sig"
    [junit4] 2> 1069834 INFO (coreLoadExecutor-3794-thread-1-processing-n:127.0.0.1:42124_) [n:127.0.0.1:42124_ c:control_collection s:shard1 r:core_node1 x:collection1] o.a.s.u.p.UpdateRequestProcessorChain creating updateRequestProcessorChain "distrib-dup-test-chain-explicit"
    [junit4] 2> 1069834 INFO (coreLoadExecutor-3794-thread-1-processing-n:127.0.0.1:42124_) [n:127.0.0.1:42124_ c:control_collection s:shard1 r:core_node1 x:collection1] o.a.s.u.p.UpdateRequestProcessorChain creating updateRequestProcessorChain "distrib-dup-test-chain-implicit"
    [junit4] 2> 1069834 INFO (coreLoadExecutor-3794-thread-1-processing-n:127.0.0.1:42124_) [n:127.0.0.1:42124_ c:control_collection s:shard1 r:core_node1 x:collection1] o.a.s.u.p.UpdateRequestProcessorChain inserting DistributedUpdateProcessorFactory into updateRequestProcessorChain "distrib-dup-test-chain-implicit"
    [junit4] 2> 1069834 INFO (coreLoadExecutor-3794-thread-1-processing-n:127.0.0.1:42124_) [n:127.0.0.1:42124_ c:control_collection s:shard1 r:core_node1 x:collection1] o.a.s.c.SolrCore no updateRequestProcessorChain defined as default, creating implicit default
    [junit4] 2> 1069834 WARN (coreLoadExecutor-3794-thread-1-processing-n:127.0.0.1:42124_) [n:127.0.0.1:42124_ c:control_collection s:shard1 r:core_node1 x:collection1] o.a.s.c.RequestHandlers INVALID paramSet a in requestHandler {type = requestHandler,name = /dump,class = DumpRequestHandler,args = {defaults={a=A,b=B}}}
    [junit4] 2> 1069835 INFO (coreLoadExecutor-3794-thread-1-processing-n:127.0.0.1:42124_) [n:127.0.0.1:42124_ c:control_collection s:shard1 r:core_node1 x:collection1] o.a.s.h.l.XMLLoader xsltCacheLifetimeSeconds=60
    [junit4] 2> 1069836 INFO (coreLoadExecutor-3794-thread-1-processing-n:127.0.0.1:42124_) [n:127.0.0.1:42124_ c:control_collection s:shard1 r:core_node1 x:collection1] o.a.s.h.l.XMLLoader xsltCacheLifetimeSeconds=60
    [junit4] 2> 1069836 INFO (coreLoadExecutor-3794-thread-1-processing-n:127.0.0.1:42124_) [n:127.0.0.1:42124_ c:control_collection s:shard1 r:core_node1 x:collection1] o.a.s.h.l.XMLLoader xsltCacheLifetimeSeconds=60
    [junit4] 2> 1069837 INFO (coreLoadExecutor-3794-thread-1-processing-n:127.0.0.1:42124_) [n:127.0.0.1:42124_ c:control_collection s:shard1 r:core_node1 x:collection1] o.a.s.h.l.XMLLoader xsltCacheLifetimeSeconds=60
    [junit4] 2> 1069839 INFO (coreLoadExecutor-3794-thread-1-processing-n:127.0.0.1:42124_) [n:127.0.0.1:42124_ c:control_collection s:shard1 r:core_node1 x:collection1] o.a.s.c.RequestHandlers Registered paths: /admin/mbeans,standard,/update/json/docs,/admin/luke,/export,/get,/admin/properties,/update/json,/admin/threads,/dump,/update/csv,/sql,/graph,/admin/segments,/admin/system,/replication,/config,/stream,/schema,/admin/plugins,/admin/logging,/admin/ping,/update,/admin/file
    [junit4] 2> 1069839 INFO (coreLoadExecutor-3794-thread-1-processing-n:127.0.0.1:42124_) [n:127.0.0.1:42124_ c:control_collection s:shard1 r:core_node1 x:collection1] o.a.s.c.SolrCore Using default statsCache cache: org.apache.solr.search.stats.LocalStatsCache
    [junit4] 2> 1069839 INFO (coreLoadExecutor-3794-thread-1-processing-n:127.0.0.1:42124_) [n:127.0.0.1:42124_ c:control_collection s:shard1 r:core_node1 x:collection1] o.a.s.u.UpdateHandler Using UpdateLog implementation: org.apache.solr.update.UpdateLog
    [junit4] 2> 1069839 INFO (coreLoadExecutor-3794-thread-1-processing-n:127.0.0.1:42124_) [n:127.0.0.1:42124_ c:control_collection s:shard1 r:core_node1 x:collection1] o.a.s.u.UpdateLog Initializing UpdateLog: dataDir= defaultSyncLevel=FLUSH numRecordsToKeep=100 maxNumLogsToKeep=10 numVersionBuckets=65536
    [junit4] 2> 1069840 INFO (coreLoadExecutor-3794-thread-1-processing-n:127.0.0.1:42124_) [n:127.0.0.1:42124_ c:control_collection s:shard1 r:core_node1 x:collection1] o.a.s.u.CommitTracker Hard AutoCommit: if uncommited for 15000ms;
    [junit4] 2> 1069840 INFO (coreLoadExecutor-3794-thread-1-processing-n:127.0.0.1:42124_) [n:127.0.0.1:42124_ c:control_collection s:shard1 r:core_node1 x:collection1] o.a.s.u.CommitTracker Soft AutoCommit: disabled
    [junit4] 2> 1069840 INFO (coreLoadExecutor-3794-thread-1-processing-n:127.0.0.1:42124_) [n:127.0.0.1:42124_ c:control_collection s:shard1 r:core_node1 x:collection1] o.a.s.u.RandomMergePolicy RandomMergePolicy wrapping class org.apache.lucene.index.LogDocMergePolicy: [LogDocMergePolicy: minMergeSize=1000, mergeFactor=50, maxMergeSize=9223372036854775807, maxMergeSizeForForcedMerge=9223372036854775807, calibrateSizeByDeletes=true, maxMergeDocs=2147483647, maxCFSSegmentSizeMB=8.796093022207999E12, noCFSRatio=1.0]
    [junit4] 2> 1069841 INFO (coreLoadExecutor-3794-thread-1-processing-n:127.0.0.1:42124_) [n:127.0.0.1:42124_ c:control_collection s:shard1 r:core_node1 x:collection1] o.a.s.c.SolrDeletionPolicy SolrDeletionPolicy.onInit: commits: num=1
    [junit4] 2> commit{dir=/home/jenkins/workspace/Lucene-Solr-master-Linux/solr/build/solr-core/test/J1/temp/solr.cloud.ChaosMonkeySafeLeaderTest_82ED2FD3D6DF749A-001/control-001/cores/collection1/data/index,segFN=segments_1,generation=1}
    [junit4] 2> 1069841 INFO (coreLoadExecutor-3794-thread-1-processing-n:127.0.0.1:42124_) [n:127.0.0.1:42124_ c:control_collection s:shard1 r:core_node1 x:collection1] o.a.s.c.SolrDeletionPolicy newest commit generation = 1
    [junit4] 2> 1069841 INFO (coreLoadExecutor-3794-thread-1-processing-n:127.0.0.1:42124_) [n:127.0.0.1:42124_ c:control_collection s:shard1 r:core_node1 x:collection1] o.a.s.s.SolrIndexSearcher Opening [Searcher@32a234df[collection1] main]
    [junit4] 2> 1069841 INFO (coreLoadExecutor-3794-thread-1-processing-n:127.0.0.1:42124_) [n:127.0.0.1:42124_ c:control_collection s:shard1 r:core_node1 x:collection1] o.a.s.c.c.ZkStateReader Load collection config from: [/collections/control_collection]
    [junit4] 2> 1069841 INFO (coreLoadExecutor-3794-thread-1-processing-n:127.0.0.1:42124_) [n:127.0.0.1:42124_ c:control_collection s:shard1 r:core_node1 x:collection1] o.a.s.c.c.ZkStateReader path=[/collections/control_collection] [configName]=[conf1] specified config exists in ZooKeeper
    [junit4] 2> 1069841 INFO (coreLoadExecutor-3794-thread-1-processing-n:127.0.0.1:42124_) [n:127.0.0.1:42124_ c:control_collection s:shard1 r:core_node1 x:collection1] o.a.s.r.ManagedResourceStorage Setting up ZooKeeper-based storage for the RestManager with znodeBase: /configs/conf1
    [junit4] 2> 1069841 INFO (coreLoadExecutor-3794-thread-1-processing-n:127.0.0.1:42124_) [n:127.0.0.1:42124_ c:control_collection s:shard1 r:core_node1 x:collection1] o.a.s.r.ManagedResourceStorage Configured ZooKeeperStorageIO with znodeBase: /configs/conf1
    [junit4] 2> 1069841 INFO (coreLoadExecutor-3794-thread-1-processing-n:127.0.0.1:42124_) [n:127.0.0.1:42124_ c:control_collection s:shard1 r:core_node1 x:collection1] o.a.s.r.RestManager Initializing RestManager with initArgs: {}
    [junit4] 2> 1069841 INFO (coreLoadExecutor-3794-thread-1-processing-n:127.0.0.1:42124_) [n:127.0.0.1:42124_ c:control_collection s:shard1 r:core_node1 x:collection1] o.a.s.r.ManagedResourceStorage Reading _rest_managed.json using ZooKeeperStorageIO:path=/configs/conf1
    [junit4] 2> 1069843 INFO (coreLoadExecutor-3794-thread-1-processing-n:127.0.0.1:42124_) [n:127.0.0.1:42124_ c:control_collection s:shard1 r:core_node1 x:collection1] o.a.s.r.ManagedResourceStorage No data found for znode /configs/conf1/_rest_managed.json
    [junit4] 2> 1069843 INFO (coreLoadExecutor-3794-thread-1-processing-n:127.0.0.1:42124_) [n:127.0.0.1:42124_ c:control_collection s:shard1 r:core_node1 x:collection1] o.a.s.r.ManagedResourceStorage Loaded null at path _rest_managed.json using ZooKeeperStorageIO:path=/configs/conf1
    [junit4] 2> 1069843 INFO (coreLoadExecutor-3794-thread-1-processing-n:127.0.0.1:42124_) [n:127.0.0.1:42124_ c:control_collection s:shard1 r:core_node1 x:collection1] o.a.s.r.RestManager Initializing 0 registered ManagedResources
    [junit4] 2> 1069843 INFO (coreLoadExecutor-3794-thread-1-processing-n:127.0.0.1:42124_) [n:127.0.0.1:42124_ c:control_collection s:shard1 r:core_node1 x:collection1] o.a.s.h.ReplicationHandler Commits will be reserved for 10000
    [junit4] 2> 1069843 INFO (searcherExecutor-3795-thread-1-processing-n:127.0.0.1:42124_ x:collection1 s:shard1 c:control_collection r:core_node1) [n:127.0.0.1:42124_ c:control_collection s:shard1 r:core_node1 x:collection1] o.a.s.c.SolrCore [collection1] Registered new searcher Searcher@32a234df[collection1] main{ExitableDirectoryReader(UninvertingDirectoryReader())}
    [junit4] 2> 1069844 INFO (coreLoadExecutor-3794-thread-1-processing-n:127.0.0.1:42124_) [n:127.0.0.1:42124_ c:control_collection s:shard1 r:core_node1 x:collection1] o.a.s.u.UpdateLog Looking up max value of version field to seed version buckets
    [junit4] 2> 1069844 INFO (coreLoadExecutor-3794-thread-1-processing-n:127.0.0.1:42124_) [n:127.0.0.1:42124_ c:control_collection s:shard1 r:core_node1 x:collection1] o.a.s.u.VersionInfo Refreshing highest value of _version_ for 65536 version buckets from index
    [junit4] 2> 1069844 INFO (coreLoadExecutor-3794-thread-1-processing-n:127.0.0.1:42124_) [n:127.0.0.1:42124_ c:control_collection s:shard1 r:core_node1 x:collection1] o.a.s.u.VersionInfo No terms found for _version_, cannot seed version bucket highest value from index
    [junit4] 2> 1069844 INFO (coreLoadExecutor-3794-thread-1-processing-n:127.0.0.1:42124_) [n:127.0.0.1:42124_ c:control_collection s:shard1 r:core_node1 x:collection1] o.a.s.u.UpdateLog Could not find max version in index or recent updates, using new clock 1537429235405160448
    [junit4] 2> 1069845 INFO (coreLoadExecutor-3794-thread-1-processing-n:127.0.0.1:42124_) [n:127.0.0.1:42124_ c:control_collection s:shard1 r:core_node1 x:collection1] o.a.s.u.UpdateLog Took 1.0ms to seed version buckets with highest version 1537429235405160448
    [junit4] 2> 1069845 INFO (coreLoadExecutor-3794-thread-1-processing-n:127.0.0.1:42124_) [n:127.0.0.1:42124_ c:control_collection s:shard1 r:core_node1 x:collection1] o.a.s.c.ZkController watch zkdir /configs/conf1
    [junit4] 2> 1069846 INFO (coreLoadExecutor-3794-thread-1-processing-n:127.0.0.1:42124_) [n:127.0.0.1:42124_ c:control_collection s:shard1 r:core_node1 x:collection1] o.a.s.c.CoreContainer registering core: collection1
    [junit4] 2> 1069846 INFO (coreZkRegister-3788-thread-1-processing-n:127.0.0.1:42124_ x:collection1 s:shard1 c:control_collection r:core_node1) [n:127.0.0.1:42124_ c:control_collection s:shard1 r:core_node1 x:collection1] o.a.s.c.ZkController Register replica - core:collection1 address:https://127.0.0.1:42124 collection:control_collection shard:shard1
    [junit4] 2> 1069846 INFO (coreZkRegister-3788-thread-1-processing-n:127.0.0.1:42124_ x:collection1 s:shard1 c:control_collection r:core_node1) [n:127.0.0.1:42124_ c:control_collection s:shard1 r:core_node1 x:collection1] o.a.s.c.c.SolrZkClient makePath: /collections/control_collection/leader_elect/shard1/election
    [junit4] 2> 1069848 INFO (coreZkRegister-3788-thread-1-processing-n:127.0.0.1:42124_ x:collection1 s:shard1 c:control_collection r:core_node1) [n:127.0.0.1:42124_ c:control_collection s:shard1 r:core_node1 x:collection1] o.a.s.c.LeaderElector Joined leadership election with path: /collections/control_collection/leader_elect/shard1/election/96089326966603781-core_node1-n_0000000000
    [junit4] 2> 1069848 INFO (coreZkRegister-3788-thread-1-processing-n:127.0.0.1:42124_ x:collection1 s:shard1 c:control_collection r:core_node1) [n:127.0.0.1:42124_ c:control_collection s:shard1 r:core_node1 x:collection1] o.a.s.c.ShardLeaderElectionContext Running the leader process for shard=shard1 and weAreReplacement=false and leaderVoteWait=10000
    [junit4] 2> 1069848 INFO (coreZkRegister-3788-thread-1-processing-n:127.0.0.1:42124_ x:collection1 s:shard1 c:control_collection r:core_node1) [n:127.0.0.1:42124_ c:control_collection s:shard1 r:core_node1 x:collection1] o.a.s.c.ShardLeaderElectionContext Enough replicas found to continue.
    [junit4] 2> 1069848 INFO (coreZkRegister-3788-thread-1-processing-n:127.0.0.1:42124_ x:collection1 s:shard1 c:control_collection r:core_node1) [n:127.0.0.1:42124_ c:control_collection s:shard1 r:core_node1 x:collection1] o.a.s.c.ShardLeaderElectionContext I may be the new leader - try and sync
    [junit4] 2> 1069848 INFO (coreZkRegister-3788-thread-1-processing-n:127.0.0.1:42124_ x:collection1 s:shard1 c:control_collection r:core_node1) [n:127.0.0.1:42124_ c:control_collection s:shard1 r:core_node1 x:collection1] o.a.s.c.SyncStrategy Sync replicas to https://127.0.0.1:42124/collection1/
    [junit4] 2> 1069848 INFO (coreZkRegister-3788-thread-1-processing-n:127.0.0.1:42124_ x:collection1 s:shard1 c:control_collection r:core_node1) [n:127.0.0.1:42124_ c:control_collection s:shard1 r:core_node1 x:collection1] o.a.s.c.SyncStrategy Sync Success - now sync replicas to me
    [junit4] 2> 1069848 INFO (OverseerStateUpdate-96089326966603781-127.0.0.1:42124_-n_0000000000) [n:127.0.0.1:42124_ ] o.a.s.c.Overseer processMessage: queueSize: 1, message = {
    [junit4] 2> "operation":"leader",
    [junit4] 2> "shard":"shard1",
    [junit4] 2> "collection":"control_collection"} current state version: 1
    [junit4] 2> 1069848 INFO (coreZkRegister-3788-thread-1-processing-n:127.0.0.1:42124_ x:collection1 s:shard1 c:control_collection r:core_node1) [n:127.0.0.1:42124_ c:control_collection s:shard1 r:core_node1 x:collection1] o.a.s.c.SyncStrategy https://127.0.0.1:42124/collection1/ has no replicas
    [junit4] 2> 1069849 INFO (zkCallback-1519-thread-1-processing-n:127.0.0.1:42124_) [n:127.0.0.1:42124_ ] o.a.s.c.c.ZkStateReader A cluster state change: [WatchedEvent state:SyncConnected type:NodeDataChanged path:/clusterstate.json], has occurred - updating... (live nodes size: [1])
    [junit4] 2> 1069849 INFO (coreZkRegister-3788-thread-1-processing-n:127.0.0.1:42124_ x:collection1 s:shard1 c:control_collection r:core_node1) [n:127.0.0.1:42124_ c:control_collection s:shard1 r:core_node1 x:collection1] o.a.s.c.c.SolrZkClient makePath: /collections/control_collection/leaders/shard1
    [junit4] 2> 1069850 INFO (coreZkRegister-3788-thread-1-processing-n:127.0.0.1:42124_ x:collection1 s:shard1 c:control_collection r:core_node1) [n:127.0.0.1:42124_ c:control_collection s:shard1 r:core_node1 x:collection1] o.a.s.c.ShardLeaderElectionContextBase Creating leader registration node /collections/control_collection/leaders/shard1/leader after winning as /collections/control_collection/leader_elect/shard1/election/96089326966603781-core_node1-n_0000000000
    [junit4] 2> 1069850 INFO (coreZkRegister-3788-thread-1-processing-n:127.0.0.1:42124_ x:collection1 s:shard1 c:control_collection r:core_node1) [n:127.0.0.1:42124_ c:control_collection s:shard1 r:core_node1 x:collection1] o.a.s.c.ShardLeaderElectionContext I am the new leader: https://127.0.0.1:42124/collection1/ shard1
    [junit4] 2> 1069851 INFO (OverseerStateUpdate-96089326966603781-127.0.0.1:42124_-n_0000000000) [n:127.0.0.1:42124_ ] o.a.s.c.Overseer processMessage: queueSize: 1, message = {
    [junit4] 2> "operation":"leader",
    [junit4] 2> "shard":"shard1",
    [junit4] 2> "collection":"control_collection",
    [junit4] 2> "base_url":"https://127.0.0.1:42124",
    [junit4] 2> "core":"collection1",
    [junit4] 2> "state":"active"} current state version: 2
    [junit4] 2> 1069868 INFO (TEST-ChaosMonkeySafeLeaderTest.test-seed#[82ED2FD3D6DF749A]) [ ] o.a.s.c.s.i.CloudSolrClient Final constructed zkHost string: 127.0.0.1:45257/solr
    [junit4] 2> 1069868 INFO (TEST-ChaosMonkeySafeLeaderTest.test-seed#[82ED2FD3D6DF749A]) [ ] o.a.s.c.c.SolrZkClient Using default ZkCredentialsProvider
    [junit4] 2> 1069868 INFO (TEST-ChaosMonkeySafeLeaderTest.test-seed#[82ED2FD3D6DF749A]) [ ] o.a.s.c.c.ConnectionManager Waiting for client to connect to ZooKeeper
    [junit4] 2> 1069869 INFO (zkCallback-1523-thread-1) [ ] o.a.s.c.c.ConnectionManager Watcher org.apache.solr.common.cloud.ConnectionManager@46270338 name:ZooKeeperConnection Watcher:127.0.0.1:45257/solr got event WatchedEvent state:SyncConnected type:None path:null path:null type:None
    [junit4] 2> 1069869 INFO (TEST-ChaosMonkeySafeLeaderTest.test-seed#[82ED2FD3D6DF749A]) [ ] o.a.s.c.c.ConnectionManager Client is connected to ZooKeeper
    [junit4] 2> 1069869 INFO (TEST-ChaosMonkeySafeLeaderTest.test-seed#[82ED2FD3D6DF749A]) [ ] o.a.s.c.c.SolrZkClient Using default ZkACLProvider
    [junit4] 2> 1069869 INFO (TEST-ChaosMonkeySafeLeaderTest.test-seed#[82ED2FD3D6DF749A]) [ ] o.a.s.c.c.ZkStateReader Updating cluster state from ZooKeeper...
    [junit4] 2> 1069870 INFO (TEST-ChaosMonkeySafeLeaderTest.test-seed#[82ED2FD3D6DF749A]) [ ] o.a.s.c.c.ZkStateReader Loaded cluster properties: {urlScheme=https}
    [junit4] 2> 1069870 INFO (TEST-ChaosMonkeySafeLeaderTest.test-seed#[82ED2FD3D6DF749A]) [ ] o.a.s.c.c.ZkStateReader Updated live nodes from ZooKeeper... (0) -> (1)
    [junit4] 2> 1069871 INFO (TEST-ChaosMonkeySafeLeaderTest.test-seed#[82ED2FD3D6DF749A]) [ ] o.a.s.c.ChaosMonkey monkey: init - expire sessions:false cause connection loss:false
    [junit4] 2> 1069929 INFO (TEST-ChaosMonkeySafeLeaderTest.test-seed#[82ED2FD3D6DF749A]) [ ] o.a.s.SolrTestCaseJ4 Writing core.properties file to /home/jenkins/workspace/Lucene-Solr-master-Linux/solr/build/solr-core/test/J1/temp/solr.cloud.ChaosMonkeySafeLeaderTest_82ED2FD3D6DF749A-001/shard-1-001/cores/collection1
    [junit4] 2> 1069930 INFO (TEST-ChaosMonkeySafeLeaderTest.test-seed#[82ED2FD3D6DF749A]) [ ] o.a.s.c.AbstractFullDistribZkTestBase create jetty 1 in directory /home/jenkins/workspace/Lucene-Solr-master-Linux/solr/build/solr-core/test/J1/temp/solr.cloud.ChaosMonkeySafeLeaderTest_82ED2FD3D6DF749A-001/shard-1-001
    [junit4] 2> 1069931 INFO (TEST-ChaosMonkeySafeLeaderTest.test-seed#[82ED2FD3D6DF749A]) [ ] o.e.j.s.Server jetty-9.3.8.v20160314
    [junit4] 2> 1069932 INFO (TEST-ChaosMonkeySafeLeaderTest.test-seed#[82ED2FD3D6DF749A]) [ ] o.e.j.s.h.ContextHandler Started o.e.j.s.ServletContextHandler@4cd05d2d{/,null,AVAILABLE}
    [junit4] 2> 1069933 INFO (TEST-ChaosMonkeySafeLeaderTest.test-seed#[82ED2FD3D6DF749A]) [ ] o.e.j.s.ServerConnector Started ServerConnector@2e485517{SSL,[ssl, http/1.1]}{127.0.0.1:45604}
    [junit4] 2> 1069933 INFO (TEST-ChaosMonkeySafeLeaderTest.test-seed#[82ED2FD3D6DF749A]) [ ] o.e.j.s.Server Started @1071842ms
    [junit4] 2> 1069933 INFO (TEST-ChaosMonkeySafeLeaderTest.test-seed#[82ED2FD3D6DF749A]) [ ] o.a.s.c.s.e.JettySolrRunner Jetty properties: {solr.data.dir=/home/jenkins/workspace/Lucene-Solr-master-Linux/solr/build/solr-core/test/J1/temp/solr.cloud.ChaosMonkeySafeLeaderTest_82ED2FD3D6DF749A-001/tempDir-001/jetty1, solrconfig=solrconfig.xml, hostContext=/, hostPort=45604, coreRootDirectory=/home/jenkins/workspace/Lucene-Solr-master-Linux/solr/build/solr-core/test/J1/temp/solr.cloud.ChaosMonkeySafeLeaderTest_82ED2FD3D6DF749A-001/shard-1-001/cores}
    [junit4] 2> 1069933 INFO (TEST-ChaosMonkeySafeLeaderTest.test-seed#[82ED2FD3D6DF749A]) [ ] o.a.s.s.SolrDispatchFilter SolrDispatchFilter.init(): sun.misc.Launcher$AppClassLoader@73d16e93
    [junit4] 2> 1069933 INFO (TEST-ChaosMonkeySafeLeaderTest.test-seed#[82ED2FD3D6DF749A]) [ ] o.a.s.c.SolrResourceLoader new SolrResourceLoader for directory: '/home/jenkins/workspace/Lucene-Solr-master-Linux/solr/build/solr-core/test/J1/temp/solr.cloud.ChaosMonkeySafeLeaderTest_82ED2FD3D6DF749A-001/shard-1-001'
    [junit4] 2> 1069933 INFO (TEST-ChaosMonkeySafeLeaderTest.test-seed#[82ED2FD3D6DF749A]) [ ] o.a.s.c.SolrResourceLoader JNDI not configured for solr (NoInitialContextEx)
    [junit4] 2> 1069934 INFO (TEST-ChaosMonkeySafeLeaderTest.test-seed#[82ED2FD3D6DF749A]) [ ] o.a.s.c.SolrResourceLoader solr home defaulted to 'solr/' (could not find system property or JNDI)
    [junit4] 2> 1069934 INFO (TEST-ChaosMonkeySafeLeaderTest.test-seed#[82ED2FD3D6DF749A]) [ ] o.a.s.c.c.SolrZkClient Using default ZkCredentialsProvider
    [junit4] 2> 1069934 INFO (TEST-ChaosMonkeySafeLeaderTest.test-seed#[82ED2FD3D6DF749A]) [ ] o.a.s.c.c.ConnectionManager Waiting for client to connect to ZooKeeper
    [junit4] 2> 1069935 INFO (zkCallback-1524-thread-1) [ ] o.a.s.c.c.ConnectionManager Watcher org.apache.solr.common.cloud.ConnectionManager@10f8321a name:ZooKeeperConnection Watcher:127.0.0.1:45257/solr got event WatchedEvent state:SyncConnected type:None path:null path:null type:None
    [junit4] 2> 1069935 INFO (TEST-ChaosMonkeySafeLeaderTest.test-seed#[82ED2FD3D6DF749A]) [ ] o.a.s.c.c.ConnectionManager Client is connected to ZooKeeper
    [junit4] 2> 1069935 INFO (TEST-ChaosMonkeySafeLeaderTest.test-seed#[82ED2FD3D6DF749A]) [ ] o.a.s.c.c.SolrZkClient Using default ZkACLProvider
    [junit4] 2> 1069936 INFO (TEST-ChaosMonkeySafeLeaderTest.test-seed#[82ED2FD3D6DF749A]) [ ] o.a.s.s.SolrDispatchFilter Loading solr.xml from SolrHome (not found in ZooKeeper)
    [junit4] 2> 1069936 INFO (TEST-ChaosMonkeySafeLeaderTest.test-seed#[82ED2FD3D6DF749A]) [ ] o.a.s.c.SolrXmlConfig Loading container configuration from /home/jenkins/workspace/Lucene-Solr-master-Linux/solr/build/solr-core/test/J1/temp/solr.cloud.ChaosMonkeySafeLeaderTest_82ED2FD3D6DF749A-001/shard-1-001/solr.xml
    [junit4] 2> 1069940 INFO (TEST-ChaosMonkeySafeLeaderTest.test-seed#[82ED2FD3D6DF749A]) [ ] o.a.s.c.CorePropertiesLocator Config-defined core root directory: /home/jenkins/workspace/Lucene-Solr-master-Linux/solr/build/solr-core/test/J1/temp/solr.cloud.ChaosMonkeySafeLeaderTest_82ED2FD3D6DF749A-001/shard-1-001/cores
    [junit4] 2> 1069940 INFO (TEST-ChaosMonkeySafeLeaderTest.test-seed#[82ED2FD3D6DF749A]) [ ] o.a.s.c.CoreContainer New CoreContainer 946057562
    [junit4] 2> 1069940 INFO (TEST-ChaosMonkeySafeLeaderTest.test-seed#[82ED2FD3D6DF749A]) [ ] o.a.s.c.CoreContainer Loading cores into CoreContainer [instanceDir=/home/jenkins/workspace/Lucene-Solr-master-Linux/solr/build/solr-core/test/J1/temp/solr.cloud.ChaosMonkeySafeLeaderTest_82ED2FD3D6DF749A-001/shard-1-001]
    [junit4] 2> 1069940 WARN (TEST-ChaosMonkeySafeLeaderTest.test-seed#[82ED2FD3D6DF749A]) [ ] o.a.s.c.CoreContainer Couldn't add files from /home/jenkins/workspace/Lucene-Solr-master-Linux/solr/build/solr-core/test/J1/temp/solr.cloud.ChaosMonkeySafeLeaderTest_82ED2FD3D6DF749A-001/shard-1-001/lib to classpath: /home/jenkins/workspace/Lucene-Solr-master-Linux/solr/build/solr-core/test/J1/temp/solr.cloud.ChaosMonkeySafeLeaderTest_82ED2FD3D6DF749A-001/shard-1-001/lib
    [junit4] 2> 1069940 INFO (TEST-ChaosMonkeySafeLeaderTest.test-seed#[82ED2FD3D6DF749A]) [ ] o.a.s.h.c.HttpShardHandlerFactory created with socketTimeout : 90000,urlScheme : ,connTimeout : 15000,maxConnectionsPerHost : 20,maxConnections : 10000,corePoolSize : 0,maximumPoolSize : 2147483647,maxThreadIdleTime : 5,sizeOfQueue : -1,fairnessPolicy : false,
    [junit4] 2> 1069941 INFO (TEST-ChaosMonkeySafeLeaderTest.test-seed#[82ED2FD3D6DF749A]) [ ] o.a.s.u.UpdateShardHandler Creating UpdateShardHandler HTTP client with params:
    [junit4] 2> 1069942 INFO (TEST-ChaosMonkeySafeLeaderTest.test-seed#[82ED2FD3D6DF749A]) [ ] o.a.s.l.LogWatcher SLF4J impl is org.slf4j.impl.Log4jLoggerFactory
    [junit4] 2> 1069942 INFO (TEST-ChaosMonkeySafeLeaderTest.test-seed#[82ED2FD3D6DF749A]) [ ] o.a.s.l.LogWatcher Registering Log Listener [Log4j (org.slf4j.impl.Log4jLoggerFactory)]
    [junit4] 2> 1069942 INFO (TEST-ChaosMonkeySafeLeaderTest.test-seed#[82ED2FD3D6DF749A]) [ ] o.a.s.c.ZkContainer Zookeeper client=127.0.0.1:45257/solr
    [junit4] 2> 1069942 INFO (TEST-ChaosMonkeySafeLeaderTest.test-seed#[82ED2FD3D6DF749A]) [ ] o.a.s.c.ZkController zkHost includes chroot
    [junit4] 2> 1069942 INFO (TEST-ChaosMonkeySafeLeaderTest.test-seed#[82ED2FD3D6DF749A]) [ ] o.a.s.c.c.SolrZkClient Using default ZkCredentialsProvider
    [junit4] 2> 1069943 INFO (TEST-ChaosMonkeySafeLeaderTest.test-seed#[82ED2FD3D6DF749A]) [ ] o.a.s.c.c.ConnectionManager Waiting for client to connect to ZooKeeper
    [junit4] 2> 1069943 INFO (zkCallback-1527-thread-1) [ ] o.a.s.c.c.ConnectionManager Watcher org.apache.solr.common.cloud.ConnectionManager@509ca37 name:ZooKeeperConnection Watcher:127.0.0.1:45257 got event WatchedEvent state:SyncConnected type:None path:null path:null type:None
    [junit4] 2> 1069943 INFO (TEST-ChaosMonkeySafeLeaderTest.test-seed#[82ED2FD3D6DF749A]) [ ] o.a.s.c.c.ConnectionManager Client is connected to ZooKeeper
    [junit4] 2> 1069944 INFO (TEST-ChaosMonkeySafeLeaderTest.test-seed#[82ED2FD3D6DF749A]) [ ] o.a.s.c.c.SolrZkClient Using default ZkACLProvider
    [junit4] 2> 1069946 INFO (TEST-ChaosMonkeySafeLeaderTest.test-seed#[82ED2FD3D6DF749A]) [n:127.0.0.1:45604_ ] o.a.s.c.ZkController Added new OnReconnect listener org.apache.solr.cloud.ZkController$$Lambda$59/1902417067@7cb07972
    [junit4] 2> 1069946 INFO (TEST-ChaosMonkeySafeLeaderTest.test-seed#[82ED2FD3D6DF749A]) [n:127.0.0.1:45604_ ] o.a.s.c.c.ConnectionManager Waiting for client to connect to ZooKeeper
    [junit4] 2> 1069947 INFO (zkCallback-1528-thread-1-processing-n:127.0.0.1:45604_) [n:127.0.0.1:45604_ ] o.a.s.c.c.ConnectionManager Watcher org.apache.solr.common.cloud.ConnectionManager@4b1a790c name:ZooKeeperConnection Watcher:127.0.0.1:45257/solr got event WatchedEvent state:SyncConnected type:None path:null path:null type:None
    [junit4] 2> 1069947 INFO (TEST-ChaosMonkeySafeLeaderTest.test-seed#[82ED2FD3D6DF749A]) [n:127.0.0.1:45604_ ] o.a.s.c.c.ConnectionManager Client is connected to ZooKeeper
    [junit4] 2> 1069949 INFO (TEST-ChaosMonkeySafeLeaderTest.test-seed#[82ED2FD3D6DF749A]) [n:127.0.0.1:45604_ ] o.a.s.c.c.ZkStateReader Updating cluster state from ZooKeeper...
    [junit4] 2> 1069951 INFO (TEST-ChaosMonkeySafeLeaderTest.test-seed#[82ED2FD3D6DF749A]) [n:127.0.0.1:45604_ ] o.a.s.c.c.ZkStateReader Loaded cluster properties: {urlScheme=https}
    [junit4] 2> 1069951 INFO (TEST-ChaosMonkeySafeLeaderTest.test-seed#[82ED2FD3D6DF749A]) [n:127.0.0.1:45604_ ] o.a.s.c.c.ZkStateReader Updated live nodes from ZooKeeper... (0) -> (1)
    [junit4] 2> 1069952 INFO (TEST-ChaosMonkeySafeLeaderTest.test-seed#[82ED2FD3D6DF749A]) [n:127.0.0.1:45604_ ] o.a.s.c.Overseer Overseer (id=null) closing
    [junit4] 2> 1069952 INFO (zkCallback-1519-thread-2-processing-n:127.0.0.1:42124_) [n:127.0.0.1:42124_ ] o.a.s.c.c.ZkStateReader A cluster state change: [WatchedEvent state:SyncConnected type:NodeDataChanged path:/clusterstate.json], has occurred - updating... (live nodes size: [1])
    [junit4] 2> 1069952 INFO (zkCallback-1523-thread-1) [ ] o.a.s.c.c.ZkStateReader A cluster state change: [WatchedEvent state:SyncConnected type:NodeDataChanged path:/clusterstate.json], has occurred - updating... (live nodes size: [1])
    [junit4] 2> 1069952 INFO (TEST-ChaosMonkeySafeLeaderTest.test-seed#[82ED2FD3D6DF749A]) [n:127.0.0.1:45604_ ] o.a.s.c.LeaderElector Joined leadership election with path: /overseer_elect/election/96089326966603785-127.0.0.1:45604_-n_0000000001
    [junit4] 2> 1069952 INFO (zkCallback-1528-thread-1-processing-n:127.0.0.1:45604_) [n:127.0.0.1:45604_ ] o.a.s.c.c.ZkStateReader A cluster state change: [WatchedEvent state:SyncConnected type:NodeDataChanged path:/clusterstate.json], has occurred - updating... (live nodes size: [1])
    [junit4] 2> 1069952 INFO (TEST-ChaosMonkeySafeLeaderTest.test-seed#[82ED2FD3D6DF749A]) [n:127.0.0.1:45604_ ] o.a.s.c.LeaderElector Watching path /overseer_elect/election/96089326966603781-127.0.0.1:42124_-n_0000000000 to know if I could be the leader
    [junit4] 2> 1069952 INFO (TEST-ChaosMonkeySafeLeaderTest.test-seed#[82ED2FD3D6DF749A]) [n:127.0.0.1:45604_ ] o.a.s.c.ZkController Publish node=127.0.0.1:45604_ as DOWN
    [junit4] 2> 1069955 INFO (OverseerStateUpdate-96089326966603781-127.0.0.1:42124_-n_0000000000) [n:127.0.0.1:42124_ ] o.a.s.c.Overseer processMessage: queueSize: 1, message = {
    [junit4] 2> "operation":"downnode",
    [junit4] 2> "node_name":"127.0.0.1:45604_"} current state version: 3
    [junit4] 2> 1069955 INFO (OverseerStateUpdate-96089326966603781-127.0.0.1:42124_-n_0000000000) [n:127.0.0.1:42124_ ] o.a.s.c.o.NodeMutator DownNode state invoked for node: 127.0.0.1:45604_
    [junit4] 2> 1070001 INFO (coreZkRegister-3788-thread-1-processing-n:127.0.0.1:42124_ x:collection1 s:shard1 c:control_collection r:core_node1) [n:127.0.0.1:42124_ c:control_collection s:shard1 r:core_node1 x:collection1] o.a.s.c.ZkController We are https://127.0.0.1:42124/collection1/ and leader is https://127.0.0.1:42124/collection1/
    [junit4] 2> 1070001 INFO (coreZkRegister-3788-thread-1-processing-n:127.0.0.1:42124_ x:collection1 s:shard1 c:control_collection r:core_node1) [n:127.0.0.1:42124_ c:control_collection s:shard1 r:core_node1 x:collection1] o.a.s.c.ZkController No LogReplay needed for core=collection1 baseURL=https://127.0.0.1:42124
    [junit4] 2> 1070001 INFO (coreZkRegister-3788-thread-1-processing-n:127.0.0.1:42124_ x:collection1 s:shard1 c:control_collection r:core_node1) [n:127.0.0.1:42124_ c:control_collection s:shard1 r:core_node1 x:collection1] o.a.s.c.ZkController I am the leader, no recovery necessary
    [junit4] 2> 1070001 INFO (coreZkRegister-3788-thread-1-processing-n:127.0.0.1:42124_ x:collection1 s:shard1 c:control_collection r:core_node1) [n:127.0.0.1:42124_ c:control_collection s:shard1 r:core_node1 x:collection1] o.a.s.c.ZkController publishing state=active
    [junit4] 2> 1070001 INFO (coreZkRegister-3788-thread-1-processing-n:127.0.0.1:42124_ x:collection1 s:shard1 c:control_collection r:core_node1) [n:127.0.0.1:42124_ c:control_collection s:shard1 r:core_node1 x:collection1] o.a.s.c.ZkController numShards not found on descriptor - reading it from system property
    [junit4] 2> 1070003 INFO (OverseerStateUpdate-96089326966603781-127.0.0.1:42124_-n_0000000000) [n:127.0.0.1:42124_ ] o.a.s.c.Overseer processMessage: queueSize: 1, message = {
    [junit4] 2> "core":"collection1",
    [junit4] 2> "core_node_name":"core_node1",
    [junit4] 2> "roles":null,
    [junit4] 2> "base_url":"https://127.0.0.1:42124",
    [junit4] 2> "node_name":"127.0.0.1:42124_",
    [junit4] 2> "numShards":"3",
    [junit4] 2> "state":"active",
    [junit4] 2> "shard":"shard1",
    [junit4] 2> "collection":"control_collection",
    [junit4] 2> "operation":"state"} current state version: 3
    [junit4] 2> 1070003 INFO (OverseerStateUpdate-96089326966603781-127.0.0.1:42124_-n_0000000000) [n:127.0.0.1:42124_ ] o.a.s.c.o.ReplicaMutator Update state numShards=3 message={
    [junit4] 2> "core":"collection1",
    [junit4] 2> "core_node_name":"core_node1",
    [junit4] 2> "roles":null,
    [junit4] 2> "base_url":"https://127.0.0.1:42124",
    [junit4] 2> "node_name":"127.0.0.1:42124_",
    [junit4] 2> "numShards":"3",
    [junit4] 2> "state":"active",
    [junit4] 2> "shard":"shard1",
    [junit4] 2> "collection":"control_collection",
    [junit4] 2> "operation":"state"}
    [junit4] 2> 1070104 INFO (zkCallback-1528-thread-1-processing-n:127.0.0.1:45604_) [n:127.0.0.1:45604_ ] o.a.s.c.c.ZkStateReader A cluster state change: [WatchedEvent state:SyncConnected type:NodeDataChanged path:/clusterstate.json], has occurred - updating... (live nodes size: [1])
    [junit4] 2> 1070104 INFO (zkCallback-1523-thread-1) [ ] o.a.s.c.c.ZkStateReader A cluster state change: [WatchedEvent state:SyncConnected type:NodeDataChanged path:/clusterstate.json], has occurred - updating... (live nodes size: [1])
    [junit4] 2> 1070104 INFO (zkCallback-1519-thread-2-processing-n:127.0.0.1:42124_) [n:127.0.0.1:42124_ ] o.a.s.c.c.ZkStateReader A cluster state change: [WatchedEvent state:SyncConnected type:NodeDataChanged path:/clusterstate.json], has occurred - updating... (live nodes size: [1])
    [junit4] 2> 1070954 INFO (TEST-ChaosMonkeySafeLeaderTest.test-seed#[82ED2FD3D6DF749A]) [n:127.0.0.1:45604_ ] o.a.s.c.ZkController Register node as live in ZooKeeper:/live_nodes/127.0.0.1:45604_
    [junit4] 2> 1070954 INFO (TEST-ChaosMonkeySafeLeaderTest.test-seed#[82ED2FD3D6DF749A]) [n:127.0.0.1:45604_ ] o.a.s.c.c.SolrZkClient makePath: /live_nodes/127.0.0.1:45604_
    [junit4] 2> 1070955 INFO (zkCallback-1523-thread-1) [ ] o.a.s.c.c.ZkStateReader A live node change: [WatchedEvent state:SyncConnected type:NodeChildrenChanged path:/live_nodes], has occurred - updating... (live nodes size: [1])
    [junit4] 2> 1070955 INFO (zkCallback-1519-thread-2-processing-n:127.0.0.1:42124_) [n:127.0.0.1:42124_ ] o.a.s.c.c.ZkStateReader A live node change: [WatchedEvent state:SyncConnected type:NodeChildrenChanged path:/live_nodes], has occurred - updating... (live nodes size: [1])
    [junit4] 2> 1070955 INFO (zkCallback-1528-thread-1-processing-n:127.0.0.1:45604_) [n:127.0.0.1:45604_ ] o.a.s.c.c.ZkStateReader A live node change: [WatchedEvent state:SyncConnected type:NodeChildrenChanged path:/live_nodes], has occurred - updating... (live nodes size: [1])
    [junit4] 2> 1070955 INFO (zkCallback-1523-thread-1) [ ] o.a.s.c.c.ZkStateReader Updated live nodes from ZooKeeper... (1) -> (2)
    [junit4] 2> 1070955 INFO (zkCallback-1528-thread-1-processing-n:127.0.0.1:45604_) [n:127.0.0.1:45604_ ] o.a.s.c.c.ZkStateReader Updated live nodes from ZooKeeper... (1) -> (2)
    [junit4] 2> 1070955 INFO (zkCallback-1519-thread-2-processing-n:127.0.0.1:42124_) [n:127.0.0.1:42124_ ] o.a.s.c.c.ZkStateReader Updated live nodes from ZooKeeper... (1) -> (2)
    [junit4] 2> 1070979 INFO (TEST-ChaosMonkeySafeLeaderTest.test-seed#[82ED2FD3D6DF749A]) [n:127.0.0.1:45604_ ] o.a.s.c.CoreContainer Security conf doesn't exist. Skipping setup for authorization module.
    [junit4] 2> 1070979 INFO (TEST-ChaosMonkeySafeLeaderTest.test-seed#[82ED2FD3D6DF749A]) [n:127.0.0.1:45604_ ] o.a.s.c.CoreContainer No authentication plugin used.
    [junit4] 2> 1070980 INFO (TEST-ChaosMonkeySafeLeaderTest.test-seed#[82ED2FD3D6DF749A]) [n:127.0.0.1:45604_ ] o.a.s.c.CorePropertiesLocator Looking for core definitions underneath /home/jenkins/workspace/Lucene-Solr-master-Linux/solr/build/solr-core/test/J1/temp/solr.cloud.ChaosMonkeySafeLeaderTest_82ED2FD3D6DF749A-001/shard-1-001/cores
    [junit4] 2> 1070980 INFO (TEST-ChaosMonkeySafeLeaderTest.test-seed#[82ED2FD3D6DF749A]) [n:127.0.0.1:45604_ ] o.a.s.c.CoreDescriptor Created CoreDescriptor: {name=collection1, config=solrconfig.xml, transient=false, schema=schema.xml, loadOnStartup=true, configSetProperties=configsetprops.json, collection=collection1, coreNodeName=, dataDir=data/, shard=}
    [junit4] 2> 1070980 INFO (TEST-ChaosMonkeySafeLeaderTest.test-seed#[82ED2FD3D6DF749A]) [n:127.0.0.1:45604_ ] o.a.s.c.CorePropertiesLocator Found core collection1 in /home/jenkins/workspace/Lucene-Solr-master-Linux/solr/build/solr-core/test/J1/temp/solr.cloud.ChaosMonkeySafeLeaderTest_82ED2FD3D6DF749A-001/shard-1-001/cores/collection1
    [junit4] 2> 1070980 INFO (TEST-ChaosMonkeySafeLeaderTest.test-seed#[82ED2FD3D6DF749A]) [n:127.0.0.1:45604_ ] o.a.s.c.CorePropertiesLocator Found 1 core definitions
    [junit4] 2> 1070981 INFO (coreLoadExecutor-3805-thread-1-processing-n:127.0.0.1:45604_) [n:127.0.0.1:45604_ c:collection1 x:collection1] o.a.s.c.ZkController publishing state=down
    [junit4] 2> 1070981 INFO (coreLoadExecutor-3805-thread-1-processing-n:127.0.0.1:45604_) [n:127.0.0.1:45604_ c:collection1 x:collection1] o.a.s.c.ZkController numShards not found on descriptor - reading it from system property
    [junit4] 2> 1070981 INFO (TEST-ChaosMonkeySafeLeaderTest.test-seed#[82ED2FD3D6DF749A]) [n:127.0.0.1:45604_ ] o.a.s.s.SolrDispatchFilter user.dir=/home/jenkins/workspace/Lucene-Solr-master-Linux/solr/build/solr-core/test/J1
    [junit4] 2> 1070981 INFO (TEST-ChaosMonkeySafeLeaderTest.test-seed#[82ED2FD3D6DF749A]) [n:127.0.0.1:45604_ ] o.a.s.s.SolrDispatchFilter SolrDispatchFilter.init() done
    [junit4] 2> 1070981 INFO (coreLoadExecutor-3805-thread-1-processing-n:127.0.0.1:45604_) [n:127.0.0.1:45604_ c:collection1 x:collection1] o.a.s.c.ZkController Collection collection1 not visible yet, but flagging it so a watch is registered when it becomes visible
    [junit4] 2> 1070981 INFO (OverseerStateUpdate-96089326966603781-127.0.0.1:42124_-n_0000000000) [n:127.0.0.1:42124_ ] o.a.s.c.Overseer processMessage: queueSize: 1, message = {
    [junit4] 2> "core":"collection1",
    [junit4] 2> "roles":null,
    [junit4] 2> "base_url":"https://127.0.0.1:45604",
    [junit4] 2> "node_name":"127.0.0.1:45604_",
    [junit4] 2> "numShards":"3",
    [junit4] 2> "state":"down",
    [junit4] 2> "shard":null,
    [junit4] 2> "collection":"collection1",
    [junit4] 2> "operation":"state"} current state version: 4
    [junit4] 2> 1070982 INFO (OverseerStateUpdate-96089326966603781-127.0.0.1:42124_-n_0000000000) [n:127.0.0.1:42124_ ] o.a.s.c.o.ReplicaMutator Update state numShards=3 message={
    [junit4] 2> "core":"collection1",
    [junit4] 2> "roles":null,
    [junit4] 2> "base_url":"https://127.0.0.1:45604",
    [junit4] 2> "node_name":"127.0.0.1:45604_",
    [junit4] 2> "numShards":"3",
    [junit4] 2> "state":"down",
    [junit4] 2> "shard":null,
    [junit4] 2> "collection":"collection1",
    [junit4] 2> "operation":"state"}
    [junit4] 2> 1070982 INFO (coreLoadExecutor-3805-thread-1-processing-n:127.0.0.1:45604_) [n:127.0.0.1:45604_ c:collection1 x:collection1] o.a.s.c.c.ZkStateReader Deleting data for [collection1]
    [junit4] 2> 1070983 INFO (OverseerStateUpdate-96089326966603781-127.0.0.1:42124_-n_0000000000) [n:127.0.0.1:42124_ ] o.a.s.c.o.ClusterStateMutator building a new cName: collection1
    [junit4] 2> 1070983 INFO (OverseerStateUpdate-96089326966603781-127.0.0.1:42124_-n_0000000000) [n:127.0.0.1:42124_ ] o.a.s.c.o.ReplicaMutator Assigning new node to shard shard=shard2
    [junit4] 2> 1070983 INFO (coreLoadExecutor-3805-thread-1-processing-n:127.0.0.1:45604_) [n:127.0.0.1:45604_ c:collection1 x:collection1] o.a.s.c.ZkController look for our core node name
    [junit4] 2> 1071084 INFO (zkCallback-1523-thread-1) [ ] o.a.s.c.c.ZkStateReader A cluster state change: [WatchedEvent state:SyncConnected type:NodeDataChanged path:/clusterstate.json], has occurred - updating... (live nodes size: [2])
    [junit4] 2> 1071084 INFO (zkCallback-1528-thread-1-processing-n:127.0.0.1:45604_) [n:127.0.0.1:45604_ ] o.a.s.c.c.ZkStateReader A cluster state change: [WatchedEvent state:SyncConnected type:NodeDataChanged path:/clusterstate.json], has occurred - upda

[...truncated too long message...]

ot load conf for core testschemaapi_shard1_replica2: Error attempting to access /configs/conf1/managed-schema
    [junit4] 2> at org.apache.solr.core.ConfigSetService.getConfig(ConfigSetService.java:85)
    [junit4] 2> at org.apache.solr.core.CoreContainer.reload(CoreContainer.java:935)
    [junit4] 2> ... 2 more
    [junit4] 2> Caused by: org.apache.solr.common.SolrException: Error attempting to access /configs/conf1/managed-schema
    [junit4] 2> at org.apache.solr.schema.ManagedIndexSchemaFactory.create(ManagedIndexSchemaFactory.java:141)
    [junit4] 2> at org.apache.solr.schema.ManagedIndexSchemaFactory.create(ManagedIndexSchemaFactory.java:45)
    [junit4] 2> at org.apache.solr.schema.IndexSchemaFactory.buildIndexSchema(IndexSchemaFactory.java:75)
    [junit4] 2> at org.apache.solr.core.ConfigSetService.createIndexSchema(ConfigSetService.java:107)
    [junit4] 2> at org.apache.solr.core.ConfigSetService.getConfig(ConfigSetService.java:78)
    [junit4] 2> ... 3 more
    [junit4] 2> Caused by: org.apache.zookeeper.KeeperException$SessionExpiredException: KeeperErrorCode = Session expired for /configs/conf1/managed-schema
    [junit4] 2> at org.apache.zookeeper.KeeperException.create(KeeperException.java:127)
    [junit4] 2> at org.apache.zookeeper.KeeperException.create(KeeperException.java:51)
    [junit4] 2> at org.apache.zookeeper.ZooKeeper.getData(ZooKeeper.java:1155)
    [junit4] 2> at org.apache.solr.common.cloud.SolrZkClient$7.execute(SolrZkClient.java:347)
    [junit4] 2> at org.apache.solr.common.cloud.SolrZkClient$7.execute(SolrZkClient.java:344)
    [junit4] 2> at org.apache.solr.common.cloud.ZkCmdExecutor.retryOperation(ZkCmdExecutor.java:60)
    [junit4] 2> at org.apache.solr.common.cloud.SolrZkClient.getData(SolrZkClient.java:344)
    [junit4] 2> at org.apache.solr.schema.ManagedIndexSchemaFactory.create(ManagedIndexSchemaFactory.java:126)
    [junit4] 2> ... 7 more
    [junit4] 2> 2282149 INFO (Thread-5444) [ ] o.a.s.c.ZkTestServer connecting to 127.0.0.1:45450 45450
    [junit4] 2> 2282150 WARN (Thread-5444) [ ] o.a.s.c.ZkTestServer Watch limit violations:
    [junit4] 2> Maximum concurrent create/delete watches above limit:
    [junit4] 2>
    [junit4] 2> 6 /solr/configs/conf1
    [junit4] 2> 5 /solr/configs/conf1/managed-schema
    [junit4] 2> 3 /solr/aliases.json
    [junit4] 2> 2 /solr/security.json
    [junit4] 2>
    [junit4] 2> Maximum concurrent data watches above limit:
    [junit4] 2>
    [junit4] 2> 3 /solr/clusterstate.json
    [junit4] 2> 3 /solr/clusterprops.json
    [junit4] 2> 2 /solr/collections/testschemaapi/state.json
    [junit4] 2>
    [junit4] 2> Maximum concurrent children watches above limit:
    [junit4] 2>
    [junit4] 2> 10 /solr/overseer/queue
    [junit4] 2> 9 /solr/overseer/collection-queue-work
    [junit4] 2> 4 /solr/overseer/queue-work
    [junit4] 2> 3 /solr/live_nodes
    [junit4] 2> 3 /solr/collections
    [junit4] 2>
    [junit4] 2> 2282150 INFO (SUITE-TestManagedSchemaAPI-seed#[82ED2FD3D6DF749A]-worker) [ ] o.a.s.SolrTestCaseJ4 ###deleteCore
    [junit4] 2> NOTE: leaving temporary files on disk at: /home/jenkins/workspace/Lucene-Solr-master-Linux/solr/build/solr-core/test/J1/temp/solr.schema.TestManagedSchemaAPI_82ED2FD3D6DF749A-001
    [junit4] 2> Jun 17, 2016 11:59:47 PM com.carrotsearch.randomizedtesting.ThreadLeakControl checkThreadLeaks
    [junit4] 2> WARNING: Will linger awaiting termination of 4 leaked thread(s).
    [junit4] 2> NOTE: test params are: codec=Asserting(Lucene62): {_version_=BlockTreeOrds(blocksize=128), id=PostingsFormat(name=Memory doPackFST= false), myNewField=BlockTreeOrds(blocksize=128)}, docValues:{}, maxPointsInLeafNode=1085, maxMBSortInHeap=5.581884170468253, sim=ClassicSimilarity, locale=ar-QA, timezone=America/Porto_Velho
    [junit4] 2> NOTE: Linux 4.4.0-24-generic amd64/Oracle Corporation 1.8.0_92 (64-bit)/cpus=12,threads=1,free=142582208,total=530055168
    [junit4] 2> NOTE: All tests run in this JVM: [TestRecoveryHdfs, RestartWhileUpdatingTest, TestNumericTerms64, TestCoreContainer, TestSystemIdResolver, TestAddFieldRealTimeGet, TestLeaderInitiatedRecoveryThread, MoreLikeThisHandlerTest, SpatialFilterTest, TestFileDictionaryLookup, TestLMJelinekMercerSimilarityFactory, HttpPartitionTest, SolrIndexSplitterTest, TestTrieFacet, HighlighterMaxOffsetTest, HdfsBasicDistributedZkTest, TestDefaultStatsCache, HdfsWriteToMultipleCollectionsTest, SpellingQueryConverterTest, AnalysisErrorHandlingTest, TestTolerantUpdateProcessorCloud, TriLevelCompositeIdRoutingTest, TestScoreJoinQPScore, DistributedFacetPivotSmallAdvancedTest, SoftAutoCommitTest, HdfsCollectionsAPIDistributedZkTest, ExitableDirectoryReaderTest, TestSSLRandomization, ZkStateReaderTest, SolrXmlInZkTest, SolrInfoMBeanTest, AsyncMigrateRouteKeyTest, TestSubQueryTransformerCrossCore, TestMinMaxOnMultiValuedField, TestManagedResourceStorage, TestCollationFieldDocValues, SchemaVersionSpecificBehaviorTest, DistributedIntervalFacetingTest, RuleEngineTest, CollectionsAPIAsyncDistributedZkTest, FullHLLTest, TestDFRSimilarityFactory, TestCursorMarkWithoutUniqueKey, TestSchemaNameResource, TestWordDelimiterFilterFactory, TestCloudManagedSchema, TermVectorComponentTest, TestPartialUpdateDeduplication, TestSolrQueryParserResource, MinimalSchemaTest, TestSimpleTrackingShardHandler, TestTrie, SimpleMLTQParserTest, TestReplicaProperties, ZkCLITest, DOMUtilTest, OpenExchangeRatesOrgProviderTest, TestFastLRUCache, DistribCursorPagingTest, ChangedSchemaMergeTest, TestDistributedGrouping, ShardRoutingCustomTest, TestEmbeddedSolrServerConstructors, TestDocBasedVersionConstraints, ConjunctionSolrSpellCheckerTest, TestDownShardTolerantSearch, UniqFieldsUpdateProcessorFactoryTest, TestRandomCollapseQParserPlugin, IgnoreCommitOptimizeUpdateProcessorFactoryTest, TestFieldResource, ClusterStateUpdateTest, TestFieldCache, TestSolrConfigHandlerCloud, SharedFSAutoReplicaFailoverUtilsTest, DistributedExpandComponentTest, DocumentBuilderTest, TestSolrCLIRunExample, TestSimpleQParserPlugin, BasicFunctionalityTest, TestInfoStreamLogging, TestFilteredDocIdSet, AliasIntegrationTest, AnalyticsMergeStrategyTest, TestSolrDeletionPolicy2, SimplePostToolTest, DistanceUnitsTest, TestNoOpRegenerator, TestCollectionAPI, ShardRoutingTest, MergeStrategyTest, DocValuesTest, CheckHdfsIndexTest, TestBM25SimilarityFactory, SortByFunctionTest, TestLFUCache, SpellPossibilityIteratorTest, EnumFieldTest, TestDynamicFieldCollectionResource, TestSolrCloudWithKerberosAlt, BasicDistributedZkTest, ChaosMonkeySafeLeaderTest, BasicDistributedZk2Test, UnloadDistributedZkTest, CollectionsAPIDistributedZkTest, OpenCloseCoreStressTest, FullSolrCloudDistribCmdsTest, LeaderElectionTest, AutoCommitTest, ZkControllerTest, TestStressVersions, TestRangeQuery, SolrCoreTest, StatsComponentTest, TestGroupingSearch, QueryElevationComponentTest, TestSort, DirectUpdateHandlerTest, DistributedQueryElevationComponentTest, TestExtendedDismaxParser, SuggesterFSTTest, CoreAdminHandlerTest, TestFoldingMultitermQuery, SuggesterTest, WordBreakSolrSpellCheckerTest, TestAtomicUpdateErrorCases, DistanceFunctionTest, TestSurroundQueryParser, DirectSolrSpellCheckerTest, FileBasedSpellCheckerTest, RequiredFieldsTest, FastVectorHighlighterTest, SolrPluginUtilsTest, TestCSVResponseWriter, PingRequestHandlerTest, TestCharFilters, TestXIncludeConfig, TestJmxMonitoredMap, DateMathParserTest, DateFieldTest, ClusterStateTest, TestLRUCache, TestDocumentBuilder, FileUtilsTest, TestRTGBase, CursorPagingTest, TestHighlightDedupGrouping, TestTolerantSearch, AsyncCallRequestStatusResponseTest, CollectionsAPISolrJTest, DeleteStatusTest, DistribDocExpirationUpdateProcessorTest, DistributedVersionInfoTest, LeaderInitiatedRecoveryOnCommitTest, OutOfBoxZkACLAndCredentialsProvidersTest, OverseerCollectionConfigSetProcessorTest, OverseerRolesTest, SimpleCollectionCreateDeleteTest, TestCloudPivotFacet, TestExclusionRuleCollectionAccess, TestOnReconnectListenerSupport, TestRequestStatusCollectionAPI, TestShortCircuitedRequests, VMParamsZkACLAndCredentialsProvidersTest, HdfsRecoverLeaseTest, HdfsRecoveryZkTest, HdfsRestartWhileUpdatingTest, HdfsSyncSliceTest, HdfsThreadLeakTest, ZkStateWriterTest, RulesTest, TestPivotHelperCode, TestTrackingShardHandlerFactory, TestBulkSchemaAPI, TestDynamicFieldResource, TestSchemaResource, TestSchemaSimilarityResource, TestSchemaVersionResource, TestUniqueKeyFieldResource, TestManagedStopFilterFactory, TestManagedSynonymFilterFactory, DocValuesMissingTest, SpatialRPTFieldTypeTest, TestManagedSchema, TestManagedSchemaAPI]
    [junit4] Completed [568/614 (2!)] on J1 in 13.50s, 1 test, 1 error <<< FAILURES!

[...truncated 155 lines...]
BUILD FAILED
/home/jenkins/workspace/Lucene-Solr-master-Linux/build.xml:740: The following error occurred while executing this line:
/home/jenkins/workspace/Lucene-Solr-master-Linux/build.xml:684: The following error occurred while executing this line:
/home/jenkins/workspace/Lucene-Solr-master-Linux/build.xml:59: The following error occurred while executing this line:
/home/jenkins/workspace/Lucene-Solr-master-Linux/solr/build.xml:233: The following error occurred while executing this line:
/home/jenkins/workspace/Lucene-Solr-master-Linux/solr/common-build.xml:531: The following error occurred while executing this line:
/home/jenkins/workspace/Lucene-Solr-master-Linux/lucene/common-build.xml:1427: The following error occurred while executing this line:
/home/jenkins/workspace/Lucene-Solr-master-Linux/lucene/common-build.xml:984: There were test failures: 614 suites (10 ignored), 2584 tests, 2 errors, 116 ignored (72 assumptions) [seed: 82ED2FD3D6DF749A]

Total time: 62 minutes 4 seconds
Build step 'Invoke Ant' marked build as failure
Archiving artifacts
[WARNINGS] Skipping publisher since build result is FAILURE
Recording test results
Email was triggered for: Failure - Any
Sending email for trigger: Failure - Any

Search Discussions

Related Discussions

Discussion Navigation
viewthread | post
posts ‹ prev | 1 of 1 | next ›
Discussion Overview
groupdev @
categorieslucene
postedJun 18, '16 at 12:01a
activeJun 18, '16 at 12:01a
posts1
users1
websitelucene.apache.org

1 user in discussion

Policeman Jenkins Server: 1 post

People

Translate

site design / logo © 2017 Grokbase