Grokbase Groups Lucene dev June 2016
FAQ
Build: http://jenkins.thetaphi.de/job/Lucene-Solr-6.x-Solaris/203/
Java: 64bit/jdk1.8.0 -XX:-UseCompressedOops -XX:+UseConcMarkSweepGC

1 tests failed.
FAILED: org.apache.solr.update.SoftAutoCommitTest.testSoftAndHardCommitMaxTimeRapidAdds

Error Message:
2: soft wasn't fast enough

Stack Trace:
java.lang.AssertionError: 2: soft wasn't fast enough
  at __randomizedtesting.SeedInfo.seed([DE48CF2A7A909FEE:825D61139112DE96]:0)
  at org.junit.Assert.fail(Assert.java:93)
  at org.junit.Assert.assertTrue(Assert.java:43)
  at org.junit.Assert.assertNotNull(Assert.java:526)
  at org.apache.solr.update.SoftAutoCommitTest.testSoftAndHardCommitMaxTimeRapidAdds(SoftAutoCommitTest.java:322)
  at sun.reflect.NativeMethodAccessorImpl.invoke0(Native Method)
  at sun.reflect.NativeMethodAccessorImpl.invoke(NativeMethodAccessorImpl.java:62)
  at sun.reflect.DelegatingMethodAccessorImpl.invoke(DelegatingMethodAccessorImpl.java:43)
  at java.lang.reflect.Method.invoke(Method.java:498)
  at com.carrotsearch.randomizedtesting.RandomizedRunner.invoke(RandomizedRunner.java:1764)
  at com.carrotsearch.randomizedtesting.RandomizedRunner$8.evaluate(RandomizedRunner.java:871)
  at com.carrotsearch.randomizedtesting.RandomizedRunner$9.evaluate(RandomizedRunner.java:907)
  at com.carrotsearch.randomizedtesting.RandomizedRunner$10.evaluate(RandomizedRunner.java:921)
  at com.carrotsearch.randomizedtesting.rules.SystemPropertiesRestoreRule$1.evaluate(SystemPropertiesRestoreRule.java:57)
  at org.apache.lucene.util.TestRuleSetupTeardownChained$1.evaluate(TestRuleSetupTeardownChained.java:49)
  at org.apache.lucene.util.AbstractBeforeAfterRule$1.evaluate(AbstractBeforeAfterRule.java:45)
  at org.apache.lucene.util.TestRuleThreadAndTestName$1.evaluate(TestRuleThreadAndTestName.java:48)
  at org.apache.lucene.util.TestRuleIgnoreAfterMaxFailures$1.evaluate(TestRuleIgnoreAfterMaxFailures.java:64)
  at org.apache.lucene.util.TestRuleMarkFailure$1.evaluate(TestRuleMarkFailure.java:47)
  at com.carrotsearch.randomizedtesting.rules.StatementAdapter.evaluate(StatementAdapter.java:36)
  at com.carrotsearch.randomizedtesting.ThreadLeakControl$StatementRunner.run(ThreadLeakControl.java:367)
  at com.carrotsearch.randomizedtesting.ThreadLeakControl.forkTimeoutingTask(ThreadLeakControl.java:809)
  at com.carrotsearch.randomizedtesting.ThreadLeakControl$3.evaluate(ThreadLeakControl.java:460)
  at com.carrotsearch.randomizedtesting.RandomizedRunner.runSingleTest(RandomizedRunner.java:880)
  at com.carrotsearch.randomizedtesting.RandomizedRunner$5.evaluate(RandomizedRunner.java:781)
  at com.carrotsearch.randomizedtesting.RandomizedRunner$6.evaluate(RandomizedRunner.java:816)
  at com.carrotsearch.randomizedtesting.RandomizedRunner$7.evaluate(RandomizedRunner.java:827)
  at com.carrotsearch.randomizedtesting.rules.StatementAdapter.evaluate(StatementAdapter.java:36)
  at com.carrotsearch.randomizedtesting.rules.SystemPropertiesRestoreRule$1.evaluate(SystemPropertiesRestoreRule.java:57)
  at org.apache.lucene.util.AbstractBeforeAfterRule$1.evaluate(AbstractBeforeAfterRule.java:45)
  at com.carrotsearch.randomizedtesting.rules.StatementAdapter.evaluate(StatementAdapter.java:36)
  at org.apache.lucene.util.TestRuleStoreClassName$1.evaluate(TestRuleStoreClassName.java:41)
  at com.carrotsearch.randomizedtesting.rules.NoShadowingOrOverridesOnMethodsRule$1.evaluate(NoShadowingOrOverridesOnMethodsRule.java:40)
  at com.carrotsearch.randomizedtesting.rules.NoShadowingOrOverridesOnMethodsRule$1.evaluate(NoShadowingOrOverridesOnMethodsRule.java:40)
  at com.carrotsearch.randomizedtesting.rules.StatementAdapter.evaluate(StatementAdapter.java:36)
  at com.carrotsearch.randomizedtesting.rules.StatementAdapter.evaluate(StatementAdapter.java:36)
  at com.carrotsearch.randomizedtesting.rules.StatementAdapter.evaluate(StatementAdapter.java:36)
  at org.apache.lucene.util.TestRuleAssertionsRequired$1.evaluate(TestRuleAssertionsRequired.java:53)
  at org.apache.lucene.util.TestRuleMarkFailure$1.evaluate(TestRuleMarkFailure.java:47)
  at org.apache.lucene.util.TestRuleIgnoreAfterMaxFailures$1.evaluate(TestRuleIgnoreAfterMaxFailures.java:64)
  at org.apache.lucene.util.TestRuleIgnoreTestSuites$1.evaluate(TestRuleIgnoreTestSuites.java:54)
  at com.carrotsearch.randomizedtesting.rules.StatementAdapter.evaluate(StatementAdapter.java:36)
  at com.carrotsearch.randomizedtesting.ThreadLeakControl$StatementRunner.run(ThreadLeakControl.java:367)
  at java.lang.Thread.run(Thread.java:745)




Build Log:
[...truncated 10490 lines...]
    [junit4] Suite: org.apache.solr.update.SoftAutoCommitTest
    [junit4] 2> Creating dataDir: /export/home/jenkins/workspace/Lucene-Solr-6.x-Solaris/solr/build/solr-core/test/J0/temp/solr.update.SoftAutoCommitTest_DE48CF2A7A909FEE-001/init-core-data-001
    [junit4] 2> 5035 INFO (SUITE-SoftAutoCommitTest-seed#[DE48CF2A7A909FEE]-worker) [ ] o.a.s.SolrTestCaseJ4 Randomized ssl (false) and clientAuth (false) via: @org.apache.solr.util.RandomizeSSL(reason=, value=NaN, ssl=NaN, clientAuth=NaN)
    [junit4] 2> 5036 INFO (SUITE-SoftAutoCommitTest-seed#[DE48CF2A7A909FEE]-worker) [ ] o.a.s.SolrTestCaseJ4 ####initCore
    [junit4] 2> 5036 INFO (SUITE-SoftAutoCommitTest-seed#[DE48CF2A7A909FEE]-worker) [ ] o.a.s.c.SolrResourceLoader new SolrResourceLoader for directory: '/export/home/jenkins/workspace/Lucene-Solr-6.x-Solaris/solr/core/src/test-files/solr/collection1'
    [junit4] 2> 5036 INFO (SUITE-SoftAutoCommitTest-seed#[DE48CF2A7A909FEE]-worker) [ ] o.a.s.c.SolrResourceLoader JNDI not configured for solr (NoInitialContextEx)
    [junit4] 2> 5037 INFO (SUITE-SoftAutoCommitTest-seed#[DE48CF2A7A909FEE]-worker) [ ] o.a.s.c.SolrResourceLoader using system property solr.solr.home: /export/home/jenkins/workspace/Lucene-Solr-6.x-Solaris/solr/core/src/test-files/solr
    [junit4] 2> 5039 INFO (SUITE-SoftAutoCommitTest-seed#[DE48CF2A7A909FEE]-worker) [ ] o.a.s.c.SolrResourceLoader Adding 'file:/export/home/jenkins/workspace/Lucene-Solr-6.x-Solaris/solr/core/src/test-files/solr/collection1/lib/classes/' to classloader
    [junit4] 2> 5039 INFO (SUITE-SoftAutoCommitTest-seed#[DE48CF2A7A909FEE]-worker) [ ] o.a.s.c.SolrResourceLoader Adding 'file:/export/home/jenkins/workspace/Lucene-Solr-6.x-Solaris/solr/core/src/test-files/solr/collection1/lib/README' to classloader
    [junit4] 2> 5253 INFO (SUITE-SoftAutoCommitTest-seed#[DE48CF2A7A909FEE]-worker) [ ] o.a.s.c.SolrConfig current version of requestparams : -1
    [junit4] 2> 5341 INFO (SUITE-SoftAutoCommitTest-seed#[DE48CF2A7A909FEE]-worker) [ ] o.a.s.c.SolrConfig Using Lucene MatchVersion: 6.2.0
    [junit4] 2> 5476 INFO (SUITE-SoftAutoCommitTest-seed#[DE48CF2A7A909FEE]-worker) [ ] o.a.s.c.SolrConfig Loaded SolrConfig: solrconfig.xml
    [junit4] 2> 5557 INFO (SUITE-SoftAutoCommitTest-seed#[DE48CF2A7A909FEE]-worker) [ ] o.a.s.s.IndexSchema [null] Schema name=test
    [junit4] 2> 6434 INFO (SUITE-SoftAutoCommitTest-seed#[DE48CF2A7A909FEE]-worker) [ ] o.a.s.s.OpenExchangeRatesOrgProvider Initialized with rates=open-exchange-rates.json, refreshInterval=1440.
    [junit4] 2> 6483 INFO (SUITE-SoftAutoCommitTest-seed#[DE48CF2A7A909FEE]-worker) [ ] o.a.s.s.IndexSchema default search field in schema is text
    [junit4] 2> 6487 INFO (SUITE-SoftAutoCommitTest-seed#[DE48CF2A7A909FEE]-worker) [ ] o.a.s.s.IndexSchema unique key field: id
    [junit4] 2> 6910 INFO (SUITE-SoftAutoCommitTest-seed#[DE48CF2A7A909FEE]-worker) [ ] o.a.s.s.FileExchangeRateProvider Reloading exchange rates from file currency.xml
    [junit4] 2> 6921 INFO (SUITE-SoftAutoCommitTest-seed#[DE48CF2A7A909FEE]-worker) [ ] o.a.s.s.FileExchangeRateProvider Reloading exchange rates from file currency.xml
    [junit4] 2> 6927 INFO (SUITE-SoftAutoCommitTest-seed#[DE48CF2A7A909FEE]-worker) [ ] o.a.s.s.OpenExchangeRatesOrgProvider Reloading exchange rates from open-exchange-rates.json
    [junit4] 2> 6931 INFO (SUITE-SoftAutoCommitTest-seed#[DE48CF2A7A909FEE]-worker) [ ] o.a.s.s.OpenExchangeRatesOrgProvider Reloading exchange rates from open-exchange-rates.json
    [junit4] 2> 6936 INFO (SUITE-SoftAutoCommitTest-seed#[DE48CF2A7A909FEE]-worker) [ ] o.a.s.c.SolrResourceLoader JNDI not configured for solr (NoInitialContextEx)
    [junit4] 2> 6937 INFO (SUITE-SoftAutoCommitTest-seed#[DE48CF2A7A909FEE]-worker) [ ] o.a.s.c.SolrResourceLoader using system property solr.solr.home: /export/home/jenkins/workspace/Lucene-Solr-6.x-Solaris/solr/core/src/test-files/solr
    [junit4] 2> 6937 INFO (SUITE-SoftAutoCommitTest-seed#[DE48CF2A7A909FEE]-worker) [ ] o.a.s.c.SolrResourceLoader new SolrResourceLoader for directory: '/export/home/jenkins/workspace/Lucene-Solr-6.x-Solaris/solr/core/src/test-files/solr'
    [junit4] 2> 6937 INFO (SUITE-SoftAutoCommitTest-seed#[DE48CF2A7A909FEE]-worker) [ ] o.a.s.c.SolrResourceLoader JNDI not configured for solr (NoInitialContextEx)
    [junit4] 2> 6937 INFO (SUITE-SoftAutoCommitTest-seed#[DE48CF2A7A909FEE]-worker) [ ] o.a.s.c.SolrResourceLoader using system property solr.solr.home: /export/home/jenkins/workspace/Lucene-Solr-6.x-Solaris/solr/core/src/test-files/solr
    [junit4] 2> 6937 INFO (SUITE-SoftAutoCommitTest-seed#[DE48CF2A7A909FEE]-worker) [ ] o.a.s.c.CoreContainer New CoreContainer 536417340
    [junit4] 2> 6937 INFO (SUITE-SoftAutoCommitTest-seed#[DE48CF2A7A909FEE]-worker) [ ] o.a.s.c.CoreContainer Loading cores into CoreContainer [instanceDir=/export/home/jenkins/workspace/Lucene-Solr-6.x-Solaris/solr/core/src/test-files/solr]
    [junit4] 2> 6938 WARN (SUITE-SoftAutoCommitTest-seed#[DE48CF2A7A909FEE]-worker) [ ] o.a.s.c.CoreContainer Couldn't add files from /export/home/jenkins/workspace/Lucene-Solr-6.x-Solaris/solr/core/src/test-files/solr/lib to classpath: /export/home/jenkins/workspace/Lucene-Solr-6.x-Solaris/solr/core/src/test-files/solr/lib
    [junit4] 2> 6938 INFO (SUITE-SoftAutoCommitTest-seed#[DE48CF2A7A909FEE]-worker) [ ] o.a.s.h.c.HttpShardHandlerFactory created with socketTimeout : 600000,connTimeout : 60000,maxConnectionsPerHost : 20,maxConnections : 10000,corePoolSize : 0,maximumPoolSize : 2147483647,maxThreadIdleTime : 5,sizeOfQueue : -1,fairnessPolicy : false,useRetries : false,
    [junit4] 2> 6957 INFO (SUITE-SoftAutoCommitTest-seed#[DE48CF2A7A909FEE]-worker) [ ] o.a.s.u.UpdateShardHandler Creating UpdateShardHandler HTTP client with params: socketTimeout=30000&connTimeout=30000&retry=true
    [junit4] 2> 6958 INFO (SUITE-SoftAutoCommitTest-seed#[DE48CF2A7A909FEE]-worker) [ ] o.a.s.l.LogWatcher SLF4J impl is org.slf4j.impl.Log4jLoggerFactory
    [junit4] 2> 6959 INFO (SUITE-SoftAutoCommitTest-seed#[DE48CF2A7A909FEE]-worker) [ ] o.a.s.l.LogWatcher Registering Log Listener [Log4j (org.slf4j.impl.Log4jLoggerFactory)]
    [junit4] 2> 6959 INFO (SUITE-SoftAutoCommitTest-seed#[DE48CF2A7A909FEE]-worker) [ ] o.a.s.c.CoreContainer Security conf doesn't exist. Skipping setup for authorization module.
    [junit4] 2> 6959 INFO (SUITE-SoftAutoCommitTest-seed#[DE48CF2A7A909FEE]-worker) [ ] o.a.s.c.CoreContainer No authentication plugin used.
    [junit4] 2> 6961 INFO (SUITE-SoftAutoCommitTest-seed#[DE48CF2A7A909FEE]-worker) [ ] o.a.s.c.CoreDescriptor Created CoreDescriptor: {name=collection1, config=solrconfig.xml, transient=false, schema=schema.xml, loadOnStartup=true, configSetProperties=configsetprops.json, collection=collection1, dataDir=/export/home/jenkins/workspace/Lucene-Solr-6.x-Solaris/solr/build/solr-core/test/J0/temp/solr.update.SoftAutoCommitTest_DE48CF2A7A909FEE-001/init-core-data-001, shard=shard1}
    [junit4] 2> 6980 INFO (coreLoadExecutor-18-thread-1) [ ] o.a.s.c.SolrResourceLoader new SolrResourceLoader for directory: '/export/home/jenkins/workspace/Lucene-Solr-6.x-Solaris/solr/core/src/test-files/solr/collection1'
    [junit4] 2> 6983 INFO (coreLoadExecutor-18-thread-1) [ ] o.a.s.c.SolrResourceLoader JNDI not configured for solr (NoInitialContextEx)
    [junit4] 2> 6983 INFO (coreLoadExecutor-18-thread-1) [ ] o.a.s.c.SolrResourceLoader using system property solr.solr.home: /export/home/jenkins/workspace/Lucene-Solr-6.x-Solaris/solr/core/src/test-files/solr
    [junit4] 2> 6984 INFO (coreLoadExecutor-18-thread-1) [ ] o.a.s.c.SolrResourceLoader Adding 'file:/export/home/jenkins/workspace/Lucene-Solr-6.x-Solaris/solr/core/src/test-files/solr/collection1/lib/classes/' to classloader
    [junit4] 2> 6985 INFO (coreLoadExecutor-18-thread-1) [ ] o.a.s.c.SolrResourceLoader Adding 'file:/export/home/jenkins/workspace/Lucene-Solr-6.x-Solaris/solr/core/src/test-files/solr/collection1/lib/README' to classloader
    [junit4] 2> 7105 INFO (coreLoadExecutor-18-thread-1) [ ] o.a.s.c.SolrConfig current version of requestparams : -1
    [junit4] 2> 7152 INFO (coreLoadExecutor-18-thread-1) [ ] o.a.s.c.SolrConfig Using Lucene MatchVersion: 6.2.0
    [junit4] 2> 7374 INFO (coreLoadExecutor-18-thread-1) [ ] o.a.s.c.SolrConfig Loaded SolrConfig: solrconfig.xml
    [junit4] 2> 7390 INFO (coreLoadExecutor-18-thread-1) [ ] o.a.s.s.IndexSchema [collection1] Schema name=test
    [junit4] 2> 8101 INFO (coreLoadExecutor-18-thread-1) [ ] o.a.s.s.OpenExchangeRatesOrgProvider Initialized with rates=open-exchange-rates.json, refreshInterval=1440.
    [junit4] 2> 8117 INFO (coreLoadExecutor-18-thread-1) [ ] o.a.s.s.IndexSchema default search field in schema is text
    [junit4] 2> 8119 INFO (coreLoadExecutor-18-thread-1) [ ] o.a.s.s.IndexSchema unique key field: id
    [junit4] 2> 8140 INFO (coreLoadExecutor-18-thread-1) [ ] o.a.s.s.FileExchangeRateProvider Reloading exchange rates from file currency.xml
    [junit4] 2> 8148 INFO (coreLoadExecutor-18-thread-1) [ ] o.a.s.s.FileExchangeRateProvider Reloading exchange rates from file currency.xml
    [junit4] 2> 8151 INFO (coreLoadExecutor-18-thread-1) [ ] o.a.s.s.OpenExchangeRatesOrgProvider Reloading exchange rates from open-exchange-rates.json
    [junit4] 2> 8152 INFO (coreLoadExecutor-18-thread-1) [ ] o.a.s.s.OpenExchangeRatesOrgProvider Reloading exchange rates from open-exchange-rates.json
    [junit4] 2> 8155 INFO (coreLoadExecutor-18-thread-1) [ ] o.a.s.c.ConfigSetProperties Did not find ConfigSet properties, assuming default properties: Can't find resource 'configsetprops.json' in classpath or '/export/home/jenkins/workspace/Lucene-Solr-6.x-Solaris/solr/core/src/test-files/solr/collection1'
    [junit4] 2> 8155 INFO (coreLoadExecutor-18-thread-1) [ ] o.a.s.c.CoreContainer Creating SolrCore 'collection1' using configuration from instancedir /export/home/jenkins/workspace/Lucene-Solr-6.x-Solaris/solr/core/src/test-files/solr/collection1
    [junit4] 2> 8156 INFO (coreLoadExecutor-18-thread-1) [ x:collection1] o.a.s.c.SolrCore org.apache.solr.core.MockDirectoryFactory
    [junit4] 2> 8157 INFO (coreLoadExecutor-18-thread-1) [ x:collection1] o.a.s.c.SolrCore [[collection1] ] Opening new SolrCore at [/export/home/jenkins/workspace/Lucene-Solr-6.x-Solaris/solr/core/src/test-files/solr/collection1], dataDir=[/export/home/jenkins/workspace/Lucene-Solr-6.x-Solaris/solr/build/solr-core/test/J0/temp/solr.update.SoftAutoCommitTest_DE48CF2A7A909FEE-001/init-core-data-001/]
    [junit4] 2> 8165 INFO (coreLoadExecutor-18-thread-1) [ x:collection1] o.a.s.c.JmxMonitoredMap No JMX servers found, not exposing Solr information with JMX.
    [junit4] 2> 8166 INFO (coreLoadExecutor-18-thread-1) [ x:collection1] o.a.s.c.CachingDirectoryFactory return new directory for /export/home/jenkins/workspace/Lucene-Solr-6.x-Solaris/solr/build/solr-core/test/J0/temp/solr.update.SoftAutoCommitTest_DE48CF2A7A909FEE-001/init-core-data-001
    [junit4] 2> 8167 INFO (coreLoadExecutor-18-thread-1) [ x:collection1] o.a.s.c.SolrCore New index directory detected: old=null new=/export/home/jenkins/workspace/Lucene-Solr-6.x-Solaris/solr/build/solr-core/test/J0/temp/solr.update.SoftAutoCommitTest_DE48CF2A7A909FEE-001/init-core-data-001/index/
    [junit4] 2> 8168 WARN (coreLoadExecutor-18-thread-1) [ x:collection1] o.a.s.c.SolrCore [collection1] Solr index directory '/export/home/jenkins/workspace/Lucene-Solr-6.x-Solaris/solr/build/solr-core/test/J0/temp/solr.update.SoftAutoCommitTest_DE48CF2A7A909FEE-001/init-core-data-001/index' doesn't exist. Creating new index...
    [junit4] 2> 8168 INFO (coreLoadExecutor-18-thread-1) [ x:collection1] o.a.s.c.CachingDirectoryFactory return new directory for /export/home/jenkins/workspace/Lucene-Solr-6.x-Solaris/solr/build/solr-core/test/J0/temp/solr.update.SoftAutoCommitTest_DE48CF2A7A909FEE-001/init-core-data-001/index
    [junit4] 2> 8168 INFO (coreLoadExecutor-18-thread-1) [ x:collection1] o.a.s.u.RandomMergePolicy RandomMergePolicy wrapping class org.apache.lucene.index.TieredMergePolicy: [TieredMergePolicy: maxMergeAtOnce=22, maxMergeAtOnceExplicit=39, maxMergedSegmentMB=0.3671875, floorSegmentMB=1.4140625, forceMergeDeletesPctAllowed=3.155158481216762, segmentsPerTier=12.0, maxCFSSegmentSizeMB=8.796093022207999E12, noCFSRatio=0.0
    [junit4] 2> 8173 INFO (coreLoadExecutor-18-thread-1) [ x:collection1] o.a.s.c.SolrDeletionPolicy SolrDeletionPolicy.onCommit: commits: num=1
    [junit4] 2> commit{dir=MockDirectoryWrapper(RAMDirectory@7fedd27d lockFactory=org.apache.lucene.store.SingleInstanceLockFactory@76b750e9),segFN=segments_1,generation=1}
    [junit4] 2> 8173 INFO (coreLoadExecutor-18-thread-1) [ x:collection1] o.a.s.c.SolrDeletionPolicy newest commit generation = 1
    [junit4] 2> 8209 INFO (OldIndexDirectoryCleanupThreadForCore-collection1) [ x:collection1] o.a.s.c.SolrCore Looking for old index directories to cleanup for core collection1 in /export/home/jenkins/workspace/Lucene-Solr-6.x-Solaris/solr/build/solr-core/test/J0/temp/solr.update.SoftAutoCommitTest_DE48CF2A7A909FEE-001/init-core-data-001/
    [junit4] 2> 8279 INFO (coreLoadExecutor-18-thread-1) [ x:collection1] o.a.s.u.p.UpdateRequestProcessorChain creating updateRequestProcessorChain "dedupe"
    [junit4] 2> 8293 INFO (coreLoadExecutor-18-thread-1) [ x:collection1] o.a.s.u.p.UpdateRequestProcessorChain inserting DistributedUpdateProcessorFactory into updateRequestProcessorChain "dedupe"
    [junit4] 2> 8296 INFO (coreLoadExecutor-18-thread-1) [ x:collection1] o.a.s.u.p.UpdateRequestProcessorChain creating updateRequestProcessorChain "dedupe-allfields"
    [junit4] 2> 8296 INFO (coreLoadExecutor-18-thread-1) [ x:collection1] o.a.s.u.p.UpdateRequestProcessorChain inserting DistributedUpdateProcessorFactory into updateRequestProcessorChain "dedupe-allfields"
    [junit4] 2> 8296 INFO (coreLoadExecutor-18-thread-1) [ x:collection1] o.a.s.u.p.UpdateRequestProcessorChain creating updateRequestProcessorChain "stored_sig"
    [junit4] 2> 8296 INFO (coreLoadExecutor-18-thread-1) [ x:collection1] o.a.s.u.p.UpdateRequestProcessorChain inserting DistributedUpdateProcessorFactory into updateRequestProcessorChain "stored_sig"
    [junit4] 2> 8296 INFO (coreLoadExecutor-18-thread-1) [ x:collection1] o.a.s.u.p.UpdateRequestProcessorChain creating updateRequestProcessorChain "uniq-fields"
    [junit4] 2> 8306 INFO (coreLoadExecutor-18-thread-1) [ x:collection1] o.a.s.u.p.UpdateRequestProcessorChain inserting DistributedUpdateProcessorFactory into updateRequestProcessorChain "uniq-fields"
    [junit4] 2> 8307 INFO (coreLoadExecutor-18-thread-1) [ x:collection1] o.a.s.u.p.UpdateRequestProcessorChain creating updateRequestProcessorChain "distrib-dup-test-chain-explicit"
    [junit4] 2> 8340 INFO (coreLoadExecutor-18-thread-1) [ x:collection1] o.a.s.u.p.UpdateRequestProcessorChain creating updateRequestProcessorChain "distrib-dup-test-chain-implicit"
    [junit4] 2> 8340 INFO (coreLoadExecutor-18-thread-1) [ x:collection1] o.a.s.u.p.UpdateRequestProcessorChain inserting DistributedUpdateProcessorFactory into updateRequestProcessorChain "distrib-dup-test-chain-implicit"
    [junit4] 2> 8340 INFO (coreLoadExecutor-18-thread-1) [ x:collection1] o.a.s.c.SolrCore no updateRequestProcessorChain defined as default, creating implicit default
    [junit4] 2> 8344 INFO (coreLoadExecutor-18-thread-1) [ x:collection1] o.a.s.h.l.XMLLoader xsltCacheLifetimeSeconds=60
    [junit4] 2> 8347 INFO (coreLoadExecutor-18-thread-1) [ x:collection1] o.a.s.h.l.XMLLoader xsltCacheLifetimeSeconds=60
    [junit4] 2> 8348 INFO (coreLoadExecutor-18-thread-1) [ x:collection1] o.a.s.h.l.XMLLoader xsltCacheLifetimeSeconds=60
    [junit4] 2> 8350 INFO (coreLoadExecutor-18-thread-1) [ x:collection1] o.a.s.h.l.XMLLoader xsltCacheLifetimeSeconds=60
    [junit4] 2> 8354 INFO (coreLoadExecutor-18-thread-1) [ x:collection1] o.a.s.c.PluginBag requestHandler : 'lazy' created with startup=lazy
    [junit4] 2> 8370 INFO (coreLoadExecutor-18-thread-1) [ x:collection1] o.a.s.c.RequestHandlers Registered paths: /admin/mbeans,standard,spellCheckCompRH,lazy,/update/json/docs,/admin/luke,/export,spellCheckWithWordbreak_Direct,tvrh,/get,/admin/properties,/update/json,mltrh,/admin/threads,/search-facet-def,/update/csv,/sql,/graph,/search-facet-invariants,/admin/segments,spellCheckCompRH1,/mlt,/admin/system,/replication,dismax,defaults,/config,/stream,/schema,/admin/plugins,/admin/logging,spellCheckWithWordbreak,mock,/admin/ping,/update,/admin/file,/terms,spellCheckCompRH_Direct,/debug/dump
    [junit4] 2> 8371 INFO (coreLoadExecutor-18-thread-1) [ x:collection1] o.a.s.c.SolrCore Using default statsCache cache: org.apache.solr.search.stats.LocalStatsCache
    [junit4] 2> 8391 INFO (coreLoadExecutor-18-thread-1) [ x:collection1] o.a.s.u.UpdateHandler Using UpdateLog implementation: org.apache.solr.update.UpdateLog
    [junit4] 2> 8391 INFO (coreLoadExecutor-18-thread-1) [ x:collection1] o.a.s.u.UpdateLog Initializing UpdateLog: dataDir= defaultSyncLevel=FLUSH numRecordsToKeep=100 maxNumLogsToKeep=10 numVersionBuckets=65536
    [junit4] 2> 8404 INFO (coreLoadExecutor-18-thread-1) [ x:collection1] o.a.s.u.CommitTracker Hard AutoCommit: disabled
    [junit4] 2> 8405 INFO (coreLoadExecutor-18-thread-1) [ x:collection1] o.a.s.u.CommitTracker Soft AutoCommit: disabled
    [junit4] 2> 8407 INFO (coreLoadExecutor-18-thread-1) [ x:collection1] o.a.s.u.RandomMergePolicy RandomMergePolicy wrapping class org.apache.lucene.index.TieredMergePolicy: [TieredMergePolicy: maxMergeAtOnce=40, maxMergeAtOnceExplicit=50, maxMergedSegmentMB=58.7353515625, floorSegmentMB=1.1474609375, forceMergeDeletesPctAllowed=4.951836131929058, segmentsPerTier=47.0, maxCFSSegmentSizeMB=8.796093022207999E12, noCFSRatio=0.5298512503982636
    [junit4] 2> 8408 INFO (coreLoadExecutor-18-thread-1) [ x:collection1] o.a.s.c.SolrDeletionPolicy SolrDeletionPolicy.onInit: commits: num=1
    [junit4] 2> commit{dir=MockDirectoryWrapper(RAMDirectory@7fedd27d lockFactory=org.apache.lucene.store.SingleInstanceLockFactory@76b750e9),segFN=segments_1,generation=1}
    [junit4] 2> 8408 INFO (coreLoadExecutor-18-thread-1) [ x:collection1] o.a.s.c.SolrDeletionPolicy newest commit generation = 1
    [junit4] 2> 8408 INFO (coreLoadExecutor-18-thread-1) [ x:collection1] o.a.s.s.SolrIndexSearcher Opening [Searcher@69479fd0[collection1] main]
    [junit4] 2> 8411 INFO (coreLoadExecutor-18-thread-1) [ x:collection1] o.a.s.r.RestManager Initializing RestManager with initArgs: {storageIO=org.apache.solr.rest.ManagedResourceStorage$InMemoryStorageIO}
    [junit4] 2> 8414 INFO (coreLoadExecutor-18-thread-1) [ x:collection1] o.a.s.r.ManagedResourceStorage Reading _rest_managed.json using InMemoryStorage
    [junit4] 2> 8417 INFO (coreLoadExecutor-18-thread-1) [ x:collection1] o.a.s.r.RestManager Initializing 0 registered ManagedResources
    [junit4] 2> 8417 INFO (coreLoadExecutor-18-thread-1) [ x:collection1] o.a.s.h.c.SpellCheckComponent Initializing spell checkers
    [junit4] 2> 8608 INFO (coreLoadExecutor-18-thread-1) [ x:collection1] o.a.s.s.DirectSolrSpellChecker init: {name=direct,classname=DirectSolrSpellChecker,field=lowerfilt,minQueryLength=3}
    [junit4] 2> 8793 INFO (coreLoadExecutor-18-thread-1) [ x:collection1] o.a.s.h.ReplicationHandler Commits will be reserved for 10000
    [junit4] 2> 8794 INFO (searcherExecutor-19-thread-1-processing-x:collection1) [ x:collection1] o.a.s.h.c.SpellCheckComponent Loading spell index for spellchecker: default
    [junit4] 2> 8795 INFO (coreLoadExecutor-18-thread-1) [ x:collection1] o.a.s.u.UpdateLog Looking up max value of version field to seed version buckets
    [junit4] 2> 8796 INFO (coreLoadExecutor-18-thread-1) [ x:collection1] o.a.s.u.VersionInfo Refreshing highest value of _version_ for 65536 version buckets from index
    [junit4] 2> 8796 INFO (coreLoadExecutor-18-thread-1) [ x:collection1] o.a.s.u.VersionInfo No terms found for _version_, cannot seed version bucket highest value from index
    [junit4] 2> 8796 INFO (coreLoadExecutor-18-thread-1) [ x:collection1] o.a.s.u.UpdateLog Could not find max version in index or recent updates, using new clock 1537377058990063616
    [junit4] 2> 8797 INFO (searcherExecutor-19-thread-1-processing-x:collection1) [ x:collection1] o.a.s.h.c.SpellCheckComponent Loading spell index for spellchecker: direct
    [junit4] 2> 8797 INFO (searcherExecutor-19-thread-1-processing-x:collection1) [ x:collection1] o.a.s.h.c.SpellCheckComponent Loading spell index for spellchecker: wordbreak
    [junit4] 2> 8797 INFO (searcherExecutor-19-thread-1-processing-x:collection1) [ x:collection1] o.a.s.h.c.SpellCheckComponent Loading spell index for spellchecker: multipleFields
    [junit4] 2> 8798 INFO (searcherExecutor-19-thread-1-processing-x:collection1) [ x:collection1] o.a.s.h.c.SpellCheckComponent Loading spell index for spellchecker: jarowinkler
    [junit4] 2> 8799 INFO (searcherExecutor-19-thread-1-processing-x:collection1) [ x:collection1] o.a.s.h.c.SpellCheckComponent Loading spell index for spellchecker: external
    [junit4] 2> 8800 INFO (searcherExecutor-19-thread-1-processing-x:collection1) [ x:collection1] o.a.s.h.c.SpellCheckComponent Loading spell index for spellchecker: freq
    [junit4] 2> 8802 INFO (searcherExecutor-19-thread-1-processing-x:collection1) [ x:collection1] o.a.s.h.c.SpellCheckComponent Loading spell index for spellchecker: fqcn
    [junit4] 2> 8804 INFO (searcherExecutor-19-thread-1-processing-x:collection1) [ x:collection1] o.a.s.h.c.SpellCheckComponent Loading spell index for spellchecker: perDict
    [junit4] 2> 8804 INFO (searcherExecutor-19-thread-1-processing-x:collection1) [ x:collection1] o.a.s.c.SolrCore [collection1] Registered new searcher Searcher@69479fd0[collection1] main{ExitableDirectoryReader(UninvertingDirectoryReader())}
    [junit4] 2> 8804 INFO (coreLoadExecutor-18-thread-1) [ x:collection1] o.a.s.u.UpdateLog Took 8.0ms to seed version buckets with highest version 1537377058990063616
    [junit4] 2> 8806 INFO (coreLoadExecutor-18-thread-1) [ x:collection1] o.a.s.c.CoreContainer registering core: collection1
    [junit4] 2> 8808 INFO (SUITE-SoftAutoCommitTest-seed#[DE48CF2A7A909FEE]-worker) [ ] o.a.s.SolrTestCaseJ4 ####initCore end
    [junit4] 2> 8819 INFO (TEST-SoftAutoCommitTest.testSoftAndHardCommitMaxTimeRapidAdds-seed#[DE48CF2A7A909FEE]) [ ] o.a.s.SolrTestCaseJ4 ###Starting testSoftAndHardCommitMaxTimeRapidAdds
    [junit4] 2> 8820 INFO (TEST-SoftAutoCommitTest.testSoftAndHardCommitMaxTimeRapidAdds-seed#[DE48CF2A7A909FEE]) [ ] o.a.s.c.SolrResourceLoader new SolrResourceLoader for directory: '/export/home/jenkins/workspace/Lucene-Solr-6.x-Solaris/solr/core/src/test-files/solr/collection1'
    [junit4] 2> 8820 INFO (TEST-SoftAutoCommitTest.testSoftAndHardCommitMaxTimeRapidAdds-seed#[DE48CF2A7A909FEE]) [ ] o.a.s.c.SolrResourceLoader JNDI not configured for solr (NoInitialContextEx)
    [junit4] 2> 8820 INFO (TEST-SoftAutoCommitTest.testSoftAndHardCommitMaxTimeRapidAdds-seed#[DE48CF2A7A909FEE]) [ ] o.a.s.c.SolrResourceLoader using system property solr.solr.home: /export/home/jenkins/workspace/Lucene-Solr-6.x-Solaris/solr/core/src/test-files/solr
    [junit4] 2> 8821 INFO (TEST-SoftAutoCommitTest.testSoftAndHardCommitMaxTimeRapidAdds-seed#[DE48CF2A7A909FEE]) [ ] o.a.s.c.SolrResourceLoader Adding 'file:/export/home/jenkins/workspace/Lucene-Solr-6.x-Solaris/solr/core/src/test-files/solr/collection1/lib/classes/' to classloader
    [junit4] 2> 8821 INFO (TEST-SoftAutoCommitTest.testSoftAndHardCommitMaxTimeRapidAdds-seed#[DE48CF2A7A909FEE]) [ ] o.a.s.c.SolrResourceLoader Adding 'file:/export/home/jenkins/workspace/Lucene-Solr-6.x-Solaris/solr/core/src/test-files/solr/collection1/lib/README' to classloader
    [junit4] 2> 8866 INFO (TEST-SoftAutoCommitTest.testSoftAndHardCommitMaxTimeRapidAdds-seed#[DE48CF2A7A909FEE]) [ ] o.a.s.c.SolrConfig current version of requestparams : -1
    [junit4] 2> 9107 INFO (TEST-SoftAutoCommitTest.testSoftAndHardCommitMaxTimeRapidAdds-seed#[DE48CF2A7A909FEE]) [ ] o.a.s.c.SolrConfig Using Lucene MatchVersion: 6.2.0
    [junit4] 2> 9182 INFO (TEST-SoftAutoCommitTest.testSoftAndHardCommitMaxTimeRapidAdds-seed#[DE48CF2A7A909FEE]) [ ] o.a.s.c.SolrConfig Loaded SolrConfig: solrconfig.xml
    [junit4] 2> 9194 INFO (TEST-SoftAutoCommitTest.testSoftAndHardCommitMaxTimeRapidAdds-seed#[DE48CF2A7A909FEE]) [ ] o.a.s.s.IndexSchema [collection1] Schema name=test
    [junit4] 2> 9670 INFO (TEST-SoftAutoCommitTest.testSoftAndHardCommitMaxTimeRapidAdds-seed#[DE48CF2A7A909FEE]) [ ] o.a.s.s.OpenExchangeRatesOrgProvider Initialized with rates=open-exchange-rates.json, refreshInterval=1440.
    [junit4] 2> 9686 INFO (TEST-SoftAutoCommitTest.testSoftAndHardCommitMaxTimeRapidAdds-seed#[DE48CF2A7A909FEE]) [ ] o.a.s.s.IndexSchema default search field in schema is text
    [junit4] 2> 9692 INFO (TEST-SoftAutoCommitTest.testSoftAndHardCommitMaxTimeRapidAdds-seed#[DE48CF2A7A909FEE]) [ ] o.a.s.s.IndexSchema unique key field: id
    [junit4] 2> 9744 INFO (TEST-SoftAutoCommitTest.testSoftAndHardCommitMaxTimeRapidAdds-seed#[DE48CF2A7A909FEE]) [ ] o.a.s.s.FileExchangeRateProvider Reloading exchange rates from file currency.xml
    [junit4] 2> 9751 INFO (TEST-SoftAutoCommitTest.testSoftAndHardCommitMaxTimeRapidAdds-seed#[DE48CF2A7A909FEE]) [ ] o.a.s.s.FileExchangeRateProvider Reloading exchange rates from file currency.xml
    [junit4] 2> 9757 INFO (TEST-SoftAutoCommitTest.testSoftAndHardCommitMaxTimeRapidAdds-seed#[DE48CF2A7A909FEE]) [ ] o.a.s.s.OpenExchangeRatesOrgProvider Reloading exchange rates from open-exchange-rates.json
    [junit4] 2> 9761 INFO (TEST-SoftAutoCommitTest.testSoftAndHardCommitMaxTimeRapidAdds-seed#[DE48CF2A7A909FEE]) [ ] o.a.s.s.OpenExchangeRatesOrgProvider Reloading exchange rates from open-exchange-rates.json
    [junit4] 2> 9764 INFO (TEST-SoftAutoCommitTest.testSoftAndHardCommitMaxTimeRapidAdds-seed#[DE48CF2A7A909FEE]) [ ] o.a.s.c.ConfigSetProperties Did not find ConfigSet properties, assuming default properties: Can't find resource 'configsetprops.json' in classpath or '/export/home/jenkins/workspace/Lucene-Solr-6.x-Solaris/solr/core/src/test-files/solr/collection1'
    [junit4] 2> 9765 INFO (TEST-SoftAutoCommitTest.testSoftAndHardCommitMaxTimeRapidAdds-seed#[DE48CF2A7A909FEE]) [ ] o.a.s.c.CoreContainer Reloading SolrCore 'collection1' using configuration from instancedir /export/home/jenkins/workspace/Lucene-Solr-6.x-Solaris/solr/core/src/test-files/solr/collection1
    [junit4] 2> 9773 INFO (TEST-SoftAutoCommitTest.testSoftAndHardCommitMaxTimeRapidAdds-seed#[DE48CF2A7A909FEE]) [ x:collection1] o.a.s.c.SolrCore [[collection1] ] Opening new SolrCore at [/export/home/jenkins/workspace/Lucene-Solr-6.x-Solaris/solr/core/src/test-files/solr/collection1], dataDir=[/export/home/jenkins/workspace/Lucene-Solr-6.x-Solaris/solr/build/solr-core/test/J0/temp/solr.update.SoftAutoCommitTest_DE48CF2A7A909FEE-001/init-core-data-001/]
    [junit4] 2> 9774 INFO (TEST-SoftAutoCommitTest.testSoftAndHardCommitMaxTimeRapidAdds-seed#[DE48CF2A7A909FEE]) [ x:collection1] o.a.s.c.JmxMonitoredMap No JMX servers found, not exposing Solr information with JMX.
    [junit4] 2> 9775 INFO (TEST-SoftAutoCommitTest.testSoftAndHardCommitMaxTimeRapidAdds-seed#[DE48CF2A7A909FEE]) [ x:collection1] o.a.s.c.SolrCore New index directory detected: old=null new=/export/home/jenkins/workspace/Lucene-Solr-6.x-Solaris/solr/build/solr-core/test/J0/temp/solr.update.SoftAutoCommitTest_DE48CF2A7A909FEE-001/init-core-data-001/index/
    [junit4] 2> 9775 INFO (OldIndexDirectoryCleanupThreadForCore-collection1) [ x:collection1] o.a.s.c.SolrCore Looking for old index directories to cleanup for core collection1 in /export/home/jenkins/workspace/Lucene-Solr-6.x-Solaris/solr/build/solr-core/test/J0/temp/solr.update.SoftAutoCommitTest_DE48CF2A7A909FEE-001/init-core-data-001/
    [junit4] 2> 9783 INFO (TEST-SoftAutoCommitTest.testSoftAndHardCommitMaxTimeRapidAdds-seed#[DE48CF2A7A909FEE]) [ x:collection1] o.a.s.u.p.UpdateRequestProcessorChain creating updateRequestProcessorChain "dedupe"
    [junit4] 2> 9784 INFO (TEST-SoftAutoCommitTest.testSoftAndHardCommitMaxTimeRapidAdds-seed#[DE48CF2A7A909FEE]) [ x:collection1] o.a.s.u.p.UpdateRequestProcessorChain inserting DistributedUpdateProcessorFactory into updateRequestProcessorChain "dedupe"
    [junit4] 2> 9784 INFO (TEST-SoftAutoCommitTest.testSoftAndHardCommitMaxTimeRapidAdds-seed#[DE48CF2A7A909FEE]) [ x:collection1] o.a.s.u.p.UpdateRequestProcessorChain creating updateRequestProcessorChain "dedupe-allfields"
    [junit4] 2> 9784 INFO (TEST-SoftAutoCommitTest.testSoftAndHardCommitMaxTimeRapidAdds-seed#[DE48CF2A7A909FEE]) [ x:collection1] o.a.s.u.p.UpdateRequestProcessorChain inserting DistributedUpdateProcessorFactory into updateRequestProcessorChain "dedupe-allfields"
    [junit4] 2> 9784 INFO (TEST-SoftAutoCommitTest.testSoftAndHardCommitMaxTimeRapidAdds-seed#[DE48CF2A7A909FEE]) [ x:collection1] o.a.s.u.p.UpdateRequestProcessorChain creating updateRequestProcessorChain "stored_sig"
    [junit4] 2> 9784 INFO (TEST-SoftAutoCommitTest.testSoftAndHardCommitMaxTimeRapidAdds-seed#[DE48CF2A7A909FEE]) [ x:collection1] o.a.s.u.p.UpdateRequestProcessorChain inserting DistributedUpdateProcessorFactory into updateRequestProcessorChain "stored_sig"
    [junit4] 2> 9785 INFO (TEST-SoftAutoCommitTest.testSoftAndHardCommitMaxTimeRapidAdds-seed#[DE48CF2A7A909FEE]) [ x:collection1] o.a.s.u.p.UpdateRequestProcessorChain creating updateRequestProcessorChain "uniq-fields"
    [junit4] 2> 9785 INFO (TEST-SoftAutoCommitTest.testSoftAndHardCommitMaxTimeRapidAdds-seed#[DE48CF2A7A909FEE]) [ x:collection1] o.a.s.u.p.UpdateRequestProcessorChain inserting DistributedUpdateProcessorFactory into updateRequestProcessorChain "uniq-fields"
    [junit4] 2> 9785 INFO (TEST-SoftAutoCommitTest.testSoftAndHardCommitMaxTimeRapidAdds-seed#[DE48CF2A7A909FEE]) [ x:collection1] o.a.s.u.p.UpdateRequestProcessorChain creating updateRequestProcessorChain "distrib-dup-test-chain-explicit"
    [junit4] 2> 9785 INFO (TEST-SoftAutoCommitTest.testSoftAndHardCommitMaxTimeRapidAdds-seed#[DE48CF2A7A909FEE]) [ x:collection1] o.a.s.u.p.UpdateRequestProcessorChain creating updateRequestProcessorChain "distrib-dup-test-chain-implicit"
    [junit4] 2> 9786 INFO (TEST-SoftAutoCommitTest.testSoftAndHardCommitMaxTimeRapidAdds-seed#[DE48CF2A7A909FEE]) [ x:collection1] o.a.s.u.p.UpdateRequestProcessorChain inserting DistributedUpdateProcessorFactory into updateRequestProcessorChain "distrib-dup-test-chain-implicit"
    [junit4] 2> 9786 INFO (TEST-SoftAutoCommitTest.testSoftAndHardCommitMaxTimeRapidAdds-seed#[DE48CF2A7A909FEE]) [ x:collection1] o.a.s.c.SolrCore no updateRequestProcessorChain defined as default, creating implicit default
    [junit4] 2> 9789 INFO (TEST-SoftAutoCommitTest.testSoftAndHardCommitMaxTimeRapidAdds-seed#[DE48CF2A7A909FEE]) [ x:collection1] o.a.s.h.l.XMLLoader xsltCacheLifetimeSeconds=60
    [junit4] 2> 9790 INFO (TEST-SoftAutoCommitTest.testSoftAndHardCommitMaxTimeRapidAdds-seed#[DE48CF2A7A909FEE]) [ x:collection1] o.a.s.h.l.XMLLoader xsltCacheLifetimeSeconds=60
    [junit4] 2> 9791 INFO (TEST-SoftAutoCommitTest.testSoftAndHardCommitMaxTimeRapidAdds-seed#[DE48CF2A7A909FEE]) [ x:collection1] o.a.s.h.l.XMLLoader xsltCacheLifetimeSeconds=60
    [junit4] 2> 9792 INFO (TEST-SoftAutoCommitTest.testSoftAndHardCommitMaxTimeRapidAdds-seed#[DE48CF2A7A909FEE]) [ x:collection1] o.a.s.h.l.XMLLoader xsltCacheLifetimeSeconds=60
    [junit4] 2> 9796 INFO (TEST-SoftAutoCommitTest.testSoftAndHardCommitMaxTimeRapidAdds-seed#[DE48CF2A7A909FEE]) [ x:collection1] o.a.s.c.PluginBag requestHandler : 'lazy' created with startup=lazy
    [junit4] 2> 9798 INFO (TEST-SoftAutoCommitTest.testSoftAndHardCommitMaxTimeRapidAdds-seed#[DE48CF2A7A909FEE]) [ x:collection1] o.a.s.c.RequestHandlers Registered paths: /admin/mbeans,standard,spellCheckCompRH,lazy,/update/json/docs,/admin/luke,/export,spellCheckWithWordbreak_Direct,tvrh,/get,/admin/properties,/update/json,mltrh,/admin/threads,/search-facet-def,/update/csv,/sql,/graph,/search-facet-invariants,/admin/segments,spellCheckCompRH1,/mlt,/admin/system,/replication,dismax,defaults,/config,/stream,/schema,/admin/plugins,/admin/logging,spellCheckWithWordbreak,mock,/admin/ping,/update,/admin/file,/terms,spellCheckCompRH_Direct,/debug/dump
    [junit4] 2> 9799 INFO (TEST-SoftAutoCommitTest.testSoftAndHardCommitMaxTimeRapidAdds-seed#[DE48CF2A7A909FEE]) [ x:collection1] o.a.s.c.SolrCore Using default statsCache cache: org.apache.solr.search.stats.LocalStatsCache
    [junit4] 2> 9799 INFO (TEST-SoftAutoCommitTest.testSoftAndHardCommitMaxTimeRapidAdds-seed#[DE48CF2A7A909FEE]) [ x:collection1] o.a.s.u.CommitTracker Hard AutoCommit: disabled
    [junit4] 2> 9799 INFO (TEST-SoftAutoCommitTest.testSoftAndHardCommitMaxTimeRapidAdds-seed#[DE48CF2A7A909FEE]) [ x:collection1] o.a.s.u.CommitTracker Soft AutoCommit: disabled
    [junit4] 2> 9805 INFO (TEST-SoftAutoCommitTest.testSoftAndHardCommitMaxTimeRapidAdds-seed#[DE48CF2A7A909FEE]) [ x:collection1] o.a.s.s.SolrIndexSearcher Opening [Searcher@565a98ff[collection1] main]
    [junit4] 2> 9806 INFO (TEST-SoftAutoCommitTest.testSoftAndHardCommitMaxTimeRapidAdds-seed#[DE48CF2A7A909FEE]) [ x:collection1] o.a.s.r.RestManager Initializing RestManager with initArgs: {storageIO=org.apache.solr.rest.ManagedResourceStorage$InMemoryStorageIO}
    [junit4] 2> 9806 INFO (TEST-SoftAutoCommitTest.testSoftAndHardCommitMaxTimeRapidAdds-seed#[DE48CF2A7A909FEE]) [ x:collection1] o.a.s.r.ManagedResourceStorage Reading _rest_managed.json using InMemoryStorage
    [junit4] 2> 9807 INFO (TEST-SoftAutoCommitTest.testSoftAndHardCommitMaxTimeRapidAdds-seed#[DE48CF2A7A909FEE]) [ x:collection1] o.a.s.r.RestManager Initializing 0 registered ManagedResources
    [junit4] 2> 9807 INFO (TEST-SoftAutoCommitTest.testSoftAndHardCommitMaxTimeRapidAdds-seed#[DE48CF2A7A909FEE]) [ x:collection1] o.a.s.h.c.SpellCheckComponent Initializing spell checkers
    [junit4] 2> 9808 INFO (TEST-SoftAutoCommitTest.testSoftAndHardCommitMaxTimeRapidAdds-seed#[DE48CF2A7A909FEE]) [ x:collection1] o.a.s.s.DirectSolrSpellChecker init: {name=direct,classname=DirectSolrSpellChecker,field=lowerfilt,minQueryLength=3}
    [junit4] 2> 9816 INFO (TEST-SoftAutoCommitTest.testSoftAndHardCommitMaxTimeRapidAdds-seed#[DE48CF2A7A909FEE]) [ x:collection1] o.a.s.h.ReplicationHandler Commits will be reserved for 10000
    [junit4] 2> 9818 INFO (TEST-SoftAutoCommitTest.testSoftAndHardCommitMaxTimeRapidAdds-seed#[DE48CF2A7A909FEE]) [ x:collection1] o.a.s.u.UpdateLog Looking up max value of version field to seed version buckets
    [junit4] 2> 9823 INFO (TEST-SoftAutoCommitTest.testSoftAndHardCommitMaxTimeRapidAdds-seed#[DE48CF2A7A909FEE]) [ x:collection1] o.a.s.u.VersionInfo Refreshing highest value of _version_ for 65536 version buckets from index
    [junit4] 2> 9827 INFO (TEST-SoftAutoCommitTest.testSoftAndHardCommitMaxTimeRapidAdds-seed#[DE48CF2A7A909FEE]) [ x:collection1] o.a.s.u.VersionInfo No terms found for _version_, cannot seed version bucket highest value from index
    [junit4] 2> 9827 INFO (TEST-SoftAutoCommitTest.testSoftAndHardCommitMaxTimeRapidAdds-seed#[DE48CF2A7A909FEE]) [ x:collection1] o.a.s.u.UpdateLog Could not find max version in index or recent updates, using new clock 1537377060071145472
    [junit4] 2> 9834 INFO (searcherExecutor-24-thread-1-processing-x:collection1) [ x:collection1] o.a.s.h.c.SpellCheckComponent Loading spell index for spellchecker: default
    [junit4] 2> 9847 INFO (searcherExecutor-24-thread-1-processing-x:collection1) [ x:collection1] o.a.s.h.c.SpellCheckComponent Loading spell index for spellchecker: direct
    [junit4] 2> 9847 INFO (searcherExecutor-24-thread-1-processing-x:collection1) [ x:collection1] o.a.s.h.c.SpellCheckComponent Loading spell index for spellchecker: wordbreak
    [junit4] 2> 9847 INFO (searcherExecutor-24-thread-1-processing-x:collection1) [ x:collection1] o.a.s.h.c.SpellCheckComponent Loading spell index for spellchecker: multipleFields
    [junit4] 2> 9851 INFO (searcherExecutor-24-thread-1-processing-x:collection1) [ x:collection1] o.a.s.h.c.SpellCheckComponent Loading spell index for spellchecker: jarowinkler
    [junit4] 2> 9853 INFO (searcherExecutor-24-thread-1-processing-x:collection1) [ x:collection1] o.a.s.h.c.SpellCheckComponent Loading spell index for spellchecker: external
    [junit4] 2> 9854 INFO (searcherExecutor-24-thread-1-processing-x:collection1) [ x:collection1] o.a.s.h.c.SpellCheckComponent Loading spell index for spellchecker: freq
    [junit4] 2> 9856 INFO (searcherExecutor-24-thread-1-processing-x:collection1) [ x:collection1] o.a.s.h.c.SpellCheckComponent Loading spell index for spellchecker: fqcn
    [junit4] 2> 9861 INFO (searcherExecutor-24-thread-1-processing-x:collection1) [ x:collection1] o.a.s.h.c.SpellCheckComponent Loading spell index for spellchecker: perDict
    [junit4] 2> 9861 INFO (searcherExecutor-24-thread-1-processing-x:collection1) [ x:collection1] o.a.s.c.SolrCore [collection1] Registered new searcher Searcher@565a98ff[collection1] main{ExitableDirectoryReader(UninvertingDirectoryReader())}
    [junit4] 2> 9880 INFO (TEST-SoftAutoCommitTest.testSoftAndHardCommitMaxTimeRapidAdds-seed#[DE48CF2A7A909FEE]) [ x:collection1] o.a.s.u.UpdateLog Took 59.0ms to seed version buckets with highest version 1537377060071145472
    [junit4] 2> 9881 INFO (TEST-SoftAutoCommitTest.testSoftAndHardCommitMaxTimeRapidAdds-seed#[DE48CF2A7A909FEE]) [ x:collection1] o.a.s.u.DefaultSolrCoreState Closing old IndexWriter... core=collection1
    [junit4] 2> 9886 INFO (TEST-SoftAutoCommitTest.testSoftAndHardCommitMaxTimeRapidAdds-seed#[DE48CF2A7A909FEE]) [ x:collection1] o.a.s.u.RandomMergePolicy RandomMergePolicy wrapping class org.apache.lucene.index.TieredMergePolicy: [TieredMergePolicy: maxMergeAtOnce=18, maxMergeAtOnceExplicit=44, maxMergedSegmentMB=64.615234375, floorSegmentMB=2.037109375, forceMergeDeletesPctAllowed=25.246678540316516, segmentsPerTier=32.0, maxCFSSegmentSizeMB=8.796093022207999E12, noCFSRatio=1.0
    [junit4] 2> 9898 INFO (TEST-SoftAutoCommitTest.testSoftAndHardCommitMaxTimeRapidAdds-seed#[DE48CF2A7A909FEE]) [ x:collection1] o.a.s.c.SolrDeletionPolicy SolrDeletionPolicy.onInit: commits: num=1
    [junit4] 2> commit{dir=MockDirectoryWrapper(RAMDirectory@7fedd27d lockFactory=org.apache.lucene.store.SingleInstanceLockFactory@76b750e9),segFN=segments_1,generation=1}
    [junit4] 2> 9898 INFO (TEST-SoftAutoCommitTest.testSoftAndHardCommitMaxTimeRapidAdds-seed#[DE48CF2A7A909FEE]) [ x:collection1] o.a.s.c.SolrDeletionPolicy newest commit generation = 1
    [junit4] 2> 9898 INFO (TEST-SoftAutoCommitTest.testSoftAndHardCommitMaxTimeRapidAdds-seed#[DE48CF2A7A909FEE]) [ x:collection1] o.a.s.u.DefaultSolrCoreState New IndexWriter is ready to be used.
    [junit4] 2> 9900 INFO (TEST-SoftAutoCommitTest.testSoftAndHardCommitMaxTimeRapidAdds-seed#[DE48CF2A7A909FEE]) [ x:collection1] o.a.s.s.SolrIndexSearcher Opening [Searcher@5158489c[collection1] main]
    [junit4] 2> 9902 INFO (TEST-SoftAutoCommitTest.testSoftAndHardCommitMaxTimeRapidAdds-seed#[DE48CF2A7A909FEE]) [ x:collection1] o.a.s.c.CoreContainer replacing core: collection1
    [junit4] 2> 9902 INFO (TEST-SoftAutoCommitTest.testSoftAndHardCommitMaxTimeRapidAdds-seed#[DE48CF2A7A909FEE]) [ x:collection1] o.a.s.c.SolrCore [collection1] CLOSING SolrCore org.apache.solr.core.SolrCore@7ef9a88f
    [junit4] 2> 9902 INFO (TEST-SoftAutoCommitTest.testSoftAndHardCommitMaxTimeRapidAdds-seed#[DE48CF2A7A909FEE]) [ x:collection1] o.a.s.u.DirectUpdateHandler2 closing DirectUpdateHandler2{commits=0,autocommits=0,soft autocommits=0,optimizes=0,rollbacks=0,expungeDeletes=0,docsPending=0,adds=0,deletesById=0,deletesByQuery=0,errors=0,cumulative_adds=0,cumulative_deletesById=0,cumulative_deletesByQuery=0,cumulative_errors=0,transaction_logs_total_size=0,transaction_logs_total_number=0}
    [junit4] 2> 9902 INFO (searcherExecutor-24-thread-1-processing-x:collection1) [ x:collection1] o.a.s.c.SolrCore [collection1] Registered new searcher Searcher@5158489c[collection1] main{ExitableDirectoryReader(UninvertingDirectoryReader())}
    [junit4] 2> 9906 INFO (TEST-SoftAutoCommitTest.testSoftAndHardCommitMaxTimeRapidAdds-seed#[DE48CF2A7A909FEE]) [ x:collection1] o.a.s.c.SolrCore [collection1] Closing main searcher on request.
    [junit4] 2> 10560 INFO (TEST-SoftAutoCommitTest.testSoftAndHardCommitMaxTimeRapidAdds-seed#[DE48CF2A7A909FEE]) [ x:collection1] o.a.s.u.p.LogUpdateProcessorFactory [collection1] webapp=null path=null params={}{add=[5000 (1537377060568170496)]} 0 649
    [junit4] 2> 10635 INFO (TEST-SoftAutoCommitTest.testSoftAndHardCommitMaxTimeRapidAdds-seed#[DE48CF2A7A909FEE]) [ x:collection1] o.a.s.u.p.LogUpdateProcessorFactory [collection1] webapp=null path=null params={}{add=[5001 (1537377060915249152)]} 0 3
    [junit4] 2> 10640 INFO (TEST-SoftAutoCommitTest.testSoftAndHardCommitMaxTimeRapidAdds-seed#[DE48CF2A7A909FEE]) [ x:collection1] o.a.s.u.p.LogUpdateProcessorFactory [collection1] webapp=null path=null params={}{add=[5002 (1537377060922589184)]} 0 1
    [junit4] 2> 10642 INFO (TEST-SoftAutoCommitTest.testSoftAndHardCommitMaxTimeRapidAdds-seed#[DE48CF2A7A909FEE]) [ x:collection1] o.a.s.u.p.LogUpdateProcessorFactory [collection1] webapp=null path=null params={}{add=[5003 (1537377060924686336)]} 0 1
    [junit4] 2> 10645 INFO (TEST-SoftAutoCommitTest.testSoftAndHardCommitMaxTimeRapidAdds-seed#[DE48CF2A7A909FEE]) [ x:collection1] o.a.s.u.p.LogUpdateProcessorFactory [collection1] webapp=null path=null params={}{add=[5004 (1537377060926783488)]} 0 1
    [junit4] 2> 11057 INFO (commitScheduler-27-thread-1) [ x:collection1] o.a.s.u.DirectUpdateHandler2 start commit{,optimize=false,openSearcher=true,waitSearcher=true,expungeDeletes=false,softCommit=true,prepareCommit=false}
    [junit4] 2> 11288 INFO (commitScheduler-27-thread-1) [ x:collection1] o.a.s.s.SolrIndexSearcher Opening [Searcher@41202531[collection1] main]
    [junit4] 2> 11289 INFO (searcherExecutor-24-thread-1-processing-x:collection1) [ x:collection1] o.a.s.c.SolrCore [collection1] Registered new searcher Searcher@41202531[collection1] main{ExitableDirectoryReader(UninvertingDirectoryReader(Uninverting(_0(6.2.0):C5)))}
    [junit4] 2> 11292 INFO (commitScheduler-27-thread-1) [ x:collection1] o.a.s.u.DirectUpdateHandler2 end_commit_flush
    [junit4] 2> 11756 INFO (commitScheduler-26-thread-1) [ x:collection1] o.a.s.u.DirectUpdateHandler2 start commit{,optimize=false,openSearcher=true,waitSearcher=true,expungeDeletes=false,softCommit=false,prepareCommit=false}
    [junit4] 2> 11761 INFO (commitScheduler-26-thread-1) [ x:collection1] o.a.s.c.SolrDeletionPolicy SolrDeletionPolicy.onCommit: commits: num=2
    [junit4] 2> commit{dir=MockDirectoryWrapper(RAMDirectory@7fedd27d lockFactory=org.apache.lucene.store.SingleInstanceLockFactory@76b750e9),segFN=segments_1,generation=1}
    [junit4] 2> commit{dir=MockDirectoryWrapper(RAMDirectory@7fedd27d lockFactory=org.apache.lucene.store.SingleInstanceLockFactory@76b750e9),segFN=segments_2,generation=2}
    [junit4] 2> 11761 INFO (commitScheduler-26-thread-1) [ x:collection1] o.a.s.c.SolrDeletionPolicy newest commit generation = 2
    [junit4] 2> 11762 INFO (commitScheduler-26-thread-1) [ x:collection1] o.a.s.s.SolrIndexSearcher Opening [Searcher@6ee94027[collection1] main]
    [junit4] 2> 11763 INFO (commitScheduler-26-thread-1) [ x:collection1] o.a.s.u.DirectUpdateHandler2 end_commit_flush
    [junit4] 2> 11764 INFO (searcherExecutor-24-thread-1-processing-x:collection1) [ x:collection1] o.a.s.c.SolrCore [collection1] Registered new searcher Searcher@6ee94027[collection1] main{ExitableDirectoryReader(UninvertingDirectoryReader(Uninverting(_0(6.2.0):C5)))}
    [junit4] 2> 12293 INFO (TEST-SoftAutoCommitTest.testSoftAndHardCommitMaxTimeRapidAdds-seed#[DE48CF2A7A909FEE]) [ x:collection1] o.a.s.SolrTestCaseJ4 ###Ending testSoftAndHardCommitMaxTimeRapidAdds
    [junit4] 2> NOTE: reproduce with: ant test -Dtestcase=SoftAutoCommitTest -Dtests.method=testSoftAndHardCommitMaxTimeRapidAdds -Dtests.seed=DE48CF2A7A909FEE -Dtests.slow=true -Dtests.locale=sr-Latn -Dtests.timezone=America/Argentina/Catamarca -Dtests.asserts=true -Dtests.file.encoding=UTF-8
    [junit4] FAILURE 3.58s J0 | SoftAutoCommitTest.testSoftAndHardCommitMaxTimeRapidAdds <<<
    [junit4] > Throwable #1: java.lang.AssertionError: 2: soft wasn't fast enough
    [junit4] > at __randomizedtesting.SeedInfo.seed([DE48CF2A7A909FEE:825D61139112DE96]:0)
    [junit4] > at org.apache.solr.update.SoftAutoCommitTest.testSoftAndHardCommitMaxTimeRapidAdds(SoftAutoCommitTest.java:322)
    [junit4] > at java.lang.Thread.run(Thread.java:745)
    [junit4] 2> 12391 INFO (TEST-SoftAutoCommitTest.testSoftAndHardCommitMaxTimeMixedAdds-seed#[DE48CF2A7A909FEE]) [ x:collection1] o.a.s.SolrTestCaseJ4 ###Starting testSoftAndHardCommitMaxTimeMixedAdds
    [junit4] 2> 12391 INFO (TEST-SoftAutoCommitTest.testSoftAndHardCommitMaxTimeMixedAdds-seed#[DE48CF2A7A909FEE]) [ x:collection1] o.a.s.c.SolrResourceLoader new SolrResourceLoader for directory: '/export/home/jenkins/workspace/Lucene-Solr-6.x-Solaris/solr/core/src/test-files/solr/collection1'
    [junit4] 2> 12391 INFO (TEST-SoftAutoCommitTest.testSoftAndHardCommitMaxTimeMixedAdds-seed#[DE48CF2A7A909FEE]) [ x:collection1] o.a.s.c.SolrResourceLoader JNDI not configured for solr (NoInitialContextEx)
    [junit4] 2> 12391 INFO (TEST-SoftAutoCommitTest.testSoftAndHardCommitMaxTimeMixedAdds-seed#[DE48CF2A7A909FEE]) [ x:collection1] o.a.s.c.SolrResourceLoader using system property solr.solr.home: /export/home/jenkins/workspace/Lucene-Solr-6.x-Solaris/solr/core/src/test-files/solr
    [junit4] 2> 12392 INFO (TEST-SoftAutoCommitTest.testSoftAndHardCommitMaxTimeMixedAdds-seed#[DE48CF2A7A909FEE]) [ x:collection1] o.a.s.c.SolrResourceLoader Adding 'file:/export/home/jenkins/workspace/Lucene-Solr-6.x-Solaris/solr/core/src/test-files/solr/collection1/lib/classes/' to classloader
    [junit4] 2> 12392 INFO (TEST-SoftAutoCommitTest.testSoftAndHardCommitMaxTimeMixedAdds-seed#[DE48CF2A7A909FEE]) [ x:collection1] o.a.s.c.SolrResourceLoader Adding 'file:/export/home/jenkins/workspace/Lucene-Solr-6.x-Solaris/solr/core/src/test-files/solr/collection1/lib/README' to classloader
    [junit4] 2> 12740 INFO (TEST-SoftAutoCommitTest.testSoftAndHardCommitMaxTimeMixedAdds-seed#[DE48CF2A7A909FEE]) [ x:collection1] o.a.s.c.SolrConfig current version of requestparams : -1
    [junit4] 2> 12752 INFO (TEST-SoftAutoCommitTest.testSoftAndHardCommitMaxTimeMixedAdds-seed#[DE48CF2A7A909FEE]) [ x:collection1] o.a.s.c.SolrConfig Using Lucene MatchVersion: 6.2.0
    [junit4] 2> 12773 INFO (TEST-SoftAutoCommitTest.testSoftAndHardCommitMaxTimeMixedAdds-seed#[DE48CF2A7A909FEE]) [ x:collection1] o.a.s.c.SolrConfig Loaded SolrConfig: solrconfig.xml
    [junit4] 2> 12795 INFO (TEST-SoftAutoCommitTest.testSoftAndHardCommitMaxTimeMixedAdds-seed#[DE48CF2A7A909FEE]) [ x:collection1] o.a.s.s.IndexSchema [collection1] Schema name=test
    [junit4] 2> 13108 INFO (TEST-SoftAutoCommitTest.testSoftAndHardCommitMaxTimeMixedAdds-seed#[DE48CF2A7A909FEE]) [ x:collection1] o.a.s.s.OpenExchangeRatesOrgProvider Initialized with rates=open-exchange-rates.json, refreshInterval=1440.
    [junit4] 2> 13118 INFO (TEST-SoftAutoCommitTest.testSoftAndHardCommitMaxTimeMixedAdds-seed#[DE48CF2A7A909FEE]) [ x:collection1] o.a.s.s.IndexSchema default search field in schema is text
    [junit4] 2> 13120 INFO (TEST-SoftAutoCommitTest.testSoftAndHardCommitMaxTimeMixedAdds-seed#[DE48CF2A7A909FEE]) [ x:collection1] o.a.s.s.IndexSchema unique key field: id
    [junit4] 2> 13153 INFO (TEST-SoftAutoCommitTest.testSoftAndHardCommitMaxTimeMixedAdds-seed#[DE48CF2A7A909FEE]) [ x:collection1] o.a.s.s.FileExchangeRateProvider Reloading exchange rates from file currency.xml
    [junit4] 2> 13157 INFO (TEST-SoftAutoCommitTest.testSoftAndHardCommitMaxTimeMixedAdds-seed#[DE48CF2A7A909FEE]) [ x:collection1] o.a.s.s.FileExchangeRateProvider Reloading exchange rates from file currency.xml
    [junit4] 2> 13160 INFO (TEST-SoftAutoCommitTest.testSoftAndHardCommitMaxTimeMixedAdds-seed#[DE48CF2A7A909FEE]) [ x:collection1] o.a.s.s.OpenExchangeRatesOrgProvider Reloading exchange rates from open-exchange-rates.json
    [junit4] 2> 13160 INFO (TEST-SoftAutoCommitTest.testSoftAndHardCommitMaxTimeMixedAdds-seed#[DE48CF2A7A909FEE]) [ x:collection1] o.a.s.s.OpenExchangeRatesOrgProvider Reloading exchange rates from open-exchange-rates.json
    [junit4] 2> 13163 INFO (TEST-SoftAutoCommitTest.testSoftAndHardCommitMaxTimeMixedAdds-seed#[DE48CF2A7A909FEE]) [ x:collection1] o.a.s.c.ConfigSetProperties Did not find ConfigSet properties, assuming default properties: Can't find resource 'configsetprops.json' in classpath or '/export/home/jenkins/workspace/Lucene-Solr-6.x-Solaris/solr/core/src/test-files/solr/collection1'
    [junit4] 2> 13163 INFO (TEST-SoftAutoCommitTest.testSoftAndHardCommitMaxTimeMixedAdds-seed#[DE48CF2A7A909FEE]) [ x:collection1] o.a.s.c.CoreContainer Reloading SolrCore 'collection1' using configuration from instancedir /export/home/jenkins/workspace/Lucene-Solr-6.x-Solaris/solr/core/src/test-files/solr/collection1
    [junit4] 2> 13163 INFO (TEST-SoftAutoCommitTest.testSoftAndHardCommitMaxTimeMixedAdds-seed#[DE48CF2A7A909FEE]) [ x:collection1] o.a.s.c.SolrCore [[collection1] ] Opening new SolrCore at [/export/home/jenkins/workspace/Lucene-Solr-6.x-Solaris/solr/core/src/test-files/solr/collection1], dataDir=[/export/home/jenkins/workspace/Lucene-Solr-6.x-Solaris/solr/build/solr-core/test/J0/temp/solr.update.SoftAutoCommitTest_DE48CF2A7A909FEE-001/init-core-data-001/]
    [junit4] 2> 13163 INFO (TEST-SoftAutoCommitTest.testSoftAndHardCommitMaxTimeMixedAdds-seed#[DE48CF2A7A909FEE]) [ x:collection1] o.a.s.c.JmxMonitoredMap No JMX servers found, not exposing Solr information with JMX.
    [junit4] 2> 13163 INFO (TEST-SoftAutoCommitTest.testSoftAndHardCommitMaxTimeMixedAdds-seed#[DE48CF2A7A909FEE]) [ x:collection1] o.a.s.c.SolrCore New index directory detected: old=null new=/export/home/jenkins/workspace/Lucene-Solr-6.x-Solaris/solr/build/solr-core/test/J0/temp/solr.update.SoftAutoCommitTest_DE48CF2A7A909FEE-001/init-core-data-001/index/
    [junit4] 2> 13165 INFO (OldIndexDirectoryCleanupThreadForCore-collection1) [ x:collection1] o.a.s.c.SolrCore Looking for old index directories to cleanup for core collection1 in /export/home/jenkins/workspace/Lucene-Solr-6.x-Solaris/solr/build/solr-core/test/J0/temp/solr.update.SoftAutoCommitTest_DE48CF2A7A909FEE-001/init-core-data-001/
    [junit4] 2> 13166 INFO (TEST-SoftAutoCommitTest.testSoftAndHardCommitMaxTimeMixedAdds-seed#[DE48CF2A7A909FEE]) [ x:collection1] o.a.s.u.p.UpdateRequestProcessorChain creating updateRequestProcessorChain "dedupe"
    [junit4] 2> 13166 INFO (TEST-SoftAutoCommitTest.testSoftAndHardCommitMaxTimeMixedAdds-seed#[DE48CF2A7A909FEE]) [ x:collection1] o.a.s.u.p.UpdateRequestProcessorChain inserting DistributedUpdateProcessorFactory into updateRequestProcessorChain "dedupe"
    [junit4] 2> 13166 INFO (TEST-SoftAutoCommitTest.testSoftAndHardCommitMaxTimeMixedAdds-seed#[DE48CF2A7A909FEE]) [ x:collection1] o.a.s.u.p.UpdateRequestProcessorChain creating updateRequestProcessorChain "dedupe-allfields"
    [junit4] 2> 13167 INFO (TEST-SoftAutoCommitTest.testSoftAndHardCommitMaxTimeMixedAdds-seed#[DE48CF2A7A909FEE]) [ x:collection1] o.a.s.u.p.UpdateRequestProcessorChain inserting DistributedUpdateProcessorFactory into updateRequestProcessorChain "dedupe-allfields"
    [junit4] 2> 13167 INFO (TEST-SoftAutoCommitTest.testSoftAndHardCommitMaxTimeMixedAdds-seed#[DE48CF2A7A909FEE]) [ x:collection1] o.a.s.u.p.UpdateRequestProcessorChain creating updateRequestProcessorChain "stored_sig"
    [junit4] 2> 13167 INFO (TEST-SoftAutoCommitTest.testSoftAndHardCommitMaxTimeMixedAdds-seed#[DE48CF2A7A909FEE]) [ x:collection1] o.a.s.u.p.UpdateRequestProcessorChain inserting DistributedUpdateProcessorFactory into updateRequestProcessorChain "stored_sig"
    [junit4] 2> 13168 INFO (TEST-SoftAutoCommitTest.testSoftAndHardCommitMaxTimeMixedAdds-seed#[DE48CF2A7A909FEE]) [ x:collection1] o.a.s.u.p.UpdateRequestProcessorChain creating updateRequestProcessorChain "uniq-fields"
    [junit4] 2> 13169 INFO (TEST-SoftAutoCommitTest.testSoftAndHardCommitMaxTimeMixedAdds-seed#[DE48CF2A7A909FEE]) [ x:collection1] o.a.s.u.p.UpdateRequestProcessorChain inserting DistributedUpdateProcessorFactory into updateRequestProcessorChain "uniq-fields"
    [junit4] 2> 13169 INFO (TEST-SoftAutoCommitTest.testSoftAndHardCommitMaxTimeMixedAdds-seed#[DE48CF2A7A909FEE]) [ x:collection1] o.a.s.u.p.UpdateRequestProcessorChain creating updateRequestProcessorChain "distrib-dup-test-chain-explicit"
    [junit4] 2> 13169 INFO (TEST-SoftAutoCommitTest.testSoftAndHardCommitMaxTimeMixedAdds-seed#[DE48CF2A7A909FEE]) [ x:collection1] o.a.s.u.p.UpdateRequestProcessorChain creating updateRequestProcessorChain "distrib-dup-test-chain-implicit"
    [junit4] 2> 13169 INFO (TEST-SoftAutoCommitTest.testSoftAndHardCommitMaxTimeMixedAdds-seed#[DE48CF2A7A909FEE]) [ x:collection1] o.a.s.u.p.UpdateRequestProcessorChain inserting DistributedUpdateProcessorFactory into updateRequestProcessorChain "distrib-dup-test-chain-implicit"
    [junit4] 2> 13169 INFO (TEST-SoftAutoCommitTest.testSoftAndHardCommitMaxTimeMixedAdds-seed#[DE48CF2A7A909FEE]) [ x:collection1] o.a.s.c.SolrCore no updateRequestProcessorChain defined as default, creating implicit default
    [junit4] 2> 13172 INFO (TEST-SoftAutoCommitTest.testSoftAndHardCommitMaxTimeMixedAdds-seed#[DE48CF2A7A909FEE]) [ x:collection1] o.a.s.h.l.XMLLoader xsltCacheLifetimeSeconds=60
    [junit4] 2> 13174 INFO (TEST-SoftAutoCommitTest.testSoftAndHardCommitMaxTimeMixedAdds-seed#[DE48CF2A7A909FEE]) [ x:collection1] o.a.s.h.l.XMLLoader xsltCacheLifetimeSeconds=60
    [junit4] 2> 13175 INFO (TEST-SoftAutoCommitTest.testSoftAndHardCommitMaxTimeMixedAdds-seed#[DE48CF2A7A909FEE]) [ x:collection1] o.a.s.h.l.XMLLoader xsltCacheLifetimeSeconds=60
    [junit4] 2> 13181 INFO (TEST-SoftAutoCommitTest.testSoftAndHardCommitMaxTimeMixedAdds-seed#[DE48CF2A7A909FEE]) [ x:collection1] o.a.s.h.l.XMLLoader xsltCacheLifetimeSeconds=60
    [junit4] 2> 13185 INFO (TEST-SoftAutoCommitTest.testSoftAndHardCommitMaxTimeMixedAdds-seed#[DE48CF2A7A909FEE]) [ x:collection1] o.a.s.c.PluginBag requestHandler : 'lazy' created with startup=lazy
    [junit4] 2> 13187 INFO (TEST-SoftAutoCommitTest.testSoftAndHardCommitMaxTimeMixedAdds-seed#[DE48CF2A7A909FEE]) [ x:collection1] o.a.s.c.RequestHandlers Registered paths: /admin/mbeans,standard,spellCheckCompRH,lazy,/update/json/docs,/admin/luke,/export,spellCheckWithWordbreak_Direct,tvrh,/get,/admin/properties,/update/json,mltrh,/admin/threads,/search-facet-def,/update/csv,/sql,/graph,/search-facet-invariants,/admin/segments,spellCheckCompRH1,/mlt,/admin/system,/replication,dismax,defaults,/config,/stream,/schema,/admin/plugins,/admin/logging,spellCheckWithWordbreak,mock,/admin/ping,/update,/admin/file,/terms,spellCheckCompRH_Direct,/debug/dump
    [junit4] 2> 13187 INFO (TEST-SoftAutoCommitTest.testSoftAndHardCommitMaxTimeMixedAdds-seed#[DE48CF2A7A909FEE]) [ x:collection1] o.a.s.c.SolrCore Using default statsCache cache: org.apache.solr.search.stats.LocalStatsCache
    [junit4] 2> 13187 INFO (TEST-SoftAutoCommitTest.testSoftAndHardCommitMaxTimeMixedAdds-seed#[DE48CF2A7A909FEE]) [ x:collection1] o.a.s.u.CommitTracker Hard AutoCommit: disabled
    [junit4] 2> 13187 INFO (TEST-SoftAutoCommitTest.testSoftAndHardCommitMaxTimeMixedAdds-seed#[DE48CF2A7A909FEE]) [ x:collection1] o.a.s.u.CommitTracker Soft AutoCommit: disabled
    [junit4] 2> 13189 INFO (TEST-SoftAutoCommitTest.testSoftAndHardCommitMaxTimeMixedAdds-seed#[DE48CF2A7A909FEE]) [ x:collection1] o.a.s.s.SolrIndexSearcher Opening [Searcher@72c734e6[collection1] main]
    [junit4] 2> 13191 INFO (TEST-SoftAutoCommitTest.testSoftAndHardCommitMaxTimeMixedAdds-seed#[DE48CF2A7A909FEE]) [ x:collection1] o.a.s.r.RestManager Initializing RestManager with initArgs: {storageIO=org.apache.solr.rest.ManagedResourceStorage$InMemoryStorageIO}
    [junit4] 2> 13191 INFO (TEST-SoftAutoCommitTest.testSoftAndHardCommitMaxTimeMixedAdds-seed#[DE48CF2A7A909FEE]) [ x:collection1] o.a.s.r.ManagedResourceStorage Reading _rest_managed.json using InMemoryStorage
    [junit4] 2> 13191 INFO (TEST-SoftAutoCommitTest.testSoftAndHardCommitMaxTimeMixedAdds-seed#[DE48CF2A7A909FEE]) [ x:collection1] o.a.s.r.RestManager Initializing 0 registered ManagedResources
    [junit4] 2> 13191 INFO (TEST-SoftAutoCommitTest.testSoftAndHardCommitMaxTimeMixedAdds-seed#[DE48CF2A7A909FEE]) [ x:collection1] o.a.s.h.c.SpellCheckComponent Initializing spell checkers
    [junit4] 2> 13193 INFO (TEST-SoftAutoCommitTest.testSoftAndHardCommitMaxTimeMixedAdds-seed#[DE48CF2A7A909FEE]) [ x:collection1] o.a.s.s.DirectSolrSpellChecker init: {name=direct,classname=DirectSolrSpellChecker,field=lowerfilt,minQueryLength=3}
    [junit4] 2> 13204 INFO (TEST-SoftAutoCommitTest.testSoftAndHardCommitMaxTimeMixedAdds-seed#[DE48CF2A7A909FEE]) [ x:collection1] o.a.s.h.ReplicationHandler Commits will be reserved for 10000
    [junit4] 2> 13205 INFO (searcherExecutor-28-thread-1-processing-x:collection1) [ x:collection1] o.a.s.h.c.SpellCheckComponent Loading spell index for spellchecker: default
    [junit4] 2> 13205 INFO (TEST-SoftAutoCommitTest.testSoftAndHardCommitMaxTimeMixedAdds-seed#[DE48CF2A7A909FEE]) [ x:collection1] o.a.s.u.UpdateLog Looking up max value of version field to seed version buckets
    [junit4] 2> 13207 INFO (searcherExecutor-28-thread-1-processing-x:collection1) [ x:collection1] o.a.s.h.c.SpellCheckComponent Loading spell index for spellchecker: direct
    [junit4] 2> 13207 INFO (searcherExecutor-28-thread-1-processing-x:collection1) [ x:collection1] o.a.s.h.c.SpellCheckComponent Loading spell index for spellchecker: wordbreak
    [junit4] 2> 13207 INFO (searcherExecutor-28-thread-1-processing-x:collection1) [ x:collection1] o.a.s.h.c.SpellCheckComponent Loading spell index for spellchecker: multipleFields
    [junit4] 2> 13208 INFO (searcherExecutor-28-thread-1-processing-x:collection1) [ x:collection1] o.a.s.h.c.SpellCheckComponent Loading spell index for spellchecker: jarowinkler
    [junit4] 2> 13209 INFO (TEST-SoftAutoCommitTest.testSoftAndHardCommitMaxTimeMixedAdds-seed#[DE48CF2A7A909FEE]) [ x:collection1] o.a.s.u.VersionInfo Refreshing highest value of _version_ for 65536 version buckets from index
    [junit4] 2> 13209 INFO (searcherExecutor-28-thread-1-processing-x:collection1) [ x:collection1] o.a.s.h.c.SpellCheckComponent Loading spell index for spellchecker: external
    [junit4] 2> 13210 INFO (searcherExecutor-28-thread-1-processing-x:collection1) [ x:collection1] o.a.s.h.c.SpellCheckComponent Loading spell index for spellchecker: freq
    [junit4] 2> 13211 INFO (searcherExecutor-28-thread-1-processing-x:collection1) [ x:collection1] o.a.s.h.c.SpellCheckComponent Loading spell index for spellchecker: fqcn
    [junit4] 2> 13213 INFO (searcherExecutor-28-thread-1-processing-x:collection1) [ x:collection1] o.a.s.h.c.SpellCheckComponent Loading spell index for spellchecker: perDict
    [junit4] 2> 13213 INFO (searcherExecutor-28-thread-1-processing-x:collection1) [ x:collection1] o.a.s.c.SolrCore [collection1] Registered new searcher Searcher@72c734e6[collection1] main{ExitableDirectoryReader(UninvertingDirectoryReader(Uninverting(_0(6.2.0):C5)))}
    [junit4] 2> 13220 INFO (TEST-SoftAutoCommitTest.testSoftAndHardCommitMaxTimeMixedAdds-seed#[DE48CF2A7A909FEE]) [ x:collection1] o.a.s.u.VersionInfo Found MAX value 1537377060926783488 from Terms for _version_ in index
    [junit4] 2> 13225 INFO (TEST-SoftAutoCommitTest.testSoftAndHardCommitMaxTimeMixedAdds-seed#[DE48CF2A7A909FEE]) [ x:collection1] o.a.s.u.UpdateLog Took 19.0ms to seed version buckets with highest version 1537377060926783488
    [junit4] 2> 13225 INFO (TEST-SoftAutoCommitTest.testSoftAndHardCommitMaxTimeMixedAdds-seed#[DE48CF2A7A909FEE]) [ x:collection1] o.a.s.u.DefaultSolrCoreState Closing old IndexWriter... core=collection1
    [junit4] 2> 13226 INFO (TEST-SoftAutoCommitTest.testSoftAndHardCommitMaxTimeMixedAdds-seed#[DE48CF2A7A909FEE]) [ x:collection1] o.a.s.u.RandomMergePolicy RandomMergePolicy wrapping class org.apache.lucene.index.LogDocMergePolicy: [LogDocMergePolicy: minMergeSize=1000, mergeFactor=21, maxMergeSize=9223372036854775807, maxMergeSizeForForcedMerge=9223372036854775807, calibrateSizeByDeletes=true, maxMergeDocs=2147483647, maxCFSSegmentSizeMB=8.796093022207999E12, noCFSRatio=0.5826115623488087]
    [junit4] 2> 13228 INFO (TEST-SoftAutoCommitTest.testSoftAndHardCommitMaxTimeMixedAdds-seed#[DE48CF2A7A909FEE]) [ x:collection1] o.a.s.c.SolrDeletionPolicy SolrDeletionPolicy.onInit: commits: num=1
    [junit4] 2> commit{dir=MockDirectoryWrapper(RAMDirectory@7fedd27d lockFactory=org.apache.lucene.store.SingleInstanceLockFactory@76b750e9),segFN=segments_2,generation=2}
    [junit4] 2> 13228 INFO (TEST-SoftAutoCommitTest.testSoftAndHardCommitMaxTimeMixedAdds-seed#[DE48CF2A7A909FEE]) [ x:collection1] o.a.s.c.SolrDeletionPolicy newest commit generation = 2
    [junit4] 2> 13228 INFO (TEST-SoftAutoCommitTest.testSoftAndHardCommitMaxTimeMixedAdds-seed#[DE48CF2A7A909FEE]) [ x:collection1] o.a.s.u.DefaultSolrCoreState New IndexWriter is ready to be used.
    [junit4] 2> 13230 INFO (TEST-SoftAutoCommitTest.testSoftAndHardCommitMaxTimeMixedAdds-seed#[DE48CF2A7A909FEE]) [ x:collection1] o.a.s.s.SolrIndexSearcher Opening [Searcher@47f5cb18[collection1] main]
    [junit4] 2> 13231 INFO (TEST-SoftAutoCommitTest.testSoftAndHardCommitMaxTimeMixedAdds-seed#[DE48CF2A7A909FEE]) [ x:collection1] o.a.s.c.CoreContainer replacing core: collection1
    [junit4] 2> 13232 INFO (TEST-SoftAutoCommitTest.testSoftAndHardCommitMaxTimeMixedAdds-seed#[DE48CF2A7A909FEE]) [ x:collection1] o.a.s.c.SolrCore [collection1] CLOSING SolrCore org.apache.solr.core.SolrCore@6c1dd5ce
    [junit4] 2> 13232 INFO (searcherExecutor-28-thread-1-processing-x:collection1) [ x:collection1] o.a.s.c.SolrCore [collection1] Registered new searcher Searcher@47f5cb18[collection1] main{ExitableDirectoryReader(UninvertingDirectoryReader(Uninverting(_0(6.2.0):C5)))}
    [junit4] 2> 13232 INFO (TEST-SoftAutoCommitTest.testSoftAndHardCommitMaxTimeMixedAdds-seed#[DE48CF2A7A909FEE]) [ x:collection1] o.a.s.u.DirectUpdateHandler2 closing DirectUpdateHandler2{commits=2,autocommit maxTime=1200ms,autocommits=1,soft autocommit maxTime=500ms,soft autocommits=1,optimizes=0,rollbacks=0,expungeDeletes=0,docsPending=0,adds=0,deletesById=0,deletesByQuery=0,errors=0,cumulative_adds=5,cumulative_deletesById=0,cumulative_deletesByQuery=0,cumulative_errors=0,transaction_logs_total_size=339,transaction_logs_total_number=1}
    [junit4] 2> 13233 INFO (TEST-SoftAutoCommitTest.testSoftAndHardCommitMaxTimeMixedAdds-seed#[DE48CF2A7A909FEE]) [ x:collection1] o.a.s.c.SolrCore [collection1] Closing main searcher on request.
    [junit4] 2> 13242 INFO (TEST-SoftAutoCommitTest.testSoftAndHardCommitMaxTimeMixedAdds-seed#[DE48CF2A7A909FEE]) [ x:collection1] o.a.s.u.p.LogUpdateProcessorFactory [collection1] webapp=null path=null params={}{add=[529 (1537377063646789632)]} 0 4
    [junit4] 2> 13746 INFO (commitScheduler-31-thread-1) [ x:collection1] o.a.s.u.DirectUpdateHandler2 start commit{,optimize=false,openSearcher=true,waitSearcher=true,expungeDeletes=false,softCommit=true,prepareCommit=false}
    [junit4] 2> 13773 INFO (commitScheduler-31-thread-1) [ x:collection1] o.a.s.s.SolrIndexSearcher Opening [Searcher@c8e9314[collection1] main]
    [junit4] 2> 13775 INFO (searcherExecutor-28-thread-1-processing-x:collection1) [ x:collection1] o.a.s.c.SolrCore [collection1] Registered new searcher Searcher@c8e9314[collection1] main{ExitableDirectoryReader(UninvertingDirectoryReader(Uninverting(_0(6.2.0):C5) Uninverting(_1(6.2.0):C1)))}
    [junit4] 2> 13776 INFO (commitScheduler-31-thread-1) [ x:collection1] o.a.s.u.DirectUpdateHandler2 end_commit_flush
    [junit4] 2> 13781 INFO (TEST-SoftAutoCommitTest.testSoftAndHardCommitMaxTimeMixedAdds-seed#[DE48CF2A7A909FEE]) [ x:collection1] o.a.s.u.p.LogUpdateProcessorFactory [collection1] webapp=null path=null params={}{add=[530 (1537377064214069248)]} 0 3
    [junit4] 2> 14282 INFO (commitScheduler-31-thread-1) [ x:collection1] o.a.s.u.DirectUpdateHandler2 start commit{,optimize=false,openSearcher=true,waitSearcher=true,expungeDeletes=false,softCommit=true,prepareCommit=false}
    [junit4] 2> 14292 INFO (commitScheduler-31-thread-1) [ x:collection1] o.a.s.s.SolrIndexSearcher Opening [Searcher@2c93e1ef[collection1] main]
    [junit4] 2> 14292 INFO (commitScheduler-31-thread-1) [ x:collection1] o.a.s.u.DirectUpdateHandler2 end_commit_flush
    [junit4] 2> 14292 INFO (searcherExecutor-28-thread-1-processing-x:collection1) [ x:collection1] o.a.s.c.SolrCore [collection1] Registered new searcher Searcher@2c93e1ef[collection1] main{ExitableDirectoryReader(UninvertingDirectoryReader(Uninverting(_0(6.2.0):C5) Uninverting(_1(6.2.0):C1) Uninverting(_2(6.2.0):C1)))}
    [junit4] 2> 14442 INFO (commitScheduler-30-thread-1) [ x:collection1] o.a.s.u.DirectUpdateHandler2 start commit{,optimize=false,openSearcher=true,waitSearcher=true,expungeDeletes=false,softCommit=false,prepareCommit=false}
    [junit4] 2> 14445 INFO (commitScheduler-30-thread-1) [ x:collection1] o.a.s.c.SolrDeletionPolicy SolrDeletionPolicy.onCommit: commits: num=2
    [junit4] 2> commit{dir=MockDirectoryWrapper(RAMDirectory@7fedd27d lockFactory=org.apache.lucene.store.SingleInstanceLockFactory@76b750e9),segFN=segments_2,generation=2}
    [junit4] 2> commit{dir=MockDirectoryWrapper(RAMDirectory@7fedd27d lockFactory=org.apache.lucene.store.SingleInstanceLockFactory@76b750e9),segFN=segments_3,generation=3}
    [junit4] 2> 14445 INFO (commitScheduler-30-thread-1) [ x:collection1] o.a.s.c.SolrDeletionPolicy newest commit generation = 3
    [junit4] 2> 14449 INFO (commitScheduler-30-thread-1) [ x:collection1] o.a.s.s.SolrIndexSearcher Opening [Searcher@2b856840[collection1] main]
    [junit4] 2> 14451 INFO (searcherExecutor-28-thread-1-processing-x:collection1) [ x:collection1] o.a.s.c.SolrCore [collection1] Registered new searcher Searcher@2b856840[collection1] main{ExitableDirectoryReader(UninvertingDirectoryReader(Uninverting(_0(6.2.0):C5) Uninverting(_1(6.2.0):C1) Uninverting(_2(6.2.0):C1)))}
    [junit4] 2> 14451 INFO (commitScheduler-30-thread-1) [ x:collection1] o.a.s.u.DirectUpdateHandler2 end_commit_flush
    [junit4] 2> 17650 INFO (TEST-SoftAutoCommitTest.testSoftAndHardCommitMaxTimeMixedAdds-seed#[DE48CF2A7A909FEE]) [ x:collection1] o.a.s.SolrTestCaseJ4 ###Ending testSoftAndHardCommitMaxTimeMixedAdds
    [junit4] 2> 17654 INFO (TEST-SoftAutoCommitTest.testSoftAndHardCommitMaxTimeDelete-seed#[DE48CF2A7A909FEE]) [ x:collection1] o.a.s.SolrTestCaseJ4 ###Starting testSoftAndHardCommitMaxTimeDelete
    [junit4] 2> 17655 INFO (TEST-SoftAutoCommitTest.testSoftAndHardCommitMaxTimeDelete-seed#[DE48CF2A7A909FEE]) [ x:collection1] o.a.s.c.SolrResourceLoader new SolrResourceLoader for directory: '/export/home/jenkins/workspace/Lucene-Solr-6.x-Solaris/solr/core/src/test-files/solr/collection1'
    [junit4] 2> 17655 INFO (TEST-SoftAutoCommitTest.testSoftAndHardCommitMaxTimeDelete-seed#[DE48CF2A7A909FEE]) [ x:collection1] o.a.s.c.SolrResourceLoader JNDI not configured for solr (NoInitialContextEx)
    [junit4] 2> 17655 INFO (TEST-SoftAutoCommitTest.testSoftAndHardCommitMaxTimeDelete-seed#[DE48CF2A7A909FEE]) [ x:collection1] o.a.s.c.SolrResourceLoader using system property solr.solr.home: /export/home/jenkins/workspace/Lucene-Solr-6.x-Solaris/solr/core/src/test-files/solr
    [junit4] 2> 17655 INFO (TEST-SoftAutoCommitTest.testSoftAndHardCommitMaxTimeDelete-seed#[DE48CF2A7A909FEE]) [ x:collection1] o.a.s.c.SolrResourceLoader Adding 'file:/export/home/jenkins/workspace/Lucene-Solr-6.x-Solaris/solr/core/src/test-files/solr/collection1/lib/classes/' to classloader
    [junit4] 2> 17655 INFO (TEST-SoftAutoCommitTest.testSoftAndHardCommitMaxTimeDelete-seed#[DE48CF2A7A909FEE]) [ x:collection1] o.a.s.c.SolrResourceLoader Adding 'file:/export/home/jenkins/workspace/Lucene-Solr-6.x-Solaris/solr/core/src/test-files/solr/collection1/lib/README' to classloader
    [junit4] 2> 17697 INFO (TEST-SoftAutoCommitTest.testSoftAndHardCommitMaxTimeDelete-seed#[DE48CF2A7A909FEE]) [ x:collection1] o.a.s.c.SolrConfig current version of requestparams : -1
    [junit4] 2> 17708 INFO (TEST-SoftAutoCommitTest.testSoftAndHardCommitMaxTimeDelete-seed#[DE48CF2A7A909FEE]) [ x:collection1] o.a.s.c.SolrConfig Using Lucene MatchVersion: 6.2.0
    [junit4] 2> 17745 INFO (TEST-SoftAutoCommitTest.testSoftAndHardCommitMaxTimeDelete-seed#[DE48CF2A7A909FEE]) [ x:collection1] o.a.s.c.SolrConfig Loaded SolrConfig: solrconfig.xml
    [junit4] 2> 17758 INFO (TEST-SoftAutoCommitTest.testSoftAndHardCommitMaxTimeDelete-seed#[DE48CF2A7A909FEE]) [ x:collection1] o.a.s.s.IndexSchema [collection1] Schema name=test
    [junit4] 2> 17910 INFO (TEST-SoftAutoCommitTest.testSoftAndHardCommitMaxTimeDelete-seed#[DE48CF2A7A909FEE]) [ x:collection1] o.a.s.s.OpenExchangeRatesOrgProvider Initialized with rates=open-exchange-rates.json, refreshInterval=1440.
    [junit4] 2> 17917 INFO (TEST-SoftAutoCommitTest.testSoftAndHardCommitMaxTimeDelete-seed#[DE48CF2A7A909FEE]) [ x:collection1] o.a.s.s.IndexSchema default search field in schema is text
    [junit4] 2> 17918 INFO (TEST-SoftAutoCommitTest.testSoftAndHardCommitMaxTimeDelete-seed#[DE48CF2A7A909FEE]) [ x:collection1] o.a.s.s.IndexSchema unique key field: id
    [junit4] 2> 17972 INFO (TEST-SoftAutoCommitTest.testSoftAndHardCommitMaxTimeDelete-seed#[DE48CF2A7A909FEE]) [ x:collection1] o.a.s.s.FileExchangeRateProvider Reloading exchange rates from file currency.xml
    [junit4] 2> 17974 INFO (TEST-SoftAutoCommitTest.testSoftAndHardCommitMaxTimeDelete-seed#[DE48CF2A7A909FEE]) [ x:collection1] o.a.s.s.FileExchangeRateProvider Reloading exchange rates from file currency.xml
    [junit4] 2> 17976 INFO (TEST-SoftAutoCommitTest.testSoftAndHardCommitMaxTimeDelete-seed#[DE48CF2A7A909FEE]) [ x:collection1] o.a.s.s.OpenExchangeRatesOrgProvider Reloading exchange rates from open-exchange-rates.json
    [junit4] 2> 17977 INFO (TEST-SoftAutoCommitTest.testSoftAndHardCommitMaxTimeDelete-seed#[DE48CF2A7A909FEE]) [ x:collection1] o.a.s.s.OpenExchangeRatesOrgProvider Reloading exchange rates from open-exchange-rates.json
    [junit4] 2> 17978 INFO (TEST-SoftAutoCommitTest.testSoftAndHardCommitMaxTimeDelete-seed#[DE48CF2A7A909FEE]) [ x:collection1] o.a.s.c.ConfigSetProperties Did not find ConfigSet properties, assuming default properties: Can't find resource 'configsetprops.json' in classpath or '/export/home/jenkins/workspace/Lucene-Solr-6.x-Solaris/solr/core/src/test-files/solr/collection1'
    [junit4] 2> 17979 INFO (TEST-SoftAutoCommitTest.testSoftAndHardCommitMaxTimeDelete-seed#[DE48CF2A7A909FEE]) [ x:collection1] o.a.s.c.CoreContainer Reloading SolrCore 'collection1' using configuration from instancedir /export/home/jenkins/workspace/Lucene-Solr-6.x-Solaris/solr/core/src/test-files/solr/collection1
    [junit4] 2> 17979 INFO (TEST-SoftAutoCommitTest.testSoftAndHardCommitMaxTimeDelete-seed#[DE48CF2A7A909FEE]) [ x:collection1] o.a.s.c.SolrCore [[collection1] ] Opening new SolrCore at [/export/home/jenkins/workspace/Lucene-Solr-6.x-Solaris/solr/core/src/test-files/solr/collection1], dataDir=[/export/home/jenkins/workspace/Lucene-Solr-6.x-Solaris/solr/build/solr-core/test/J0/temp/solr.update.SoftAutoCommitTest_DE48CF2A7A909FEE-001/init-core-data-001/]
    [junit4] 2> 17979 INFO (TEST-SoftAutoCommitTest.testSoftAndHardCommitMaxTimeDelete-seed#[DE48CF2A7A909FEE]) [ x:collection1] o.a.s.c.JmxMonitoredMap No JMX servers found, not exposing Solr information with JMX.
    [junit4] 2> 17979 INFO (TEST-SoftAutoCommitTest.testSoftAndHardCommitMaxTimeDelete-seed#[DE48CF2A7A909FEE]) [ x:collection1] o.a.s.c.SolrCore New index directory detected: old=null new=/export/home/jenkins/workspace/Lucene-Solr-6.x-Solaris/solr/build/solr-core/test/J0/temp/solr.update.SoftAutoCommitTest_DE48CF2A7A909FEE-001/init-core-data-001/index/
    [junit4] 2> 17980 INFO (OldIndexDirectoryCleanupThreadForCore-collection1) [ x:collection1] o.a.s.c.SolrCore Looking for old index directories to cleanup for core collection1 in /export/home/jenkins/workspace/Lucene-Solr-6.x-Solaris/solr/build/solr-core/test/J0/temp/solr.update.SoftAutoCommitTest_DE48CF2A7A909FEE-001/init-core-data-001/
    [junit4] 2> 17983 INFO (TEST-SoftAutoCommitTest.testSoftAndHardCommitMaxTimeDelete-seed#[DE48CF2A7A909FEE]) [ x:collection1] o.a.s.u.p.UpdateRequestProcessorChain creating updateRequestProcessorChain "dedupe"
    [junit4] 2> 17983 INFO (TEST-SoftAutoCommitTest.testSoftAndHardCommitMaxTimeDelete-seed#[DE48CF2A7A909FEE]) [ x:collection1] o.a.s.u.p.UpdateRequestProcessorChain inserting DistributedUpdateProcessorFactory into updateRequestProcessorChain "dedupe"
    [junit4] 2> 17983 INFO (TEST-SoftAutoCommitTest.testSoftAndHardCommitMaxTimeDelete-seed#[DE48CF2A7A909FEE]) [ x:collection1] o.a.s.u.p.UpdateRequestProcessorChain creating updateRequestProcessorChain "dedupe-allfields"
    [junit4] 2> 17983 INFO (TEST-SoftAutoCommitTest.testSoftAndHardCommitMaxTimeDelete-seed#[DE48CF2A7A909FEE]) [ x:collection1] o.a.s.u.p.UpdateRequestProcessorChain inserting DistributedUpdateProcessorFactory into updateRequestProcessorChain "dedupe-allfields"
    [junit4] 2> 17983 INFO (TEST-SoftAutoCommitTest.testSoftAndHardCommitMaxTimeDelete-seed#[DE48CF2A7A909FEE]) [ x:collection1] o.a.s.u.p.UpdateRequestProcessorChain creating updateRequestProcessorChain "stored_sig"
    [junit4] 2> 17983 INFO (TEST-SoftAutoCommitTest.testSoftAndHardCommitMaxTimeDelete-seed#[DE48CF2A7A909FEE]) [ x:collection1] o.a.s.u.p.UpdateRequestProcessorChain inserting DistributedUpdateProcessorFactory into updateRequestProcessorChain "stored_sig"
    [junit4] 2> 17983 INFO (TEST-SoftAutoCommitTest.testSoftAndHardCommitMaxTimeDelete-seed#[DE48CF2A7A909FEE]) [ x:collection1] o.a.s.u.p.UpdateRequestProcessorChain creating updateRequestProcessorChain "uniq-fields"
    [junit4] 2> 17984 INFO (TEST-SoftAutoCommitTest.testSoftAndHardCommitMaxTimeDelete-seed#[DE48CF2A7A909FEE]) [ x:collection1] o.a.s.u.p.UpdateRequestProcessorChain inserting DistributedUpdateProcessorFactory into updateRequestProcessorChain "uniq-fields"
    [junit4] 2> 17984 INFO (TEST-SoftAutoCommitTest.testSoftAndHardCommitMaxTimeDelete-seed#[DE48CF2A7A909FEE]) [ x:collection1] o.a.s.u.p.UpdateRequestProcessorChain creating updateRequestProcessorChain "distrib-dup-test-chain-explicit"
    [junit4] 2> 17985 INFO (TEST-SoftAutoCommitTest.testSoftAndHardCommitMaxTimeDelete-seed#[DE48CF2A7A909FEE]) [ x:collection1] o.a.s.u.p.UpdateRequestProcessorChain creating updateRequestProcessorChain "distrib-dup-test-chain-implicit"
    [junit4] 2> 17985 INFO (TEST-SoftAutoCommitTest.testSoftAndHardCommitMaxTimeDelete-seed#[DE48CF2A7A909FEE]) [ x:collection1] o.a.s.u.p.UpdateRequestProcessorChain inserting DistributedUpdateProcessorFactory into updateRequestProcessorChain "distrib-dup-test-chain-implicit"
    [junit4] 2> 17985 INFO (TEST-SoftAutoCommitTest.testSoftAndHardCommitMaxTimeDelete-seed#[DE48CF2A7A909FEE]) [ x:collection1] o.a.s.c.SolrCore no updateRequestProcessorChain defined as default, creating implicit default
    [junit4] 2> 17987 INFO (TEST-SoftAutoCommitTest.testSoftAndHardCommitMaxTimeDelete-seed#[DE48CF2A7A909FEE]) [ x:collection1] o.a.s.h.l.XMLLoader xsltCacheLifetimeSeconds=60
    [junit4] 2> 17988 INFO (TEST-SoftAutoCommitTest.testSoftAndHardCommitMaxTimeDelete-seed#[DE48CF2A7A909FEE]) [ x:collection1] o.a.s.h.l.XMLLoader xsltCacheLifetimeSeconds=60
    [junit4] 2> 17989 INFO (TEST-SoftAutoCommitTest.testSoftAndHardCommitMaxTimeDelete-seed#[DE48CF2A7A909FEE]) [ x:collection1] o.a.s.h.l.XMLLoader xsltCacheLifetimeSeconds=60
    [junit4] 2> 17990 INFO (TEST-SoftAutoCommitTest.testSoftAndHardCommitMaxTimeDelete-seed#[DE48CF2A7A909FEE]) [ x:collection1] o.a.s.h.l.XMLLoader xsltCacheLifetimeSeconds=60
    [junit4] 2> 17992 INFO (TEST-SoftAutoCommitTest.testSoftAndHardCommitMaxTimeDelete-seed#[DE48CF2A7A909FEE]) [ x:collection1] o.a.s.c.PluginBag requestHandler : 'lazy' created with startup=lazy
    [junit4] 2> 17993 INFO (TEST-SoftAutoCommitTest.testSoftAndHardCommitMaxTimeDelete-seed#[DE48CF2A7A909FEE]) [ x:collection1] o.a.s.c.RequestHandlers Registered paths: /admin/mbeans,standard,spellCheckCompRH,lazy,/update/json/docs,/admin/luke,/export,spellCheckWithWordbreak_Direct,tvrh,/get,/admin/properties,/update/json,mltrh,/admin/threads,/search-facet-def,/update/csv,/sql,/graph,/search-facet-invariants,/admin/segments,spellCheckCompRH1,/mlt,/admin/system,/replication,dismax,defaults,/config,/stream,/schema,/admin/plugins,/admin/logging,spellCheckWithWordbreak,mock,/admin/ping,/update,/admin/file,/terms,spellCheckCompRH_Direct,/debug/dump
    [junit4] 2> 17993 INFO (TEST-SoftAutoCommitTest.testSoftAndHardCommitMaxTimeDelete-seed#[DE48CF2A7A909FEE]) [ x:collection1] o.a.s.c.SolrCore Using default statsCache cache: org.apache.solr.search.stats.LocalStatsCache
    [junit4] 2> 17994 INFO (TEST-SoftAutoCommitTest.testSoftAndHardCommitMaxTimeDelete-seed#[DE48CF2A7A909FEE]) [ x:collection1] o.a.s.u.CommitTracker Hard AutoCommit: disabled
    [junit4] 2> 17994 INFO (TEST-SoftAutoCommitTest.testSoftAndHardCommitMaxTimeDelete-seed#[DE48CF2A7A909FEE]) [ x:collection1] o.a.s.u.CommitTracker Soft AutoCommit: disabled
    [junit4] 2> 17994 INFO (TEST-SoftAutoCommitTest.testSoftAndHardCommitMaxTimeDelete-seed#[DE48CF2A7A909FEE]) [ x:collection1] o.a.s.s.SolrIndexSearcher Opening [Searcher@3131b0d7[collection1] main]
    [junit4] 2> 17998 INFO (TEST-SoftAutoCommitTest.testSoftAndHardCommitMaxTimeDelete-seed#[DE48CF2A7A909FEE]) [ x:collection1] o.a.s.r.RestManager Initializing RestManager with initArgs: {storageIO=org.apache.solr.rest.ManagedResourceStorage$InMemoryStorageIO}
    [junit4] 2> 17998 INFO (TEST-SoftAutoCommitTest.testSoftAndHardCommitMaxTimeDelete-seed#[DE48CF2A7A909FEE]) [ x:collection1] o.a.s.r.ManagedResourceStorage Reading _rest_managed.json using InMemoryStorage
    [junit4] 2> 17998 INFO (TEST-SoftAutoCommitTest.testSoftAndHardCommitMaxTimeDelete-seed#[DE48CF2A7A909FEE]) [ x:collection1] o.a.s.r.RestManager Initializing 0 registered ManagedResources
    [junit4] 2> 17998 INFO (TEST-SoftAutoCommitTest.testSoftAndHardCommitMaxTimeDelete-seed#[DE48CF2A7A909FEE]) [ x:collection1] o.a.s.h.c.SpellCheckComponent Initializing spell checkers
    [junit4] 2> 18000 INFO (TEST-SoftAutoCommitTest.testSoftAndHardCommitMaxTimeDelete-seed#[DE48CF2A7A909FEE]) [ x:collection1] o.a.s.s.DirectSolrSpellChecker init: {name=direct,classname=DirectSolrSpellChecker,field=lowerfilt,minQueryLength=3}
    [junit4] 2> 18008 INFO (TEST-SoftAutoCommitTest.testSoftAndHardCommitMaxTimeDelete-seed#[DE48CF2A7A909FEE]) [ x:collection1] o.a.s.h.ReplicationHandler Commits will be reserved for 10000
    [junit4] 2> 18009 INFO (TEST-SoftAutoCommitTest.testSoftAndHardCommitMaxTimeDelete-seed#[DE48CF2A7A909FEE]) [ x:collection1] o.a.s.u.UpdateLog Looking up max value of version field to seed version buckets
    [junit4] 2> 18009 INFO (searcherExecutor-32-thread-1-processing-x:collection1) [ x:collection1] o.a.s.h.c.SpellCheckComponent Loading spell index for spellchecker: default
    [junit4] 2> 18009 INFO (TEST-SoftAutoCommitTest.testSoftAndHardCommitMaxTimeDelete-seed#[DE48CF2A7A909FEE]) [ x:collection1] o.a.s.u.VersionInfo Refreshing highest value of _version_ for 65536 version buckets from index
    [junit4] 2> 18010 INFO (searcherExecutor-32-thread-1-processing-x:collection1) [ x:collection1] o.a.s.h.c.SpellCheckComponent Loading spell index for spellchecker: direct
    [junit4] 2> 18010 INFO (searcherExecutor-32-thread-1-processing-x:collection1) [ x:collection1] o.a.s.h.c.SpellCheckComponent Loading spell index for spellchecker: wordbreak
    [junit4] 2> 18010 INFO (searcherExecutor-32-thread-1-processing-x:collection1) [ x:collection1] o.a.s.h.c.SpellCheckComponent Loading spell index for spellchecker: multipleFields
    [junit4] 2> 18012 INFO (searcherExecutor-32-thread-1-processing-x:collection1) [ x:collection1] o.a.s.h.c.SpellCheckComponent Loading spell index for spellchecker: jarowinkler
    [junit4] 2> 18013 INFO (searcherExecutor-32-thread-1-processing-x:collection1) [ x:collection1] o.a.s.h.c.SpellCheckComponent Loading spell index for spellchecker: external
    [junit4] 2> 18014 INFO (searcherExecutor-32-thread-1-processing-x:collection1) [ x:collection1] o.a.s.h.c.SpellCheckComponent Loading spell index for spellchecker: freq
    [junit4] 2> 18015 INFO (searcherExecutor-32-thread-1-processing-x:collection1) [ x:collection1] o.a.s.h.c.SpellCheckComponent Loading spell index for spellchecker: fqcn
    [junit4] 2> 18017 INFO (searcherExecutor-32-thread-1-processing-x:collection1) [ x:collection1] o.a.s.h.c.SpellCheckComponent Loading spell index for spellchecker: perDict
    [junit4] 2> 18017 INFO (searcherExecutor-32-thread-1-processing-x:collection1) [ x:collection1] o.a.s.c.SolrCore [collection1] Registered new searcher Searcher@3131b0d7[collection1] main{ExitableDirectoryReader(UninvertingDirectoryReader(Uninverting(_0(6.2.0):C5) Uninverting(_1(6.2.0):C1) Uninverting(_2(6.2.0):C1)))}
    [junit4] 2> 18021 INFO (TEST-SoftAutoCommitTest.testSoftAndHardCommitMaxTimeDelete-seed#[DE48CF2A7A909FEE]) [ x:collection1] o.a.s.u.VersionInfo Found MAX value 1537377064214069248 from Terms for _version_ in index
    [junit4] 2> 18022 INFO (TEST-SoftAutoCommitTest.testSoftAndHardCommitMaxTimeDelete-seed#[DE48CF2A7A909FEE]) [ x:collection1] o.a.s.u.UpdateLog Took 12.0ms to seed version buckets with highest version 1537377064214069248
    [junit4] 2> 18022 INFO (TEST-SoftAutoCommitTest.testSoftAndHardCommitMaxTimeDelete-seed#[DE48CF2A7A909FEE]) [ x:collection1] o.a.s.u.DefaultSolrCoreState Closing old IndexWriter... core=collection1
    [junit4] 2> 18023 INFO (TEST-SoftAutoCommitTest.testSoftAndHardCommitMaxTimeDelete-seed#[DE48CF2A7A909FEE]) [ x:collection1] o.a.s.u.RandomMergePolicy RandomMergePolicy wrapping class org.apache.lucene.index.LogDocMergePolicy: [LogDocMergePolicy: minMergeSize=1000, mergeFactor=14, maxMergeSize=9223372036854775807, maxMergeSizeForForcedMerge=9223372036854775807, calibrateSizeByDeletes=true, maxMergeDocs=2147483647, maxCFSSegmentSizeMB=8.796093022207999E12, noCFSRatio=0.7142121425201526]
    [junit4] 2> 18035 INFO (TEST-SoftAutoCommitTest.testSoftAndHardCommitMaxTimeDelete-seed#[DE48CF2A7A909FEE]) [ x:collection1] o.a.s.c.SolrDeletionPolicy SolrDeletionPolicy.onInit: commits: num=1
    [junit4] 2> commit{dir=MockDirectoryWrapper(RAMDirectory@7fedd27d lockFactory=org.apache.lucene.store.SingleInstanceLockFactory@76b750e9),segFN=segments_3,generation=3}
    [junit4] 2> 18035 INFO (TEST-SoftAutoCommitTest.testSoftAndHardCommitMaxTimeDelete-seed#[DE48CF2A7A909FEE]) [ x:collection1] o.a.s.c.SolrDeletionPolicy newest commit generation = 3
    [junit4] 2> 18045 INFO (TEST-SoftAutoCommitTest.testSoftAndHardCommitMaxTimeDelete-seed#[DE48CF2A7A909FEE]) [ x:collection1] o.a.s.u.DefaultSolrCoreState New IndexWriter is ready to be used.
    [junit4] 2> 18049 INFO (TEST-SoftAutoCommitTest.testSoftAndHardCommitMaxTimeDelete-seed#[DE48CF2A7A909FEE]) [ x:collection1] o.a.s.s.SolrIndexSearcher Opening [Searcher@52474934[collection1] main]
    [junit4] 2> 18050 INFO (TEST-SoftAutoCommit

[...truncated too long message...]

itTest.testSoftAndHardCommitMaxTimeDelete-seed#[DE48CF2A7A909FEE]) [ x:collection1] o.a.s.u.p.LogUpdateProcessorFactory [collection1] webapp=null path=null params={}{delete=[529 (-1537377068741820416)]} 0 1
    [junit4] 2> 18601 INFO (commitScheduler-35-thread-1) [ x:collection1] o.a.s.u.DirectUpdateHandler2 start commit{,optimize=false,openSearcher=true,waitSearcher=true,expungeDeletes=false,softCommit=true,prepareCommit=false}
    [junit4] 2> 18606 INFO (commitScheduler-35-thread-1) [ x:collection1] o.a.s.s.SolrIndexSearcher Opening [Searcher@22a11699[collection1] main]
    [junit4] 2> 18607 INFO (commitScheduler-35-thread-1) [ x:collection1] o.a.s.u.DirectUpdateHandler2 end_commit_flush
    [junit4] 2> 18608 INFO (searcherExecutor-32-thread-1-processing-x:collection1) [ x:collection1] o.a.s.c.SolrCore [collection1] Registered new searcher Searcher@22a11699[collection1] main{ExitableDirectoryReader(UninvertingDirectoryReader(Uninverting(_0(6.2.0):C5) Uninverting(_2(6.2.0):C1)))}
    [junit4] 2> 18612 INFO (TEST-SoftAutoCommitTest.testSoftAndHardCommitMaxTimeDelete-seed#[DE48CF2A7A909FEE]) [ x:collection1] o.a.s.u.p.LogUpdateProcessorFactory [collection1] webapp=null path=null params={}{add=[550 (1537377069279739904)]} 0 3
    [junit4] 2> 19116 INFO (commitScheduler-35-thread-1) [ x:collection1] o.a.s.u.DirectUpdateHandler2 start commit{,optimize=false,openSearcher=true,waitSearcher=true,expungeDeletes=false,softCommit=true,prepareCommit=false}
    [junit4] 2> 19124 INFO (commitScheduler-35-thread-1) [ x:collection1] o.a.s.s.SolrIndexSearcher Opening [Searcher@34b37bc4[collection1] main]
    [junit4] 2> 19124 INFO (commitScheduler-35-thread-1) [ x:collection1] o.a.s.u.DirectUpdateHandler2 end_commit_flush
    [junit4] 2> 19125 INFO (searcherExecutor-32-thread-1-processing-x:collection1) [ x:collection1] o.a.s.c.SolrCore [collection1] Registered new searcher Searcher@34b37bc4[collection1] main{ExitableDirectoryReader(UninvertingDirectoryReader(Uninverting(_0(6.2.0):C5) Uninverting(_2(6.2.0):C1) Uninverting(_4(6.2.0):C1)))}
    [junit4] 2> 19297 INFO (commitScheduler-34-thread-1) [ x:collection1] o.a.s.u.DirectUpdateHandler2 start commit{,optimize=false,openSearcher=true,waitSearcher=true,expungeDeletes=false,softCommit=false,prepareCommit=false}
    [junit4] 2> 19300 INFO (commitScheduler-34-thread-1) [ x:collection1] o.a.s.c.SolrDeletionPolicy SolrDeletionPolicy.onCommit: commits: num=2
    [junit4] 2> commit{dir=MockDirectoryWrapper(RAMDirectory@7fedd27d lockFactory=org.apache.lucene.store.SingleInstanceLockFactory@76b750e9),segFN=segments_4,generation=4}
    [junit4] 2> commit{dir=MockDirectoryWrapper(RAMDirectory@7fedd27d lockFactory=org.apache.lucene.store.SingleInstanceLockFactory@76b750e9),segFN=segments_5,generation=5}
    [junit4] 2> 19300 INFO (commitScheduler-34-thread-1) [ x:collection1] o.a.s.c.SolrDeletionPolicy newest commit generation = 5
    [junit4] 2> 19302 INFO (commitScheduler-34-thread-1) [ x:collection1] o.a.s.s.SolrIndexSearcher Opening [Searcher@272fc46c[collection1] main]
    [junit4] 2> 19303 INFO (commitScheduler-34-thread-1) [ x:collection1] o.a.s.u.DirectUpdateHandler2 end_commit_flush
    [junit4] 2> 19304 INFO (searcherExecutor-32-thread-1-processing-x:collection1) [ x:collection1] o.a.s.c.SolrCore [collection1] Registered new searcher Searcher@272fc46c[collection1] main{ExitableDirectoryReader(UninvertingDirectoryReader(Uninverting(_0(6.2.0):C5) Uninverting(_2(6.2.0):C1) Uninverting(_4(6.2.0):C1)))}
    [junit4] 2> 21307 INFO (TEST-SoftAutoCommitTest.testSoftAndHardCommitMaxTimeDelete-seed#[DE48CF2A7A909FEE]) [ x:collection1] o.a.s.SolrTestCaseJ4 ###Ending testSoftAndHardCommitMaxTimeDelete
    [junit4] 2> 21309 INFO (SUITE-SoftAutoCommitTest-seed#[DE48CF2A7A909FEE]-worker) [ x:collection1] o.a.s.SolrTestCaseJ4 ###deleteCore
    [junit4] 2> 21309 INFO (SUITE-SoftAutoCommitTest-seed#[DE48CF2A7A909FEE]-worker) [ x:collection1] o.a.s.c.CoreContainer Shutting down CoreContainer instance=536417340
    [junit4] 2> 21311 INFO (coreCloseExecutor-36-thread-1-processing-x:collection1) [ x:collection1] o.a.s.c.SolrCore [collection1] CLOSING SolrCore org.apache.solr.core.SolrCore@3153997e
    [junit4] 2> 21311 INFO (coreCloseExecutor-36-thread-1-processing-x:collection1) [ x:collection1] o.a.s.u.DirectUpdateHandler2 closing DirectUpdateHandler2{commits=4,autocommit maxTime=1200ms,autocommits=1,soft autocommit maxTime=500ms,soft autocommits=2,optimizes=0,rollbacks=0,expungeDeletes=0,docsPending=0,adds=0,deletesById=0,deletesByQuery=0,errors=0,cumulative_adds=2,cumulative_deletesById=1,cumulative_deletesByQuery=0,cumulative_errors=0,transaction_logs_total_size=838,transaction_logs_total_number=4}
    [junit4] 2> 21311 INFO (coreCloseExecutor-36-thread-1-processing-x:collection1) [ x:collection1] o.a.s.u.SolrCoreState Closing SolrCoreState
    [junit4] 2> 21311 INFO (coreCloseExecutor-36-thread-1-processing-x:collection1) [ x:collection1] o.a.s.u.DefaultSolrCoreState SolrCoreState ref count has reached 0 - closing IndexWriter
    [junit4] 2> 21312 INFO (coreCloseExecutor-36-thread-1-processing-x:collection1) [ x:collection1] o.a.s.u.DefaultSolrCoreState closing IndexWriter with IndexWriterCloser
    [junit4] 2> 21315 INFO (coreCloseExecutor-36-thread-1-processing-x:collection1) [ x:collection1] o.a.s.c.SolrCore [collection1] Closing main searcher on request.
    [junit4] 2> 21318 INFO (coreCloseExecutor-36-thread-1-processing-x:collection1) [ x:collection1] o.a.s.c.CachingDirectoryFactory Closing MockDirectoryFactory - 2 directories currently being tracked
    [junit4] 2> 21318 INFO (coreCloseExecutor-36-thread-1-processing-x:collection1) [ x:collection1] o.a.s.c.CachingDirectoryFactory looking to close /export/home/jenkins/workspace/Lucene-Solr-6.x-Solaris/solr/build/solr-core/test/J0/temp/solr.update.SoftAutoCommitTest_DE48CF2A7A909FEE-001/init-core-data-001 [CachedDir<<refCount=0;path=/export/home/jenkins/workspace/Lucene-Solr-6.x-Solaris/solr/build/solr-core/test/J0/temp/solr.update.SoftAutoCommitTest_DE48CF2A7A909FEE-001/init-core-data-001;done=false>>]
    [junit4] 2> 21318 INFO (coreCloseExecutor-36-thread-1-processing-x:collection1) [ x:collection1] o.a.s.c.CachingDirectoryFactory Closing directory, CoreContainer#isShutdown=true
    [junit4] 2> 21318 INFO (coreCloseExecutor-36-thread-1-processing-x:collection1) [ x:collection1] o.a.s.c.CachingDirectoryFactory Closing directory: /export/home/jenkins/workspace/Lucene-Solr-6.x-Solaris/solr/build/solr-core/test/J0/temp/solr.update.SoftAutoCommitTest_DE48CF2A7A909FEE-001/init-core-data-001
    [junit4] 2> 21318 INFO (coreCloseExecutor-36-thread-1-processing-x:collection1) [ x:collection1] o.a.s.c.CachingDirectoryFactory looking to close /export/home/jenkins/workspace/Lucene-Solr-6.x-Solaris/solr/build/solr-core/test/J0/temp/solr.update.SoftAutoCommitTest_DE48CF2A7A909FEE-001/init-core-data-001/index [CachedDir<<refCount=0;path=/export/home/jenkins/workspace/Lucene-Solr-6.x-Solaris/solr/build/solr-core/test/J0/temp/solr.update.SoftAutoCommitTest_DE48CF2A7A909FEE-001/init-core-data-001/index;done=false>>]
    [junit4] 2> 21319 INFO (coreCloseExecutor-36-thread-1-processing-x:collection1) [ x:collection1] o.a.s.c.CachingDirectoryFactory Closing directory, CoreContainer#isShutdown=true
    [junit4] 2> 21319 INFO (coreCloseExecutor-36-thread-1-processing-x:collection1) [ x:collection1] o.a.s.c.CachingDirectoryFactory Closing directory: /export/home/jenkins/workspace/Lucene-Solr-6.x-Solaris/solr/build/solr-core/test/J0/temp/solr.update.SoftAutoCommitTest_DE48CF2A7A909FEE-001/init-core-data-001/index
    [junit4] 2> NOTE: leaving temporary files on disk at: /export/home/jenkins/workspace/Lucene-Solr-6.x-Solaris/solr/build/solr-core/test/J0/temp/solr.update.SoftAutoCommitTest_DE48CF2A7A909FEE-001
    [junit4] 2> NOTE: test params are: codec=HighCompressionCompressingStoredFields(storedFieldsFormat=CompressingStoredFieldsFormat(compressionMode=HIGH_COMPRESSION, chunkSize=26516, maxDocsPerChunk=5, blockSize=9), termVectorsFormat=CompressingTermVectorsFormat(compressionMode=HIGH_COMPRESSION, chunkSize=26516, blockSize=9)), sim=ClassicSimilarity, locale=sr-Latn, timezone=America/Argentina/Catamarca
    [junit4] 2> NOTE: SunOS 5.11 amd64/Oracle Corporation 1.8.0_92 (64-bit)/cpus=3,threads=1,free=35724528,total=64880640
    [junit4] 2> NOTE: All tests run in this JVM: [TestLMDirichletSimilarityFactory, SoftAutoCommitTest]
    [junit4] Completed [2/615 (1!)] on J0 in 16.39s, 3 tests, 1 failure <<< FAILURES!

[...truncated 1983 lines...]
BUILD FAILED
/export/home/jenkins/workspace/Lucene-Solr-6.x-Solaris/build.xml:740: The following error occurred while executing this line:
/export/home/jenkins/workspace/Lucene-Solr-6.x-Solaris/build.xml:684: The following error occurred while executing this line:
/export/home/jenkins/workspace/Lucene-Solr-6.x-Solaris/build.xml:59: The following error occurred while executing this line:
/export/home/jenkins/workspace/Lucene-Solr-6.x-Solaris/solr/build.xml:233: The following error occurred while executing this line:
/export/home/jenkins/workspace/Lucene-Solr-6.x-Solaris/solr/common-build.xml:531: The following error occurred while executing this line:
/export/home/jenkins/workspace/Lucene-Solr-6.x-Solaris/lucene/common-build.xml:1427: The following error occurred while executing this line:
/export/home/jenkins/workspace/Lucene-Solr-6.x-Solaris/lucene/common-build.xml:984: There were test failures: 615 suites (10 ignored), 2591 tests, 1 failure, 88 ignored (73 assumptions) [seed: DE48CF2A7A909FEE]

Total time: 84 minutes 1 second
Build step 'Invoke Ant' marked build as failure
Archiving artifacts
[WARNINGS] Skipping publisher since build result is FAILURE
Recording test results
Email was triggered for: Failure - Any
Sending email for trigger: Failure - Any

Search Discussions

Related Discussions

Discussion Navigation
viewthread | post
posts ‹ prev | 1 of 1 | next ›
Discussion Overview
groupdev @
categorieslucene
postedJun 17, '16 at 10:52a
activeJun 17, '16 at 10:52a
posts1
users1
websitelucene.apache.org

1 user in discussion

Policeman Jenkins Server: 1 post

People

Translate

site design / logo © 2017 Grokbase