Grokbase Groups Lucene dev June 2016
FAQ
Build: http://jenkins.thetaphi.de/job/Lucene-Solr-master-MacOSX/3344/
Java: 64bit/jdk1.8.0 -XX:-UseCompressedOops -XX:+UseParallelGC

1 tests failed.
FAILED: org.apache.solr.cloud.LeaderFailoverAfterPartitionTest.test

Error Message:
Expected 2 of 3 replicas to be active but only found 1; [core_node3:{"core":"c8n_1x3_lf_shard1_replica1","base_url":"http://127.0.0.1:63397","node_name":"127.0.0.1:63397_","state":"active","leader":"true"}]; clusterState: DocCollection(c8n_1x3_lf)={ "replicationFactor":"3", "shards":{"shard1":{ "range":"80000000-7fffffff", "state":"active", "replicas":{ "core_node1":{ "core":"c8n_1x3_lf_shard1_replica3", "base_url":"http://127.0.0.1:63375", "node_name":"127.0.0.1:63375_", "state":"down"}, "core_node2":{ "state":"down", "base_url":"http://127.0.0.1:63391", "core":"c8n_1x3_lf_shard1_replica2", "node_name":"127.0.0.1:63391_"}, "core_node3":{ "core":"c8n_1x3_lf_shard1_replica1", "base_url":"http://127.0.0.1:63397", "node_name":"127.0.0.1:63397_", "state":"active", "leader":"true"}}}}, "router":{"name":"compositeId"}, "maxShardsPerNode":"1", "autoAddReplicas":"false"}

Stack Trace:
java.lang.AssertionError: Expected 2 of 3 replicas to be active but only found 1; [core_node3:{"core":"c8n_1x3_lf_shard1_replica1","base_url":"http://127.0.0.1:63397","node_name":"127.0.0.1:63397_","state":"active","leader":"true"}]; clusterState: DocCollection(c8n_1x3_lf)={
   "replicationFactor":"3",
   "shards":{"shard1":{
       "range":"80000000-7fffffff",
       "state":"active",
       "replicas":{
         "core_node1":{
           "core":"c8n_1x3_lf_shard1_replica3",
           "base_url":"http://127.0.0.1:63375",
           "node_name":"127.0.0.1:63375_",
           "state":"down"},
         "core_node2":{
           "state":"down",
           "base_url":"http://127.0.0.1:63391",
           "core":"c8n_1x3_lf_shard1_replica2",
           "node_name":"127.0.0.1:63391_"},
         "core_node3":{
           "core":"c8n_1x3_lf_shard1_replica1",
           "base_url":"http://127.0.0.1:63397",
           "node_name":"127.0.0.1:63397_",
           "state":"active",
           "leader":"true"}}}},
   "router":{"name":"compositeId"},
   "maxShardsPerNode":"1",
   "autoAddReplicas":"false"}
  at __randomizedtesting.SeedInfo.seed([23EB9BFCF38DAAE:8A6A866561C4B756]:0)
  at org.junit.Assert.fail(Assert.java:93)
  at org.junit.Assert.assertTrue(Assert.java:43)
  at org.apache.solr.cloud.LeaderFailoverAfterPartitionTest.testRf3WithLeaderFailover(LeaderFailoverAfterPartitionTest.java:170)
  at org.apache.solr.cloud.LeaderFailoverAfterPartitionTest.test(LeaderFailoverAfterPartitionTest.java:57)
  at sun.reflect.NativeMethodAccessorImpl.invoke0(Native Method)
  at sun.reflect.NativeMethodAccessorImpl.invoke(NativeMethodAccessorImpl.java:62)
  at sun.reflect.DelegatingMethodAccessorImpl.invoke(DelegatingMethodAccessorImpl.java:43)
  at java.lang.reflect.Method.invoke(Method.java:498)
  at com.carrotsearch.randomizedtesting.RandomizedRunner.invoke(RandomizedRunner.java:1764)
  at com.carrotsearch.randomizedtesting.RandomizedRunner$8.evaluate(RandomizedRunner.java:871)
  at com.carrotsearch.randomizedtesting.RandomizedRunner$9.evaluate(RandomizedRunner.java:907)
  at com.carrotsearch.randomizedtesting.RandomizedRunner$10.evaluate(RandomizedRunner.java:921)
  at org.apache.solr.BaseDistributedSearchTestCase$ShardsRepeatRule$ShardsFixedStatement.callStatement(BaseDistributedSearchTestCase.java:985)
  at org.apache.solr.BaseDistributedSearchTestCase$ShardsRepeatRule$ShardsStatement.evaluate(BaseDistributedSearchTestCase.java:960)
  at com.carrotsearch.randomizedtesting.rules.SystemPropertiesRestoreRule$1.evaluate(SystemPropertiesRestoreRule.java:57)
  at org.apache.lucene.util.TestRuleSetupTeardownChained$1.evaluate(TestRuleSetupTeardownChained.java:49)
  at org.apache.lucene.util.AbstractBeforeAfterRule$1.evaluate(AbstractBeforeAfterRule.java:45)
  at org.apache.lucene.util.TestRuleThreadAndTestName$1.evaluate(TestRuleThreadAndTestName.java:48)
  at org.apache.lucene.util.TestRuleIgnoreAfterMaxFailures$1.evaluate(TestRuleIgnoreAfterMaxFailures.java:64)
  at org.apache.lucene.util.TestRuleMarkFailure$1.evaluate(TestRuleMarkFailure.java:47)
  at com.carrotsearch.randomizedtesting.rules.StatementAdapter.evaluate(StatementAdapter.java:36)
  at com.carrotsearch.randomizedtesting.ThreadLeakControl$StatementRunner.run(ThreadLeakControl.java:367)
  at com.carrotsearch.randomizedtesting.ThreadLeakControl.forkTimeoutingTask(ThreadLeakControl.java:809)
  at com.carrotsearch.randomizedtesting.ThreadLeakControl$3.evaluate(ThreadLeakControl.java:460)
  at com.carrotsearch.randomizedtesting.RandomizedRunner.runSingleTest(RandomizedRunner.java:880)
  at com.carrotsearch.randomizedtesting.RandomizedRunner$5.evaluate(RandomizedRunner.java:781)
  at com.carrotsearch.randomizedtesting.RandomizedRunner$6.evaluate(RandomizedRunner.java:816)
  at com.carrotsearch.randomizedtesting.RandomizedRunner$7.evaluate(RandomizedRunner.java:827)
  at com.carrotsearch.randomizedtesting.rules.StatementAdapter.evaluate(StatementAdapter.java:36)
  at com.carrotsearch.randomizedtesting.rules.SystemPropertiesRestoreRule$1.evaluate(SystemPropertiesRestoreRule.java:57)
  at org.apache.lucene.util.AbstractBeforeAfterRule$1.evaluate(AbstractBeforeAfterRule.java:45)
  at com.carrotsearch.randomizedtesting.rules.StatementAdapter.evaluate(StatementAdapter.java:36)
  at org.apache.lucene.util.TestRuleStoreClassName$1.evaluate(TestRuleStoreClassName.java:41)
  at com.carrotsearch.randomizedtesting.rules.NoShadowingOrOverridesOnMethodsRule$1.evaluate(NoShadowingOrOverridesOnMethodsRule.java:40)
  at com.carrotsearch.randomizedtesting.rules.NoShadowingOrOverridesOnMethodsRule$1.evaluate(NoShadowingOrOverridesOnMethodsRule.java:40)
  at com.carrotsearch.randomizedtesting.rules.StatementAdapter.evaluate(StatementAdapter.java:36)
  at com.carrotsearch.randomizedtesting.rules.StatementAdapter.evaluate(StatementAdapter.java:36)
  at com.carrotsearch.randomizedtesting.rules.StatementAdapter.evaluate(StatementAdapter.java:36)
  at org.apache.lucene.util.TestRuleAssertionsRequired$1.evaluate(TestRuleAssertionsRequired.java:53)
  at org.apache.lucene.util.TestRuleMarkFailure$1.evaluate(TestRuleMarkFailure.java:47)
  at org.apache.lucene.util.TestRuleIgnoreAfterMaxFailures$1.evaluate(TestRuleIgnoreAfterMaxFailures.java:64)
  at org.apache.lucene.util.TestRuleIgnoreTestSuites$1.evaluate(TestRuleIgnoreTestSuites.java:54)
  at com.carrotsearch.randomizedtesting.rules.StatementAdapter.evaluate(StatementAdapter.java:36)
  at com.carrotsearch.randomizedtesting.ThreadLeakControl$StatementRunner.run(ThreadLeakControl.java:367)
  at java.lang.Thread.run(Thread.java:745)




Build Log:
[...truncated 10946 lines...]
    [junit4] Suite: org.apache.solr.cloud.LeaderFailoverAfterPartitionTest
    [junit4] 2> Creating dataDir: /Users/jenkins/workspace/Lucene-Solr-master-MacOSX/solr/build/solr-core/test/J1/temp/solr.cloud.LeaderFailoverAfterPartitionTest_23EB9BFCF38DAAE-001/init-core-data-001
    [junit4] 2> 597867 INFO (SUITE-LeaderFailoverAfterPartitionTest-seed#[23EB9BFCF38DAAE]-worker) [ ] o.a.s.SolrTestCaseJ4 Randomized ssl (false) and clientAuth (false) via: @org.apache.solr.SolrTestCaseJ4$SuppressSSL(bugUrl=https://issues.apache.org/jira/browse/SOLR-5776) w/ MAC_OS_X supressed clientAuth
    [junit4] 2> 597867 INFO (SUITE-LeaderFailoverAfterPartitionTest-seed#[23EB9BFCF38DAAE]-worker) [ ] o.a.s.BaseDistributedSearchTestCase Setting hostContext system property: /
    [junit4] 2> 597871 INFO (TEST-LeaderFailoverAfterPartitionTest.test-seed#[23EB9BFCF38DAAE]) [ ] o.a.s.c.ZkTestServer STARTING ZK TEST SERVER
    [junit4] 2> 597874 INFO (Thread-1277) [ ] o.a.s.c.ZkTestServer client port:0.0.0.0/0.0.0.0:0
    [junit4] 2> 597874 INFO (Thread-1277) [ ] o.a.s.c.ZkTestServer Starting server
    [junit4] 2> 597975 INFO (TEST-LeaderFailoverAfterPartitionTest.test-seed#[23EB9BFCF38DAAE]) [ ] o.a.s.c.ZkTestServer start zk server on port:63362
    [junit4] 2> 597975 INFO (TEST-LeaderFailoverAfterPartitionTest.test-seed#[23EB9BFCF38DAAE]) [ ] o.a.s.c.c.SolrZkClient Using default ZkCredentialsProvider
    [junit4] 2> 597976 INFO (TEST-LeaderFailoverAfterPartitionTest.test-seed#[23EB9BFCF38DAAE]) [ ] o.a.s.c.c.ConnectionManager Waiting for client to connect to ZooKeeper
    [junit4] 2> 597992 INFO (zkCallback-650-thread-1) [ ] o.a.s.c.c.ConnectionManager Watcher org.apache.solr.common.cloud.ConnectionManager@71abd22b name:ZooKeeperConnection Watcher:127.0.0.1:63362 got event WatchedEvent state:SyncConnected type:None path:null path:null type:None
    [junit4] 2> 597992 INFO (TEST-LeaderFailoverAfterPartitionTest.test-seed#[23EB9BFCF38DAAE]) [ ] o.a.s.c.c.ConnectionManager Client is connected to ZooKeeper
    [junit4] 2> 597993 INFO (TEST-LeaderFailoverAfterPartitionTest.test-seed#[23EB9BFCF38DAAE]) [ ] o.a.s.c.c.SolrZkClient Using default ZkACLProvider
    [junit4] 2> 597993 INFO (TEST-LeaderFailoverAfterPartitionTest.test-seed#[23EB9BFCF38DAAE]) [ ] o.a.s.c.c.SolrZkClient makePath: /solr
    [junit4] 2> 597997 INFO (TEST-LeaderFailoverAfterPartitionTest.test-seed#[23EB9BFCF38DAAE]) [ ] o.a.s.c.c.SolrZkClient Using default ZkCredentialsProvider
    [junit4] 2> 597998 INFO (TEST-LeaderFailoverAfterPartitionTest.test-seed#[23EB9BFCF38DAAE]) [ ] o.a.s.c.c.ConnectionManager Waiting for client to connect to ZooKeeper
    [junit4] 2> 598000 INFO (zkCallback-651-thread-1) [ ] o.a.s.c.c.ConnectionManager Watcher org.apache.solr.common.cloud.ConnectionManager@7735a9b1 name:ZooKeeperConnection Watcher:127.0.0.1:63362/solr got event WatchedEvent state:SyncConnected type:None path:null path:null type:None
    [junit4] 2> 598000 INFO (TEST-LeaderFailoverAfterPartitionTest.test-seed#[23EB9BFCF38DAAE]) [ ] o.a.s.c.c.ConnectionManager Client is connected to ZooKeeper
    [junit4] 2> 598000 INFO (TEST-LeaderFailoverAfterPartitionTest.test-seed#[23EB9BFCF38DAAE]) [ ] o.a.s.c.c.SolrZkClient Using default ZkACLProvider
    [junit4] 2> 598000 INFO (TEST-LeaderFailoverAfterPartitionTest.test-seed#[23EB9BFCF38DAAE]) [ ] o.a.s.c.c.SolrZkClient makePath: /collections/collection1
    [junit4] 2> 598004 INFO (TEST-LeaderFailoverAfterPartitionTest.test-seed#[23EB9BFCF38DAAE]) [ ] o.a.s.c.c.SolrZkClient makePath: /collections/collection1/shards
    [junit4] 2> 598007 INFO (TEST-LeaderFailoverAfterPartitionTest.test-seed#[23EB9BFCF38DAAE]) [ ] o.a.s.c.c.SolrZkClient makePath: /collections/control_collection
    [junit4] 2> 598010 INFO (TEST-LeaderFailoverAfterPartitionTest.test-seed#[23EB9BFCF38DAAE]) [ ] o.a.s.c.c.SolrZkClient makePath: /collections/control_collection/shards
    [junit4] 2> 598015 INFO (TEST-LeaderFailoverAfterPartitionTest.test-seed#[23EB9BFCF38DAAE]) [ ] o.a.s.c.AbstractZkTestCase put /Users/jenkins/workspace/Lucene-Solr-master-MacOSX/solr/core/src/test-files/solr/collection1/conf/solrconfig-tlog.xml to /configs/conf1/solrconfig.xml
    [junit4] 2> 598015 INFO (TEST-LeaderFailoverAfterPartitionTest.test-seed#[23EB9BFCF38DAAE]) [ ] o.a.s.c.c.SolrZkClient makePath: /configs/conf1/solrconfig.xml
    [junit4] 2> 598020 INFO (TEST-LeaderFailoverAfterPartitionTest.test-seed#[23EB9BFCF38DAAE]) [ ] o.a.s.c.AbstractZkTestCase put /Users/jenkins/workspace/Lucene-Solr-master-MacOSX/solr/core/src/test-files/solr/collection1/conf/schema.xml to /configs/conf1/schema.xml
    [junit4] 2> 598020 INFO (TEST-LeaderFailoverAfterPartitionTest.test-seed#[23EB9BFCF38DAAE]) [ ] o.a.s.c.c.SolrZkClient makePath: /configs/conf1/schema.xml
    [junit4] 2> 598028 INFO (TEST-LeaderFailoverAfterPartitionTest.test-seed#[23EB9BFCF38DAAE]) [ ] o.a.s.c.AbstractZkTestCase put /Users/jenkins/workspace/Lucene-Solr-master-MacOSX/solr/core/src/test-files/solr/collection1/conf/solrconfig.snippet.randomindexconfig.xml to /configs/conf1/solrconfig.snippet.randomindexconfig.xml
    [junit4] 2> 598028 INFO (TEST-LeaderFailoverAfterPartitionTest.test-seed#[23EB9BFCF38DAAE]) [ ] o.a.s.c.c.SolrZkClient makePath: /configs/conf1/solrconfig.snippet.randomindexconfig.xml
    [junit4] 2> 598032 INFO (TEST-LeaderFailoverAfterPartitionTest.test-seed#[23EB9BFCF38DAAE]) [ ] o.a.s.c.AbstractZkTestCase put /Users/jenkins/workspace/Lucene-Solr-master-MacOSX/solr/core/src/test-files/solr/collection1/conf/stopwords.txt to /configs/conf1/stopwords.txt
    [junit4] 2> 598032 INFO (TEST-LeaderFailoverAfterPartitionTest.test-seed#[23EB9BFCF38DAAE]) [ ] o.a.s.c.c.SolrZkClient makePath: /configs/conf1/stopwords.txt
    [junit4] 2> 598039 INFO (TEST-LeaderFailoverAfterPartitionTest.test-seed#[23EB9BFCF38DAAE]) [ ] o.a.s.c.AbstractZkTestCase put /Users/jenkins/workspace/Lucene-Solr-master-MacOSX/solr/core/src/test-files/solr/collection1/conf/protwords.txt to /configs/conf1/protwords.txt
    [junit4] 2> 598039 INFO (TEST-LeaderFailoverAfterPartitionTest.test-seed#[23EB9BFCF38DAAE]) [ ] o.a.s.c.c.SolrZkClient makePath: /configs/conf1/protwords.txt
    [junit4] 2> 598046 INFO (TEST-LeaderFailoverAfterPartitionTest.test-seed#[23EB9BFCF38DAAE]) [ ] o.a.s.c.AbstractZkTestCase put /Users/jenkins/workspace/Lucene-Solr-master-MacOSX/solr/core/src/test-files/solr/collection1/conf/currency.xml to /configs/conf1/currency.xml
    [junit4] 2> 598046 INFO (TEST-LeaderFailoverAfterPartitionTest.test-seed#[23EB9BFCF38DAAE]) [ ] o.a.s.c.c.SolrZkClient makePath: /configs/conf1/currency.xml
    [junit4] 2> 598050 INFO (TEST-LeaderFailoverAfterPartitionTest.test-seed#[23EB9BFCF38DAAE]) [ ] o.a.s.c.AbstractZkTestCase put /Users/jenkins/workspace/Lucene-Solr-master-MacOSX/solr/core/src/test-files/solr/collection1/conf/enumsConfig.xml to /configs/conf1/enumsConfig.xml
    [junit4] 2> 598050 INFO (TEST-LeaderFailoverAfterPartitionTest.test-seed#[23EB9BFCF38DAAE]) [ ] o.a.s.c.c.SolrZkClient makePath: /configs/conf1/enumsConfig.xml
    [junit4] 2> 598054 INFO (TEST-LeaderFailoverAfterPartitionTest.test-seed#[23EB9BFCF38DAAE]) [ ] o.a.s.c.AbstractZkTestCase put /Users/jenkins/workspace/Lucene-Solr-master-MacOSX/solr/core/src/test-files/solr/collection1/conf/open-exchange-rates.json to /configs/conf1/open-exchange-rates.json
    [junit4] 2> 598054 INFO (TEST-LeaderFailoverAfterPartitionTest.test-seed#[23EB9BFCF38DAAE]) [ ] o.a.s.c.c.SolrZkClient makePath: /configs/conf1/open-exchange-rates.json
    [junit4] 2> 598058 INFO (TEST-LeaderFailoverAfterPartitionTest.test-seed#[23EB9BFCF38DAAE]) [ ] o.a.s.c.AbstractZkTestCase put /Users/jenkins/workspace/Lucene-Solr-master-MacOSX/solr/core/src/test-files/solr/collection1/conf/mapping-ISOLatin1Accent.txt to /configs/conf1/mapping-ISOLatin1Accent.txt
    [junit4] 2> 598058 INFO (TEST-LeaderFailoverAfterPartitionTest.test-seed#[23EB9BFCF38DAAE]) [ ] o.a.s.c.c.SolrZkClient makePath: /configs/conf1/mapping-ISOLatin1Accent.txt
    [junit4] 2> 598062 INFO (TEST-LeaderFailoverAfterPartitionTest.test-seed#[23EB9BFCF38DAAE]) [ ] o.a.s.c.AbstractZkTestCase put /Users/jenkins/workspace/Lucene-Solr-master-MacOSX/solr/core/src/test-files/solr/collection1/conf/old_synonyms.txt to /configs/conf1/old_synonyms.txt
    [junit4] 2> 598062 INFO (TEST-LeaderFailoverAfterPartitionTest.test-seed#[23EB9BFCF38DAAE]) [ ] o.a.s.c.c.SolrZkClient makePath: /configs/conf1/old_synonyms.txt
    [junit4] 2> 598069 INFO (TEST-LeaderFailoverAfterPartitionTest.test-seed#[23EB9BFCF38DAAE]) [ ] o.a.s.c.AbstractZkTestCase put /Users/jenkins/workspace/Lucene-Solr-master-MacOSX/solr/core/src/test-files/solr/collection1/conf/synonyms.txt to /configs/conf1/synonyms.txt
    [junit4] 2> 598069 INFO (TEST-LeaderFailoverAfterPartitionTest.test-seed#[23EB9BFCF38DAAE]) [ ] o.a.s.c.c.SolrZkClient makePath: /configs/conf1/synonyms.txt
    [junit4] 2> 598472 INFO (TEST-LeaderFailoverAfterPartitionTest.test-seed#[23EB9BFCF38DAAE]) [ ] o.a.s.SolrTestCaseJ4 Writing core.properties file to /Users/jenkins/workspace/Lucene-Solr-master-MacOSX/solr/build/solr-core/test/J1/temp/solr.cloud.LeaderFailoverAfterPartitionTest_23EB9BFCF38DAAE-001/control-001/cores/collection1
    [junit4] 2> 598478 INFO (TEST-LeaderFailoverAfterPartitionTest.test-seed#[23EB9BFCF38DAAE]) [ ] o.e.j.s.Server jetty-9.3.8.v20160314
    [junit4] 2> 598480 INFO (TEST-LeaderFailoverAfterPartitionTest.test-seed#[23EB9BFCF38DAAE]) [ ] o.e.j.s.h.ContextHandler Started o.e.j.s.ServletContextHandler@4e322983{/,null,AVAILABLE}
    [junit4] 2> 598482 INFO (TEST-LeaderFailoverAfterPartitionTest.test-seed#[23EB9BFCF38DAAE]) [ ] o.e.j.s.ServerConnector Started ServerConnector@136e45f9{HTTP/1.1,[http/1.1]}{127.0.0.1:63376}
    [junit4] 2> 598482 INFO (TEST-LeaderFailoverAfterPartitionTest.test-seed#[23EB9BFCF38DAAE]) [ ] o.e.j.s.Server Started @606512ms
    [junit4] 2> 598482 INFO (TEST-LeaderFailoverAfterPartitionTest.test-seed#[23EB9BFCF38DAAE]) [ ] o.a.s.c.s.e.JettySolrRunner Jetty properties: {solr.data.dir=/Users/jenkins/workspace/Lucene-Solr-master-MacOSX/solr/build/solr-core/test/J1/temp/solr.cloud.LeaderFailoverAfterPartitionTest_23EB9BFCF38DAAE-001/tempDir-001/control/data, hostContext=/, hostPort=63375, coreRootDirectory=/Users/jenkins/workspace/Lucene-Solr-master-MacOSX/solr/build/solr-core/test/J1/temp/solr.cloud.LeaderFailoverAfterPartitionTest_23EB9BFCF38DAAE-001/control-001/cores}
    [junit4] 2> 598482 INFO (TEST-LeaderFailoverAfterPartitionTest.test-seed#[23EB9BFCF38DAAE]) [ ] o.a.s.s.SolrDispatchFilter SolrDispatchFilter.init(): sun.misc.Launcher$AppClassLoader@4554617c
    [junit4] 2> 598482 INFO (TEST-LeaderFailoverAfterPartitionTest.test-seed#[23EB9BFCF38DAAE]) [ ] o.a.s.c.SolrResourceLoader new SolrResourceLoader for directory: '/Users/jenkins/workspace/Lucene-Solr-master-MacOSX/solr/build/solr-core/test/J1/temp/solr.cloud.LeaderFailoverAfterPartitionTest_23EB9BFCF38DAAE-001/control-001'
    [junit4] 2> 598483 INFO (TEST-LeaderFailoverAfterPartitionTest.test-seed#[23EB9BFCF38DAAE]) [ ] o.a.s.c.SolrResourceLoader JNDI not configured for solr (NoInitialContextEx)
    [junit4] 2> 598483 INFO (TEST-LeaderFailoverAfterPartitionTest.test-seed#[23EB9BFCF38DAAE]) [ ] o.a.s.c.SolrResourceLoader solr home defaulted to 'solr/' (could not find system property or JNDI)
    [junit4] 2> 598483 INFO (TEST-LeaderFailoverAfterPartitionTest.test-seed#[23EB9BFCF38DAAE]) [ ] o.a.s.c.c.SolrZkClient Using default ZkCredentialsProvider
    [junit4] 2> 598484 INFO (TEST-LeaderFailoverAfterPartitionTest.test-seed#[23EB9BFCF38DAAE]) [ ] o.a.s.c.c.ConnectionManager Waiting for client to connect to ZooKeeper
    [junit4] 2> 598486 INFO (zkCallback-652-thread-1) [ ] o.a.s.c.c.ConnectionManager Watcher org.apache.solr.common.cloud.ConnectionManager@5beacd70 name:ZooKeeperConnection Watcher:127.0.0.1:63362/solr got event WatchedEvent state:SyncConnected type:None path:null path:null type:None
    [junit4] 2> 598486 INFO (TEST-LeaderFailoverAfterPartitionTest.test-seed#[23EB9BFCF38DAAE]) [ ] o.a.s.c.c.ConnectionManager Client is connected to ZooKeeper
    [junit4] 2> 598487 INFO (TEST-LeaderFailoverAfterPartitionTest.test-seed#[23EB9BFCF38DAAE]) [ ] o.a.s.c.c.SolrZkClient Using default ZkACLProvider
    [junit4] 2> 598488 INFO (TEST-LeaderFailoverAfterPartitionTest.test-seed#[23EB9BFCF38DAAE]) [ ] o.a.s.s.SolrDispatchFilter Loading solr.xml from SolrHome (not found in ZooKeeper)
    [junit4] 2> 598488 INFO (TEST-LeaderFailoverAfterPartitionTest.test-seed#[23EB9BFCF38DAAE]) [ ] o.a.s.c.SolrXmlConfig Loading container configuration from /Users/jenkins/workspace/Lucene-Solr-master-MacOSX/solr/build/solr-core/test/J1/temp/solr.cloud.LeaderFailoverAfterPartitionTest_23EB9BFCF38DAAE-001/control-001/solr.xml
    [junit4] 2> 598504 INFO (TEST-LeaderFailoverAfterPartitionTest.test-seed#[23EB9BFCF38DAAE]) [ ] o.a.s.c.CorePropertiesLocator Config-defined core root directory: /Users/jenkins/workspace/Lucene-Solr-master-MacOSX/solr/build/solr-core/test/J1/temp/solr.cloud.LeaderFailoverAfterPartitionTest_23EB9BFCF38DAAE-001/control-001/cores
    [junit4] 2> 598504 INFO (TEST-LeaderFailoverAfterPartitionTest.test-seed#[23EB9BFCF38DAAE]) [ ] o.a.s.c.CoreContainer New CoreContainer 1584338760
    [junit4] 2> 598504 INFO (TEST-LeaderFailoverAfterPartitionTest.test-seed#[23EB9BFCF38DAAE]) [ ] o.a.s.c.CoreContainer Loading cores into CoreContainer [instanceDir=/Users/jenkins/workspace/Lucene-Solr-master-MacOSX/solr/build/solr-core/test/J1/temp/solr.cloud.LeaderFailoverAfterPartitionTest_23EB9BFCF38DAAE-001/control-001]
    [junit4] 2> 598505 WARN (TEST-LeaderFailoverAfterPartitionTest.test-seed#[23EB9BFCF38DAAE]) [ ] o.a.s.c.CoreContainer Couldn't add files from /Users/jenkins/workspace/Lucene-Solr-master-MacOSX/solr/build/solr-core/test/J1/temp/solr.cloud.LeaderFailoverAfterPartitionTest_23EB9BFCF38DAAE-001/control-001/lib to classpath: /Users/jenkins/workspace/Lucene-Solr-master-MacOSX/solr/build/solr-core/test/J1/temp/solr.cloud.LeaderFailoverAfterPartitionTest_23EB9BFCF38DAAE-001/control-001/lib
    [junit4] 2> 598505 INFO (TEST-LeaderFailoverAfterPartitionTest.test-seed#[23EB9BFCF38DAAE]) [ ] o.a.s.h.c.HttpShardHandlerFactory created with socketTimeout : 90000,urlScheme : ,connTimeout : 15000,maxConnectionsPerHost : 20,maxConnections : 10000,corePoolSize : 0,maximumPoolSize : 2147483647,maxThreadIdleTime : 5,sizeOfQueue : -1,fairnessPolicy : false,
    [junit4] 2> 598517 INFO (TEST-LeaderFailoverAfterPartitionTest.test-seed#[23EB9BFCF38DAAE]) [ ] o.a.s.u.UpdateShardHandler Creating UpdateShardHandler HTTP client with params:
    [junit4] 2> 598518 INFO (TEST-LeaderFailoverAfterPartitionTest.test-seed#[23EB9BFCF38DAAE]) [ ] o.a.s.l.LogWatcher SLF4J impl is org.slf4j.impl.Log4jLoggerFactory
    [junit4] 2> 598518 INFO (TEST-LeaderFailoverAfterPartitionTest.test-seed#[23EB9BFCF38DAAE]) [ ] o.a.s.l.LogWatcher Registering Log Listener [Log4j (org.slf4j.impl.Log4jLoggerFactory)]
    [junit4] 2> 598518 INFO (TEST-LeaderFailoverAfterPartitionTest.test-seed#[23EB9BFCF38DAAE]) [ ] o.a.s.c.ZkContainer Zookeeper client=127.0.0.1:63362/solr
    [junit4] 2> 598519 INFO (TEST-LeaderFailoverAfterPartitionTest.test-seed#[23EB9BFCF38DAAE]) [ ] o.a.s.c.ZkController zkHost includes chroot
    [junit4] 2> 598519 INFO (TEST-LeaderFailoverAfterPartitionTest.test-seed#[23EB9BFCF38DAAE]) [ ] o.a.s.c.c.SolrZkClient Using default ZkCredentialsProvider
    [junit4] 2> 598519 INFO (TEST-LeaderFailoverAfterPartitionTest.test-seed#[23EB9BFCF38DAAE]) [ ] o.a.s.c.c.ConnectionManager Waiting for client to connect to ZooKeeper
    [junit4] 2> 598521 INFO (zkCallback-655-thread-1) [ ] o.a.s.c.c.ConnectionManager Watcher org.apache.solr.common.cloud.ConnectionManager@753c4ae name:ZooKeeperConnection Watcher:127.0.0.1:63362 got event WatchedEvent state:SyncConnected type:None path:null path:null type:None
    [junit4] 2> 598522 INFO (TEST-LeaderFailoverAfterPartitionTest.test-seed#[23EB9BFCF38DAAE]) [ ] o.a.s.c.c.ConnectionManager Client is connected to ZooKeeper
    [junit4] 2> 598522 INFO (TEST-LeaderFailoverAfterPartitionTest.test-seed#[23EB9BFCF38DAAE]) [ ] o.a.s.c.c.SolrZkClient Using default ZkACLProvider
    [junit4] 2> 598524 INFO (TEST-LeaderFailoverAfterPartitionTest.test-seed#[23EB9BFCF38DAAE]) [n:127.0.0.1:63375_ ] o.a.s.c.ZkController Added new OnReconnect listener org.apache.solr.cloud.ZkController$$Lambda$50/209363892@2ee1b009
    [junit4] 2> 598524 INFO (TEST-LeaderFailoverAfterPartitionTest.test-seed#[23EB9BFCF38DAAE]) [n:127.0.0.1:63375_ ] o.a.s.c.c.ConnectionManager Waiting for client to connect to ZooKeeper
    [junit4] 2> 598526 INFO (zkCallback-656-thread-1-processing-n:127.0.0.1:63375_) [n:127.0.0.1:63375_ ] o.a.s.c.c.ConnectionManager Watcher org.apache.solr.common.cloud.ConnectionManager@41ed0d6d name:ZooKeeperConnection Watcher:127.0.0.1:63362/solr got event WatchedEvent state:SyncConnected type:None path:null path:null type:None
    [junit4] 2> 598526 INFO (TEST-LeaderFailoverAfterPartitionTest.test-seed#[23EB9BFCF38DAAE]) [n:127.0.0.1:63375_ ] o.a.s.c.c.ConnectionManager Client is connected to ZooKeeper
    [junit4] 2> 598529 INFO (TEST-LeaderFailoverAfterPartitionTest.test-seed#[23EB9BFCF38DAAE]) [n:127.0.0.1:63375_ ] o.a.s.c.c.SolrZkClient makePath: /overseer/queue
    [junit4] 2> 598537 INFO (TEST-LeaderFailoverAfterPartitionTest.test-seed#[23EB9BFCF38DAAE]) [n:127.0.0.1:63375_ ] o.a.s.c.c.SolrZkClient makePath: /overseer/collection-queue-work
    [junit4] 2> 598542 INFO (TEST-LeaderFailoverAfterPartitionTest.test-seed#[23EB9BFCF38DAAE]) [n:127.0.0.1:63375_ ] o.a.s.c.c.SolrZkClient makePath: /overseer/collection-map-running
    [junit4] 2> 598546 INFO (TEST-LeaderFailoverAfterPartitionTest.test-seed#[23EB9BFCF38DAAE]) [n:127.0.0.1:63375_ ] o.a.s.c.c.SolrZkClient makePath: /overseer/collection-map-completed
    [junit4] 2> 598550 INFO (TEST-LeaderFailoverAfterPartitionTest.test-seed#[23EB9BFCF38DAAE]) [n:127.0.0.1:63375_ ] o.a.s.c.c.SolrZkClient makePath: /overseer/collection-map-failure
    [junit4] 2> 598553 INFO (TEST-LeaderFailoverAfterPartitionTest.test-seed#[23EB9BFCF38DAAE]) [n:127.0.0.1:63375_ ] o.a.s.c.c.SolrZkClient makePath: /live_nodes
    [junit4] 2> 598556 INFO (TEST-LeaderFailoverAfterPartitionTest.test-seed#[23EB9BFCF38DAAE]) [n:127.0.0.1:63375_ ] o.a.s.c.c.SolrZkClient makePath: /aliases.json
    [junit4] 2> 598559 INFO (TEST-LeaderFailoverAfterPartitionTest.test-seed#[23EB9BFCF38DAAE]) [n:127.0.0.1:63375_ ] o.a.s.c.c.SolrZkClient makePath: /clusterstate.json
    [junit4] 2> 598562 INFO (TEST-LeaderFailoverAfterPartitionTest.test-seed#[23EB9BFCF38DAAE]) [n:127.0.0.1:63375_ ] o.a.s.c.c.SolrZkClient makePath: /security.json
    [junit4] 2> 598564 INFO (TEST-LeaderFailoverAfterPartitionTest.test-seed#[23EB9BFCF38DAAE]) [n:127.0.0.1:63375_ ] o.a.s.c.c.ZkStateReader Updating cluster state from ZooKeeper...
    [junit4] 2> 598565 INFO (TEST-LeaderFailoverAfterPartitionTest.test-seed#[23EB9BFCF38DAAE]) [n:127.0.0.1:63375_ ] o.a.s.c.c.ZkStateReader Loaded empty cluster properties
    [junit4] 2> 598566 INFO (TEST-LeaderFailoverAfterPartitionTest.test-seed#[23EB9BFCF38DAAE]) [n:127.0.0.1:63375_ ] o.a.s.c.c.ZkStateReader Updated live nodes from ZooKeeper... (0) -> (0)
    [junit4] 2> 598571 INFO (TEST-LeaderFailoverAfterPartitionTest.test-seed#[23EB9BFCF38DAAE]) [n:127.0.0.1:63375_ ] o.a.s.c.c.SolrZkClient makePath: /overseer_elect
    [junit4] 2> 598573 INFO (TEST-LeaderFailoverAfterPartitionTest.test-seed#[23EB9BFCF38DAAE]) [n:127.0.0.1:63375_ ] o.a.s.c.c.SolrZkClient makePath: /overseer_elect/election
    [junit4] 2> 598575 INFO (TEST-LeaderFailoverAfterPartitionTest.test-seed#[23EB9BFCF38DAAE]) [n:127.0.0.1:63375_ ] o.a.s.c.Overseer Overseer (id=null) closing
    [junit4] 2> 598576 INFO (TEST-LeaderFailoverAfterPartitionTest.test-seed#[23EB9BFCF38DAAE]) [n:127.0.0.1:63375_ ] o.a.s.c.LeaderElector Joined leadership election with path: /overseer_elect/election/96084970398416900-127.0.0.1:63375_-n_0000000000
    [junit4] 2> 598577 INFO (TEST-LeaderFailoverAfterPartitionTest.test-seed#[23EB9BFCF38DAAE]) [n:127.0.0.1:63375_ ] o.a.s.c.OverseerElectionContext I am going to be the leader 127.0.0.1:63375_
    [junit4] 2> 598577 INFO (TEST-LeaderFailoverAfterPartitionTest.test-seed#[23EB9BFCF38DAAE]) [n:127.0.0.1:63375_ ] o.a.s.c.c.SolrZkClient makePath: /overseer_elect/leader
    [junit4] 2> 598580 INFO (TEST-LeaderFailoverAfterPartitionTest.test-seed#[23EB9BFCF38DAAE]) [n:127.0.0.1:63375_ ] o.a.s.c.Overseer Overseer (id=96084970398416900-127.0.0.1:63375_-n_0000000000) starting
    [junit4] 2> 598583 INFO (TEST-LeaderFailoverAfterPartitionTest.test-seed#[23EB9BFCF38DAAE]) [n:127.0.0.1:63375_ ] o.a.s.c.c.SolrZkClient makePath: /overseer/queue-work
    [junit4] 2> 598594 INFO (TEST-LeaderFailoverAfterPartitionTest.test-seed#[23EB9BFCF38DAAE]) [n:127.0.0.1:63375_ ] o.a.s.c.OverseerAutoReplicaFailoverThread Starting OverseerAutoReplicaFailoverThread autoReplicaFailoverWorkLoopDelay=10000 autoReplicaFailoverWaitAfterExpiration=30000 autoReplicaFailoverBadNodeExpiration=60000
    [junit4] 2> 598595 INFO (OverseerCollectionConfigSetProcessor-96084970398416900-127.0.0.1:63375_-n_0000000000) [n:127.0.0.1:63375_ ] o.a.s.c.OverseerTaskProcessor Process current queue of overseer operations
    [junit4] 2> 598595 INFO (OverseerStateUpdate-96084970398416900-127.0.0.1:63375_-n_0000000000) [n:127.0.0.1:63375_ ] o.a.s.c.Overseer Starting to work on the main queue
    [junit4] 2> 598596 INFO (TEST-LeaderFailoverAfterPartitionTest.test-seed#[23EB9BFCF38DAAE]) [n:127.0.0.1:63375_ ] o.a.s.c.ZkController Register node as live in ZooKeeper:/live_nodes/127.0.0.1:63375_
    [junit4] 2> 598598 INFO (TEST-LeaderFailoverAfterPartitionTest.test-seed#[23EB9BFCF38DAAE]) [n:127.0.0.1:63375_ ] o.a.s.c.c.SolrZkClient makePath: /live_nodes/127.0.0.1:63375_
    [junit4] 2> 598599 INFO (OverseerStateUpdate-96084970398416900-127.0.0.1:63375_-n_0000000000) [n:127.0.0.1:63375_ ] o.a.s.c.c.ZkStateReader Updated live nodes from ZooKeeper... (0) -> (0)
    [junit4] 2> 598600 INFO (zkCallback-656-thread-1-processing-n:127.0.0.1:63375_) [n:127.0.0.1:63375_ ] o.a.s.c.c.ZkStateReader A live node change: [WatchedEvent state:SyncConnected type:NodeChildrenChanged path:/live_nodes], has occurred - updating... (live nodes size: [0])
    [junit4] 2> 598601 INFO (zkCallback-656-thread-1-processing-n:127.0.0.1:63375_) [n:127.0.0.1:63375_ ] o.a.s.c.c.ZkStateReader Updated live nodes from ZooKeeper... (0) -> (1)
    [junit4] 2> 598609 INFO (TEST-LeaderFailoverAfterPartitionTest.test-seed#[23EB9BFCF38DAAE]) [n:127.0.0.1:63375_ ] o.a.s.c.CoreContainer Security conf doesn't exist. Skipping setup for authorization module.
    [junit4] 2> 598609 INFO (TEST-LeaderFailoverAfterPartitionTest.test-seed#[23EB9BFCF38DAAE]) [n:127.0.0.1:63375_ ] o.a.s.c.CoreContainer No authentication plugin used.
    [junit4] 2> 598612 INFO (TEST-LeaderFailoverAfterPartitionTest.test-seed#[23EB9BFCF38DAAE]) [n:127.0.0.1:63375_ ] o.a.s.c.CorePropertiesLocator Looking for core definitions underneath /Users/jenkins/workspace/Lucene-Solr-master-MacOSX/solr/build/solr-core/test/J1/temp/solr.cloud.LeaderFailoverAfterPartitionTest_23EB9BFCF38DAAE-001/control-001/cores
    [junit4] 2> 598613 INFO (TEST-LeaderFailoverAfterPartitionTest.test-seed#[23EB9BFCF38DAAE]) [n:127.0.0.1:63375_ ] o.a.s.c.CoreDescriptor Created CoreDescriptor: {name=collection1, config=solrconfig.xml, transient=false, schema=schema.xml, loadOnStartup=true, configSetProperties=configsetprops.json, collection=control_collection, coreNodeName=, dataDir=data/, shard=}
    [junit4] 2> 598613 INFO (TEST-LeaderFailoverAfterPartitionTest.test-seed#[23EB9BFCF38DAAE]) [n:127.0.0.1:63375_ ] o.a.s.c.CorePropertiesLocator Found core collection1 in /Users/jenkins/workspace/Lucene-Solr-master-MacOSX/solr/build/solr-core/test/J1/temp/solr.cloud.LeaderFailoverAfterPartitionTest_23EB9BFCF38DAAE-001/control-001/cores/collection1
    [junit4] 2> 598613 INFO (TEST-LeaderFailoverAfterPartitionTest.test-seed#[23EB9BFCF38DAAE]) [n:127.0.0.1:63375_ ] o.a.s.c.CorePropertiesLocator Found 1 core definitions
    [junit4] 2> 598614 INFO (coreLoadExecutor-2042-thread-1-processing-n:127.0.0.1:63375_) [n:127.0.0.1:63375_ c:control_collection x:collection1] o.a.s.c.ZkController publishing state=down
    [junit4] 2> 598615 INFO (coreLoadExecutor-2042-thread-1-processing-n:127.0.0.1:63375_) [n:127.0.0.1:63375_ c:control_collection x:collection1] o.a.s.c.ZkController numShards not found on descriptor - reading it from system property
    [junit4] 2> 598615 INFO (TEST-LeaderFailoverAfterPartitionTest.test-seed#[23EB9BFCF38DAAE]) [n:127.0.0.1:63375_ ] o.a.s.s.SolrDispatchFilter user.dir=/Users/jenkins/workspace/Lucene-Solr-master-MacOSX/solr/build/solr-core/test/J1
    [junit4] 2> 598615 INFO (TEST-LeaderFailoverAfterPartitionTest.test-seed#[23EB9BFCF38DAAE]) [n:127.0.0.1:63375_ ] o.a.s.s.SolrDispatchFilter SolrDispatchFilter.init() done
    [junit4] 2> 598616 INFO (coreLoadExecutor-2042-thread-1-processing-n:127.0.0.1:63375_) [n:127.0.0.1:63375_ c:control_collection x:collection1] o.a.s.c.ZkController Collection control_collection not visible yet, but flagging it so a watch is registered when it becomes visible
    [junit4] 2> 598617 INFO (OverseerStateUpdate-96084970398416900-127.0.0.1:63375_-n_0000000000) [n:127.0.0.1:63375_ ] o.a.s.c.Overseer processMessage: queueSize: 1, message = {
    [junit4] 2> "core":"collection1",
    [junit4] 2> "roles":null,
    [junit4] 2> "base_url":"http://127.0.0.1:63375",
    [junit4] 2> "node_name":"127.0.0.1:63375_",
    [junit4] 2> "numShards":"1",
    [junit4] 2> "state":"down",
    [junit4] 2> "shard":null,
    [junit4] 2> "collection":"control_collection",
    [junit4] 2> "operation":"state"} current state version: 0
    [junit4] 2> 598617 INFO (OverseerStateUpdate-96084970398416900-127.0.0.1:63375_-n_0000000000) [n:127.0.0.1:63375_ ] o.a.s.c.o.ReplicaMutator Update state numShards=1 message={
    [junit4] 2> "core":"collection1",
    [junit4] 2> "roles":null,
    [junit4] 2> "base_url":"http://127.0.0.1:63375",
    [junit4] 2> "node_name":"127.0.0.1:63375_",
    [junit4] 2> "numShards":"1",
    [junit4] 2> "state":"down",
    [junit4] 2> "shard":null,
    [junit4] 2> "collection":"control_collection",
    [junit4] 2> "operation":"state"}
    [junit4] 2> 598617 INFO (coreLoadExecutor-2042-thread-1-processing-n:127.0.0.1:63375_) [n:127.0.0.1:63375_ c:control_collection x:collection1] o.a.s.c.c.ZkStateReader Deleting data for [control_collection]
    [junit4] 2> 598618 INFO (OverseerStateUpdate-96084970398416900-127.0.0.1:63375_-n_0000000000) [n:127.0.0.1:63375_ ] o.a.s.c.o.ClusterStateMutator building a new cName: control_collection
    [junit4] 2> 598618 INFO (OverseerStateUpdate-96084970398416900-127.0.0.1:63375_-n_0000000000) [n:127.0.0.1:63375_ ] o.a.s.c.o.ReplicaMutator Assigning new node to shard shard=shard1
    [junit4] 2> 598619 INFO (coreLoadExecutor-2042-thread-1-processing-n:127.0.0.1:63375_) [n:127.0.0.1:63375_ c:control_collection x:collection1] o.a.s.c.ZkController look for our core node name
    [junit4] 2> 598621 INFO (zkCallback-656-thread-1-processing-n:127.0.0.1:63375_) [n:127.0.0.1:63375_ ] o.a.s.c.c.ZkStateReader A cluster state change: [WatchedEvent state:SyncConnected type:NodeDataChanged path:/clusterstate.json], has occurred - updating... (live nodes size: [1])
    [junit4] 2> 599623 INFO (coreLoadExecutor-2042-thread-1-processing-n:127.0.0.1:63375_) [n:127.0.0.1:63375_ c:control_collection x:collection1] o.a.s.c.ZkController waiting to find shard id in clusterstate for collection1
    [junit4] 2> 599623 INFO (coreLoadExecutor-2042-thread-1-processing-n:127.0.0.1:63375_) [n:127.0.0.1:63375_ c:control_collection x:collection1] o.a.s.c.ZkController Check for collection zkNode:control_collection
    [junit4] 2> 599624 INFO (coreLoadExecutor-2042-thread-1-processing-n:127.0.0.1:63375_) [n:127.0.0.1:63375_ c:control_collection x:collection1] o.a.s.c.ZkController Collection zkNode exists
    [junit4] 2> 599624 INFO (coreLoadExecutor-2042-thread-1-processing-n:127.0.0.1:63375_) [n:127.0.0.1:63375_ c:control_collection x:collection1] o.a.s.c.c.ZkStateReader Load collection config from: [/collections/control_collection]
    [junit4] 2> 599625 INFO (coreLoadExecutor-2042-thread-1-processing-n:127.0.0.1:63375_) [n:127.0.0.1:63375_ c:control_collection x:collection1] o.a.s.c.c.ZkStateReader path=[/collections/control_collection] [configName]=[conf1] specified config exists in ZooKeeper
    [junit4] 2> 599625 INFO (coreLoadExecutor-2042-thread-1-processing-n:127.0.0.1:63375_) [n:127.0.0.1:63375_ c:control_collection x:collection1] o.a.s.c.SolrResourceLoader new SolrResourceLoader for directory: '/Users/jenkins/workspace/Lucene-Solr-master-MacOSX/solr/build/solr-core/test/J1/temp/solr.cloud.LeaderFailoverAfterPartitionTest_23EB9BFCF38DAAE-001/control-001/cores/collection1'
    [junit4] 2> 599625 INFO (coreLoadExecutor-2042-thread-1-processing-n:127.0.0.1:63375_) [n:127.0.0.1:63375_ c:control_collection x:collection1] o.a.s.c.SolrResourceLoader JNDI not configured for solr (NoInitialContextEx)
    [junit4] 2> 599625 INFO (coreLoadExecutor-2042-thread-1-processing-n:127.0.0.1:63375_) [n:127.0.0.1:63375_ c:control_collection x:collection1] o.a.s.c.SolrResourceLoader solr home defaulted to 'solr/' (could not find system property or JNDI)
    [junit4] 2> 599628 INFO (coreLoadExecutor-2042-thread-1-processing-n:127.0.0.1:63375_) [n:127.0.0.1:63375_ c:control_collection x:collection1] o.a.s.c.Config loaded config solrconfig.xml with version 0
    [junit4] 2> 599634 INFO (coreLoadExecutor-2042-thread-1-processing-n:127.0.0.1:63375_) [n:127.0.0.1:63375_ c:control_collection x:collection1] o.a.s.c.SolrConfig current version of requestparams : -1
    [junit4] 2> 599637 WARN (coreLoadExecutor-2042-thread-1-processing-n:127.0.0.1:63375_) [n:127.0.0.1:63375_ c:control_collection x:collection1] o.a.s.c.Config Beginning with Solr 5.5, <mergePolicy> is deprecated, use <mergePolicyFactory> instead.
    [junit4] 2> 599638 INFO (coreLoadExecutor-2042-thread-1-processing-n:127.0.0.1:63375_) [n:127.0.0.1:63375_ c:control_collection x:collection1] o.a.s.c.SolrConfig Using Lucene MatchVersion: 7.0.0
    [junit4] 2> 599646 INFO (coreLoadExecutor-2042-thread-1-processing-n:127.0.0.1:63375_) [n:127.0.0.1:63375_ c:control_collection x:collection1] o.a.s.c.SolrConfig Loaded SolrConfig: solrconfig.xml
    [junit4] 2> 599652 INFO (coreLoadExecutor-2042-thread-1-processing-n:127.0.0.1:63375_) [n:127.0.0.1:63375_ c:control_collection x:collection1] o.a.s.s.IndexSchema [collection1] Schema name=test
    [junit4] 2> 599739 INFO (coreLoadExecutor-2042-thread-1-processing-n:127.0.0.1:63375_) [n:127.0.0.1:63375_ c:control_collection x:collection1] o.a.s.s.OpenExchangeRatesOrgProvider Initialized with rates=open-exchange-rates.json, refreshInterval=1440.
    [junit4] 2> 599748 INFO (coreLoadExecutor-2042-thread-1-processing-n:127.0.0.1:63375_) [n:127.0.0.1:63375_ c:control_collection x:collection1] o.a.s.s.IndexSchema default search field in schema is text
    [junit4] 2> 599749 INFO (coreLoadExecutor-2042-thread-1-processing-n:127.0.0.1:63375_) [n:127.0.0.1:63375_ c:control_collection x:collection1] o.a.s.s.IndexSchema unique key field: id
    [junit4] 2> 599764 INFO (coreLoadExecutor-2042-thread-1-processing-n:127.0.0.1:63375_) [n:127.0.0.1:63375_ c:control_collection x:collection1] o.a.s.s.FileExchangeRateProvider Reloading exchange rates from file currency.xml
    [junit4] 2> 599766 INFO (coreLoadExecutor-2042-thread-1-processing-n:127.0.0.1:63375_) [n:127.0.0.1:63375_ c:control_collection x:collection1] o.a.s.s.FileExchangeRateProvider Reloading exchange rates from file currency.xml
    [junit4] 2> 599769 INFO (coreLoadExecutor-2042-thread-1-processing-n:127.0.0.1:63375_) [n:127.0.0.1:63375_ c:control_collection x:collection1] o.a.s.s.OpenExchangeRatesOrgProvider Reloading exchange rates from open-exchange-rates.json
    [junit4] 2> 599771 INFO (coreLoadExecutor-2042-thread-1-processing-n:127.0.0.1:63375_) [n:127.0.0.1:63375_ c:control_collection x:collection1] o.a.s.s.OpenExchangeRatesOrgProvider Reloading exchange rates from open-exchange-rates.json
    [junit4] 2> 599775 INFO (coreLoadExecutor-2042-thread-1-processing-n:127.0.0.1:63375_) [n:127.0.0.1:63375_ c:control_collection x:collection1] o.a.s.c.ConfigSetProperties Did not find ConfigSet properties, assuming default properties: Can't find resource 'configsetprops.json' in classpath or '/configs/conf1', cwd=/Users/jenkins/workspace/Lucene-Solr-master-MacOSX/solr/build/solr-core/test/J1
    [junit4] 2> 599775 INFO (coreLoadExecutor-2042-thread-1-processing-n:127.0.0.1:63375_) [n:127.0.0.1:63375_ c:control_collection x:collection1] o.a.s.c.CoreContainer Creating SolrCore 'collection1' using configuration from collection control_collection
    [junit4] 2> 599775 INFO (coreLoadExecutor-2042-thread-1-processing-n:127.0.0.1:63375_) [n:127.0.0.1:63375_ c:control_collection s:shard1 r:core_node1 x:collection1] o.a.s.c.SolrCore org.apache.solr.core.MockDirectoryFactory
    [junit4] 2> 599776 INFO (coreLoadExecutor-2042-thread-1-processing-n:127.0.0.1:63375_) [n:127.0.0.1:63375_ c:control_collection s:shard1 r:core_node1 x:collection1] o.a.s.c.SolrCore [[collection1] ] Opening new SolrCore at [/Users/jenkins/workspace/Lucene-Solr-master-MacOSX/solr/build/solr-core/test/J1/temp/solr.cloud.LeaderFailoverAfterPartitionTest_23EB9BFCF38DAAE-001/control-001/cores/collection1], dataDir=[/Users/jenkins/workspace/Lucene-Solr-master-MacOSX/solr/build/solr-core/test/J1/temp/solr.cloud.LeaderFailoverAfterPartitionTest_23EB9BFCF38DAAE-001/control-001/cores/collection1/data/]
    [junit4] 2> 599776 INFO (coreLoadExecutor-2042-thread-1-processing-n:127.0.0.1:63375_) [n:127.0.0.1:63375_ c:control_collection s:shard1 r:core_node1 x:collection1] o.a.s.c.JmxMonitoredMap JMX monitoring is enabled. Adding Solr mbeans to JMX Server: com.sun.jmx.mbeanserver.JmxMBeanServer@472994bc
    [junit4] 2> 599776 INFO (coreLoadExecutor-2042-thread-1-processing-n:127.0.0.1:63375_) [n:127.0.0.1:63375_ c:control_collection s:shard1 r:core_node1 x:collection1] o.a.s.c.CachingDirectoryFactory return new directory for /Users/jenkins/workspace/Lucene-Solr-master-MacOSX/solr/build/solr-core/test/J1/temp/solr.cloud.LeaderFailoverAfterPartitionTest_23EB9BFCF38DAAE-001/control-001/cores/collection1/data
    [junit4] 2> 599776 INFO (coreLoadExecutor-2042-thread-1-processing-n:127.0.0.1:63375_) [n:127.0.0.1:63375_ c:control_collection s:shard1 r:core_node1 x:collection1] o.a.s.c.SolrCore New index directory detected: old=null new=/Users/jenkins/workspace/Lucene-Solr-master-MacOSX/solr/build/solr-core/test/J1/temp/solr.cloud.LeaderFailoverAfterPartitionTest_23EB9BFCF38DAAE-001/control-001/cores/collection1/data/index/
    [junit4] 2> 599776 WARN (coreLoadExecutor-2042-thread-1-processing-n:127.0.0.1:63375_) [n:127.0.0.1:63375_ c:control_collection s:shard1 r:core_node1 x:collection1] o.a.s.c.SolrCore [collection1] Solr index directory '/Users/jenkins/workspace/Lucene-Solr-master-MacOSX/solr/build/solr-core/test/J1/temp/solr.cloud.LeaderFailoverAfterPartitionTest_23EB9BFCF38DAAE-001/control-001/cores/collection1/data/index' doesn't exist. Creating new index...
    [junit4] 2> 599777 INFO (coreLoadExecutor-2042-thread-1-processing-n:127.0.0.1:63375_) [n:127.0.0.1:63375_ c:control_collection s:shard1 r:core_node1 x:collection1] o.a.s.c.CachingDirectoryFactory return new directory for /Users/jenkins/workspace/Lucene-Solr-master-MacOSX/solr/build/solr-core/test/J1/temp/solr.cloud.LeaderFailoverAfterPartitionTest_23EB9BFCF38DAAE-001/control-001/cores/collection1/data/index
    [junit4] 2> 599777 INFO (coreLoadExecutor-2042-thread-1-processing-n:127.0.0.1:63375_) [n:127.0.0.1:63375_ c:control_collection s:shard1 r:core_node1 x:collection1] o.a.s.u.RandomMergePolicy RandomMergePolicy wrapping class org.apache.lucene.index.LogDocMergePolicy: [LogDocMergePolicy: minMergeSize=1000, mergeFactor=2, maxMergeSize=9223372036854775807, maxMergeSizeForForcedMerge=9223372036854775807, calibrateSizeByDeletes=false, maxMergeDocs=2147483647, maxCFSSegmentSizeMB=8.796093022207999E12, noCFSRatio=0.0]
    [junit4] 2> 599777 INFO (coreLoadExecutor-2042-thread-1-processing-n:127.0.0.1:63375_) [n:127.0.0.1:63375_ c:control_collection s:shard1 r:core_node1 x:collection1] o.a.s.c.SolrDeletionPolicy SolrDeletionPolicy.onCommit: commits: num=1
    [junit4] 2> commit{dir=MockDirectoryWrapper(RAMDirectory@528b9f0 lockFactory=org.apache.lucene.store.SingleInstanceLockFactory@6cebecc9),segFN=segments_1,generation=1}
    [junit4] 2> 599778 INFO (coreLoadExecutor-2042-thread-1-processing-n:127.0.0.1:63375_) [n:127.0.0.1:63375_ c:control_collection s:shard1 r:core_node1 x:collection1] o.a.s.c.SolrDeletionPolicy newest commit generation = 1
    [junit4] 2> 599778 INFO (OldIndexDirectoryCleanupThreadForCore-collection1) [n:127.0.0.1:63375_ c:control_collection s:shard1 r:core_node1 x:collection1] o.a.s.c.SolrCore Looking for old index directories to cleanup for core collection1 in /Users/jenkins/workspace/Lucene-Solr-master-MacOSX/solr/build/solr-core/test/J1/temp/solr.cloud.LeaderFailoverAfterPartitionTest_23EB9BFCF38DAAE-001/control-001/cores/collection1/data/
    [junit4] 2> 599779 WARN (OldIndexDirectoryCleanupThreadForCore-collection1) [n:127.0.0.1:63375_ c:control_collection s:shard1 r:core_node1 x:collection1] o.a.s.c.DirectoryFactory /Users/jenkins/workspace/Lucene-Solr-master-MacOSX/solr/build/solr-core/test/J1/temp/solr.cloud.LeaderFailoverAfterPartitionTest_23EB9BFCF38DAAE-001/control-001/cores/collection1/data/ does not point to a valid data directory; skipping clean-up of old index directories.
    [junit4] 2> 599781 INFO (coreLoadExecutor-2042-thread-1-processing-n:127.0.0.1:63375_) [n:127.0.0.1:63375_ c:control_collection s:shard1 r:core_node1 x:collection1] o.a.s.u.p.UpdateRequestProcessorChain creating updateRequestProcessorChain "nodistrib"
    [junit4] 2> 599782 INFO (coreLoadExecutor-2042-thread-1-processing-n:127.0.0.1:63375_) [n:127.0.0.1:63375_ c:control_collection s:shard1 r:core_node1 x:collection1] o.a.s.u.p.UpdateRequestProcessorChain creating updateRequestProcessorChain "dedupe"
    [junit4] 2> 599782 INFO (coreLoadExecutor-2042-thread-1-processing-n:127.0.0.1:63375_) [n:127.0.0.1:63375_ c:control_collection s:shard1 r:core_node1 x:collection1] o.a.s.u.p.UpdateRequestProcessorChain inserting DistributedUpdateProcessorFactory into updateRequestProcessorChain "dedupe"
    [junit4] 2> 599782 INFO (coreLoadExecutor-2042-thread-1-processing-n:127.0.0.1:63375_) [n:127.0.0.1:63375_ c:control_collection s:shard1 r:core_node1 x:collection1] o.a.s.u.p.UpdateRequestProcessorChain creating updateRequestProcessorChain "stored_sig"
    [junit4] 2> 599782 INFO (coreLoadExecutor-2042-thread-1-processing-n:127.0.0.1:63375_) [n:127.0.0.1:63375_ c:control_collection s:shard1 r:core_node1 x:collection1] o.a.s.u.p.UpdateRequestProcessorChain inserting DistributedUpdateProcessorFactory into updateRequestProcessorChain "stored_sig"
    [junit4] 2> 599782 INFO (coreLoadExecutor-2042-thread-1-processing-n:127.0.0.1:63375_) [n:127.0.0.1:63375_ c:control_collection s:shard1 r:core_node1 x:collection1] o.a.s.u.p.UpdateRequestProcessorChain creating updateRequestProcessorChain "distrib-dup-test-chain-explicit"
    [junit4] 2> 599782 INFO (coreLoadExecutor-2042-thread-1-processing-n:127.0.0.1:63375_) [n:127.0.0.1:63375_ c:control_collection s:shard1 r:core_node1 x:collection1] o.a.s.u.p.UpdateRequestProcessorChain creating updateRequestProcessorChain "distrib-dup-test-chain-implicit"
    [junit4] 2> 599782 INFO (coreLoadExecutor-2042-thread-1-processing-n:127.0.0.1:63375_) [n:127.0.0.1:63375_ c:control_collection s:shard1 r:core_node1 x:collection1] o.a.s.u.p.UpdateRequestProcessorChain inserting DistributedUpdateProcessorFactory into updateRequestProcessorChain "distrib-dup-test-chain-implicit"
    [junit4] 2> 599782 INFO (coreLoadExecutor-2042-thread-1-processing-n:127.0.0.1:63375_) [n:127.0.0.1:63375_ c:control_collection s:shard1 r:core_node1 x:collection1] o.a.s.c.SolrCore no updateRequestProcessorChain defined as default, creating implicit default
    [junit4] 2> 599782 WARN (coreLoadExecutor-2042-thread-1-processing-n:127.0.0.1:63375_) [n:127.0.0.1:63375_ c:control_collection s:shard1 r:core_node1 x:collection1] o.a.s.c.RequestHandlers INVALID paramSet a in requestHandler {type = requestHandler,name = /dump,class = DumpRequestHandler,args = {defaults={a=A,b=B}}}
    [junit4] 2> 599788 INFO (coreLoadExecutor-2042-thread-1-processing-n:127.0.0.1:63375_) [n:127.0.0.1:63375_ c:control_collection s:shard1 r:core_node1 x:collection1] o.a.s.h.l.XMLLoader xsltCacheLifetimeSeconds=60
    [junit4] 2> 599789 INFO (coreLoadExecutor-2042-thread-1-processing-n:127.0.0.1:63375_) [n:127.0.0.1:63375_ c:control_collection s:shard1 r:core_node1 x:collection1] o.a.s.h.l.XMLLoader xsltCacheLifetimeSeconds=60
    [junit4] 2> 599795 INFO (coreLoadExecutor-2042-thread-1-processing-n:127.0.0.1:63375_) [n:127.0.0.1:63375_ c:control_collection s:shard1 r:core_node1 x:collection1] o.a.s.h.l.XMLLoader xsltCacheLifetimeSeconds=60
    [junit4] 2> 599796 INFO (coreLoadExecutor-2042-thread-1-processing-n:127.0.0.1:63375_) [n:127.0.0.1:63375_ c:control_collection s:shard1 r:core_node1 x:collection1] o.a.s.h.l.XMLLoader xsltCacheLifetimeSeconds=60
    [junit4] 2> 599801 INFO (coreLoadExecutor-2042-thread-1-processing-n:127.0.0.1:63375_) [n:127.0.0.1:63375_ c:control_collection s:shard1 r:core_node1 x:collection1] o.a.s.c.RequestHandlers Registered paths: /admin/mbeans,standard,/update/json/docs,/admin/luke,/export,/get,/admin/properties,/update/json,/admin/threads,/dump,/update/csv,/sql,/graph,/admin/segments,/admin/system,/replication,/config,/stream,/schema,/admin/plugins,/admin/logging,/admin/ping,/update,/admin/file
    [junit4] 2> 599801 INFO (coreLoadExecutor-2042-thread-1-processing-n:127.0.0.1:63375_) [n:127.0.0.1:63375_ c:control_collection s:shard1 r:core_node1 x:collection1] o.a.s.c.SolrCore Using default statsCache cache: org.apache.solr.search.stats.LocalStatsCache
    [junit4] 2> 599802 INFO (coreLoadExecutor-2042-thread-1-processing-n:127.0.0.1:63375_) [n:127.0.0.1:63375_ c:control_collection s:shard1 r:core_node1 x:collection1] o.a.s.u.UpdateHandler Using UpdateLog implementation: org.apache.solr.update.UpdateLog
    [junit4] 2> 599802 INFO (coreLoadExecutor-2042-thread-1-processing-n:127.0.0.1:63375_) [n:127.0.0.1:63375_ c:control_collection s:shard1 r:core_node1 x:collection1] o.a.s.u.UpdateLog Initializing UpdateLog: dataDir= defaultSyncLevel=FLUSH numRecordsToKeep=100 maxNumLogsToKeep=10 numVersionBuckets=65536
    [junit4] 2> 599803 INFO (coreLoadExecutor-2042-thread-1-processing-n:127.0.0.1:63375_) [n:127.0.0.1:63375_ c:control_collection s:shard1 r:core_node1 x:collection1] o.a.s.u.CommitTracker Hard AutoCommit: disabled
    [junit4] 2> 599803 INFO (coreLoadExecutor-2042-thread-1-processing-n:127.0.0.1:63375_) [n:127.0.0.1:63375_ c:control_collection s:shard1 r:core_node1 x:collection1] o.a.s.u.CommitTracker Soft AutoCommit: disabled
    [junit4] 2> 599813 INFO (coreLoadExecutor-2042-thread-1-processing-n:127.0.0.1:63375_) [n:127.0.0.1:63375_ c:control_collection s:shard1 r:core_node1 x:collection1] o.a.s.u.RandomMergePolicy RandomMergePolicy wrapping class org.apache.lucene.index.TieredMergePolicy: [TieredMergePolicy: maxMergeAtOnce=32, maxMergeAtOnceExplicit=48, maxMergedSegmentMB=30.3896484375, floorSegmentMB=1.0947265625, forceMergeDeletesPctAllowed=29.282257272115626, segmentsPerTier=14.0, maxCFSSegmentSizeMB=8.796093022207999E12, noCFSRatio=1.0
    [junit4] 2> 599813 INFO (coreLoadExecutor-2042-thread-1-processing-n:127.0.0.1:63375_) [n:127.0.0.1:63375_ c:control_collection s:shard1 r:core_node1 x:collection1] o.a.s.c.SolrDeletionPolicy SolrDeletionPolicy.onInit: commits: num=1
    [junit4] 2> commit{dir=MockDirectoryWrapper(RAMDirectory@528b9f0 lockFactory=org.apache.lucene.store.SingleInstanceLockFactory@6cebecc9),segFN=segments_1,generation=1}
    [junit4] 2> 599813 INFO (coreLoadExecutor-2042-thread-1-processing-n:127.0.0.1:63375_) [n:127.0.0.1:63375_ c:control_collection s:shard1 r:core_node1 x:collection1] o.a.s.c.SolrDeletionPolicy newest commit generation = 1
    [junit4] 2> 599814 INFO (coreLoadExecutor-2042-thread-1-processing-n:127.0.0.1:63375_) [n:127.0.0.1:63375_ c:control_collection s:shard1 r:core_node1 x:collection1] o.a.s.s.SolrIndexSearcher Opening [Searcher@1be27392[collection1] main]
    [junit4] 2> 599814 INFO (coreLoadExecutor-2042-thread-1-processing-n:127.0.0.1:63375_) [n:127.0.0.1:63375_ c:control_collection s:shard1 r:core_node1 x:collection1] o.a.s.c.c.ZkStateReader Load collection config from: [/collections/control_collection]
    [junit4] 2> 599815 INFO (coreLoadExecutor-2042-thread-1-processing-n:127.0.0.1:63375_) [n:127.0.0.1:63375_ c:control_collection s:shard1 r:core_node1 x:collection1] o.a.s.c.c.ZkStateReader path=[/collections/control_collection] [configName]=[conf1] specified config exists in ZooKeeper
    [junit4] 2> 599815 INFO (coreLoadExecutor-2042-thread-1-processing-n:127.0.0.1:63375_) [n:127.0.0.1:63375_ c:control_collection s:shard1 r:core_node1 x:collection1] o.a.s.r.ManagedResourceStorage Setting up ZooKeeper-based storage for the RestManager with znodeBase: /configs/conf1
    [junit4] 2> 599816 INFO (coreLoadExecutor-2042-thread-1-processing-n:127.0.0.1:63375_) [n:127.0.0.1:63375_ c:control_collection s:shard1 r:core_node1 x:collection1] o.a.s.r.ManagedResourceStorage Configured ZooKeeperStorageIO with znodeBase: /configs/conf1
    [junit4] 2> 599816 INFO (coreLoadExecutor-2042-thread-1-processing-n:127.0.0.1:63375_) [n:127.0.0.1:63375_ c:control_collection s:shard1 r:core_node1 x:collection1] o.a.s.r.RestManager Initializing RestManager with initArgs: {}
    [junit4] 2> 599816 INFO (coreLoadExecutor-2042-thread-1-processing-n:127.0.0.1:63375_) [n:127.0.0.1:63375_ c:control_collection s:shard1 r:core_node1 x:collection1] o.a.s.r.ManagedResourceStorage Reading _rest_managed.json using ZooKeeperStorageIO:path=/configs/conf1
    [junit4] 2> 599816 INFO (coreLoadExecutor-2042-thread-1-processing-n:127.0.0.1:63375_) [n:127.0.0.1:63375_ c:control_collection s:shard1 r:core_node1 x:collection1] o.a.s.r.ManagedResourceStorage No data found for znode /configs/conf1/_rest_managed.json
    [junit4] 2> 599817 INFO (coreLoadExecutor-2042-thread-1-processing-n:127.0.0.1:63375_) [n:127.0.0.1:63375_ c:control_collection s:shard1 r:core_node1 x:collection1] o.a.s.r.ManagedResourceStorage Loaded null at path _rest_managed.json using ZooKeeperStorageIO:path=/configs/conf1
    [junit4] 2> 599817 INFO (coreLoadExecutor-2042-thread-1-processing-n:127.0.0.1:63375_) [n:127.0.0.1:63375_ c:control_collection s:shard1 r:core_node1 x:collection1] o.a.s.r.RestManager Initializing 0 registered ManagedResources
    [junit4] 2> 599817 INFO (coreLoadExecutor-2042-thread-1-processing-n:127.0.0.1:63375_) [n:127.0.0.1:63375_ c:control_collection s:shard1 r:core_node1 x:collection1] o.a.s.h.ReplicationHandler Commits will be reserved for 10000
    [junit4] 2> 599817 INFO (coreLoadExecutor-2042-thread-1-processing-n:127.0.0.1:63375_) [n:127.0.0.1:63375_ c:control_collection s:shard1 r:core_node1 x:collection1] o.a.s.u.UpdateLog Looking up max value of version field to seed version buckets
    [junit4] 2> 599817 INFO (coreLoadExecutor-2042-thread-1-processing-n:127.0.0.1:63375_) [n:127.0.0.1:63375_ c:control_collection s:shard1 r:core_node1 x:collection1] o.a.s.u.VersionInfo Refreshing highest value of _version_ for 65536 version buckets from index
    [junit4] 2> 599817 INFO (coreLoadExecutor-2042-thread-1-processing-n:127.0.0.1:63375_) [n:127.0.0.1:63375_ c:control_collection s:shard1 r:core_node1 x:collection1] o.a.s.u.VersionInfo No terms found for _version_, cannot seed version bucket highest value from index
    [junit4] 2> 599817 INFO (coreLoadExecutor-2042-thread-1-processing-n:127.0.0.1:63375_) [n:127.0.0.1:63375_ c:control_collection s:shard1 r:core_node1 x:collection1] o.a.s.u.UpdateLog Could not find max version in index or recent updates, using new clock 1537359528408907776
    [junit4] 2> 599819 INFO (searcherExecutor-2043-thread-1-processing-n:127.0.0.1:63375_ x:collection1 s:shard1 c:control_collection r:core_node1) [n:127.0.0.1:63375_ c:control_collection s:shard1 r:core_node1 x:collection1] o.a.s.c.SolrCore [collection1] Registered new searcher Searcher@1be27392[collection1] main{ExitableDirectoryReader(UninvertingDirectoryReader())}
    [junit4] 2> 599819 INFO (coreLoadExecutor-2042-thread-1-processing-n:127.0.0.1:63375_) [n:127.0.0.1:63375_ c:control_collection s:shard1 r:core_node1 x:collection1] o.a.s.u.UpdateLog Took 1.0ms to seed version buckets with highest version 1537359528408907776
    [junit4] 2> 599819 INFO (coreLoadExecutor-2042-thread-1-processing-n:127.0.0.1:63375_) [n:127.0.0.1:63375_ c:control_collection s:shard1 r:core_node1 x:collection1] o.a.s.c.ZkController watch zkdir /configs/conf1
    [junit4] 2> 599820 INFO (coreLoadExecutor-2042-thread-1-processing-n:127.0.0.1:63375_) [n:127.0.0.1:63375_ c:control_collection s:shard1 r:core_node1 x:collection1] o.a.s.c.CoreContainer registering core: collection1
    [junit4] 2> 599821 INFO (coreZkRegister-2036-thread-1-processing-n:127.0.0.1:63375_ x:collection1 s:shard1 c:control_collection r:core_node1) [n:127.0.0.1:63375_ c:control_collection s:shard1 r:core_node1 x:collection1] o.a.s.c.ZkController Register replica - core:collection1 address:http://127.0.0.1:63375 collection:control_collection shard:shard1
    [junit4] 2> 599822 INFO (coreZkRegister-2036-thread-1-processing-n:127.0.0.1:63375_ x:collection1 s:shard1 c:control_collection r:core_node1) [n:127.0.0.1:63375_ c:control_collection s:shard1 r:core_node1 x:collection1] o.a.s.c.c.SolrZkClient makePath: /collections/control_collection/leader_elect/shard1/election
    [junit4] 2> 599828 INFO (coreZkRegister-2036-thread-1-processing-n:127.0.0.1:63375_ x:collection1 s:shard1 c:control_collection r:core_node1) [n:127.0.0.1:63375_ c:control_collection s:shard1 r:core_node1 x:collection1] o.a.s.c.LeaderElector Joined leadership election with path: /collections/control_collection/leader_elect/shard1/election/96084970398416900-core_node1-n_0000000000
    [junit4] 2> 599829 INFO (coreZkRegister-2036-thread-1-processing-n:127.0.0.1:63375_ x:collection1 s:shard1 c:control_collection r:core_node1) [n:127.0.0.1:63375_ c:control_collection s:shard1 r:core_node1 x:collection1] o.a.s.c.ShardLeaderElectionContext Running the leader process for shard=shard1 and weAreReplacement=false and leaderVoteWait=10000
    [junit4] 2> 599833 INFO (coreZkRegister-2036-thread-1-processing-n:127.0.0.1:63375_ x:collection1 s:shard1 c:control_collection r:core_node1) [n:127.0.0.1:63375_ c:control_collection s:shard1 r:core_node1 x:collection1] o.a.s.c.ShardLeaderElectionContext Enough replicas found to continue.
    [junit4] 2> 599833 INFO (coreZkRegister-2036-thread-1-processing-n:127.0.0.1:63375_ x:collection1 s:shard1 c:control_collection r:core_node1) [n:127.0.0.1:63375_ c:control_collection s:shard1 r:core_node1 x:collection1] o.a.s.c.ShardLeaderElectionContext I may be the new leader - try and sync
    [junit4] 2> 599833 INFO (coreZkRegister-2036-thread-1-processing-n:127.0.0.1:63375_ x:collection1 s:shard1 c:control_collection r:core_node1) [n:127.0.0.1:63375_ c:control_collection s:shard1 r:core_node1 x:collection1] o.a.s.c.SyncStrategy Sync replicas to http://127.0.0.1:63375/collection1/
    [junit4] 2> 599833 INFO (coreZkRegister-2036-thread-1-processing-n:127.0.0.1:63375_ x:collection1 s:shard1 c:control_collection r:core_node1) [n:127.0.0.1:63375_ c:control_collection s:shard1 r:core_node1 x:collection1] o.a.s.c.SyncStrategy Sync Success - now sync replicas to me
    [junit4] 2> 599833 INFO (coreZkRegister-2036-thread-1-processing-n:127.0.0.1:63375_ x:collection1 s:shard1 c:control_collection r:core_node1) [n:127.0.0.1:63375_ c:control_collection s:shard1 r:core_node1 x:collection1] o.a.s.c.SyncStrategy http://127.0.0.1:63375/collection1/ has no replicas
    [junit4] 2> 599834 INFO (OverseerStateUpdate-96084970398416900-127.0.0.1:63375_-n_0000000000) [n:127.0.0.1:63375_ ] o.a.s.c.Overseer processMessage: queueSize: 1, message = {
    [junit4] 2> "operation":"leader",
    [junit4] 2> "shard":"shard1",
    [junit4] 2> "collection":"control_collection"} current state version: 1
    [junit4] 2> 599836 INFO (coreZkRegister-2036-thread-1-processing-n:127.0.0.1:63375_ x:collection1 s:shard1 c:control_collection r:core_node1) [n:127.0.0.1:63375_ c:control_collection s:shard1 r:core_node1 x:collection1] o.a.s.c.c.SolrZkClient makePath: /collections/control_collection/leaders/shard1
    [junit4] 2> 599840 INFO (coreZkRegister-2036-thread-1-processing-n:127.0.0.1:63375_ x:collection1 s:shard1 c:control_collection r:core_node1) [n:127.0.0.1:63375_ c:control_collection s:shard1 r:core_node1 x:collection1] o.a.s.c.ShardLeaderElectionContextBase Creating leader registration node /collections/control_collection/leaders/shard1/leader after winning as /collections/control_collection/leader_elect/shard1/election/96084970398416900-core_node1-n_0000000000
    [junit4] 2> 599844 INFO (coreZkRegister-2036-thread-1-processing-n:127.0.0.1:63375_ x:collection1 s:shard1 c:control_collection r:core_node1) [n:127.0.0.1:63375_ c:control_collection s:shard1 r:core_node1 x:collection1] o.a.s.c.ShardLeaderElectionContext I am the new leader: http://127.0.0.1:63375/collection1/ shard1
    [junit4] 2> 599847 INFO (OverseerStateUpdate-96084970398416900-127.0.0.1:63375_-n_0000000000) [n:127.0.0.1:63375_ ] o.a.s.c.Overseer processMessage: queueSize: 1, message = {
    [junit4] 2> "operation":"leader",
    [junit4] 2> "shard":"shard1",
    [junit4] 2> "collection":"control_collection",
    [junit4] 2> "base_url":"http://127.0.0.1:63375",
    [junit4] 2> "core":"collection1",
    [junit4] 2> "state":"active"} current state version: 1
    [junit4] 2> 599961 INFO (zkCallback-656-thread-1-processing-n:127.0.0.1:63375_) [n:127.0.0.1:63375_ ] o.a.s.c.c.ZkStateReader A cluster state change: [WatchedEvent state:SyncConnected type:NodeDataChanged path:/clusterstate.json], has occurred - updating... (live nodes size: [1])
    [junit4] 2> 600010 INFO (coreZkRegister-2036-thread-1-processing-n:127.0.0.1:63375_ x:collection1 s:shard1 c:control_collection r:core_node1) [n:127.0.0.1:63375_ c:control_collection s:shard1 r:core_node1 x:collection1] o.a.s.c.ZkController We are http://127.0.0.1:63375/collection1/ and leader is http://127.0.0.1:63375/collection1/
    [junit4] 2> 600010 INFO (coreZkRegister-2036-thread-1-processing-n:127.0.0.1:63375_ x:collection1 s:shard1 c:control_collection r:core_node1) [n:127.0.0.1:63375_ c:control_collection s:shard1 r:core_node1 x:collection1] o.a.s.c.ZkController No LogReplay needed for core=collection1 baseURL=http://127.0.0.1:63375
    [junit4] 2> 600010 INFO (coreZkRegister-2036-thread-1-processing-n:127.0.0.1:63375_ x:collection1 s:shard1 c:control_collection r:core_node1) [n:127.0.0.1:63375_ c:control_collection s:shard1 r:core_node1 x:collection1] o.a.s.c.ZkController I am the leader, no recovery necessary
    [junit4] 2> 600010 INFO (coreZkRegister-2036-thread-1-processing-n:127.0.0.1:63375_ x:collection1 s:shard1 c:control_collection r:core_node1) [n:127.0.0.1:63375_ c:control_collection s:shard1 r:core_node1 x:collection1] o.a.s.c.ZkController publishing state=active
    [junit4] 2> 600010 INFO (coreZkRegister-2036-thread-1-processing-n:127.0.0.1:63375_ x:collection1 s:shard1 c:control_collection r:core_node1) [n:127.0.0.1:63375_ c:control_collection s:shard1 r:core_node1 x:collection1] o.a.s.c.ZkController numShards not found on descriptor - reading it from system property
    [junit4] 2> 600014 INFO (OverseerStateUpdate-96084970398416900-127.0.0.1:63375_-n_0000000000) [n:127.0.0.1:63375_ ] o.a.s.c.Overseer processMessage: queueSize: 1, message = {
    [junit4] 2> "core":"collection1",
    [junit4] 2> "core_node_name":"core_node1",
    [junit4] 2> "roles":null,
    [junit4] 2> "base_url":"http://127.0.0.1:63375",
    [junit4] 2> "node_name":"127.0.0.1:63375_",
    [junit4] 2> "numShards":"1",
    [junit4] 2> "state":"active",
    [junit4] 2> "shard":"shard1",
    [junit4] 2> "collection":"control_collection",
    [junit4] 2> "operation":"state"} current state version: 2
    [junit4] 2> 600014 INFO (OverseerStateUpdate-96084970398416900-127.0.0.1:63375_-n_0000000000) [n:127.0.0.1:63375_ ] o.a.s.c.o.ReplicaMutator Update state numShards=1 message={
    [junit4] 2> "core":"collection1",
    [junit4] 2> "core_node_name":"core_node1",
    [junit4] 2> "roles":null,
    [junit4] 2> "base_url":"http://127.0.0.1:63375",
    [junit4] 2> "node_name":"127.0.0.1:63375_",
    [junit4] 2> "numShards":"1",
    [junit4] 2> "state":"active",
    [junit4] 2> "shard":"shard1",
    [junit4] 2> "collection":"control_collection",
    [junit4] 2> "operation":"state"}
    [junit4] 2> 600121 INFO (zkCallback-656-thread-3-processing-n:127.0.0.1:63375_) [n:127.0.0.1:63375_ ] o.a.s.c.c.ZkStateReader A cluster state change: [WatchedEvent state:SyncConnected type:NodeDataChanged path:/clusterstate.json], has occurred - updating... (live nodes size: [1])
    [junit4] 2> 600134 INFO (TEST-LeaderFailoverAfterPartitionTest.test-seed#[23EB9BFCF38DAAE]) [ ] o.a.s.c.c.SolrZkClient Using default ZkCredentialsProvider
    [junit4] 2> 600136 INFO (TEST-LeaderFailoverAfterPartitionTest.test-seed#[23EB9BFCF38DAAE]) [ ] o.a.s.c.c.ConnectionManager Waiting for client to connect to ZooKeeper
    [junit4] 2> 600137 INFO (zkCallback-660-thread-1) [ ] o.a.s.c.c.ConnectionManager Watcher org.apache.solr.common.cloud.ConnectionManager@5a16d054 name:ZooKeeperConnection Watcher:127.0.0.1:63362/solr got event WatchedEvent state:SyncConnected type:None path:null path:null type:None
    [junit4] 2> 600137 INFO (TEST-LeaderFailoverAfterPartitionTest.test-seed#[23EB9BFCF38DAAE]) [ ] o.a.s.c.c.ConnectionManager Client is connected to ZooKeeper
    [junit4] 2> 600137 INFO (TEST-LeaderFailoverAfterPartitionTest.test-seed#[23EB9BFCF38DAAE]) [ ] o.a.s.c.c.SolrZkClient Using default ZkACLProvider
    [junit4] 2> 600137 INFO (TEST-LeaderFailoverAfterPartitionTest.test-seed#[23EB9BFCF38DAAE]) [ ] o.a.s.c.c.ZkStateReader Updating cluster state from ZooKeeper...
    [junit4] 2> 600138 INFO (TEST-LeaderFailoverAfterPartitionTest.test-seed#[23EB9BFCF38DAAE]) [ ] o.a.s.c.c.ZkStateReader Loaded empty cluster properties
    [junit4] 2> 600139 INFO (TEST-LeaderFailoverAfterPartitionTest.test-seed#[23EB9BFCF38DAAE]) [ ] o.a.s.c.c.ZkStateReader Updated live nodes from ZooKeeper... (0) -> (1)
    [junit4] 2> 600141 INFO (TEST-LeaderFailoverAfterPartitionTest.test-seed#[23EB9BFCF38DAAE]) [ ] o.a.s.c.ChaosMonkey monkey: init - expire sessions:false cause connection loss:false
    [junit4] 2> 600141 INFO (TEST-LeaderFailoverAfterPartitionTest.test-seed#[23EB9BFCF38DAAE]) [ ] o.a.s.c.AbstractFullDistribZkTestBase Creating collection1 with stateFormat=2
    [junit4] 2> 600141 INFO (TEST-LeaderFailoverAfterPartitionTest.test-seed#[23EB9BFCF38DAAE]) [ ] o.a.s.c.c.SolrZkClient Using default ZkCredentialsProvider
    [junit4] 2> 600142 INFO (TEST-LeaderFailoverAfterPartitionTest.test-seed#[23EB9BFCF38DAAE]) [ ] o.a.s.c.c.ConnectionManager Waiting for client to connect to ZooKeeper
    [junit4] 2> 600145 INFO (zkCallback-661-thread-1) [ ] o.a.s.c.c.ConnectionManager Watcher org.apache.solr.common.cloud.ConnectionManager@27b8bb5c name:ZooKeeperConnection Watcher:127.0.0.1:63362/solr got event WatchedEvent state:SyncConnected type:None path:null path:null type:None
    [junit4] 2> 600146 INFO (TEST-LeaderFailoverAfterPartitionTest.test-seed#[23EB9BFCF38DAAE]) [ ] o.a.s.c.c.ConnectionManager Client is connected to ZooKeeper
    [junit4] 2> 600146 INFO (TEST-LeaderFailoverAfterPartitionTest.test-seed#[23EB9BFCF38DAAE]) [ ] o.a.s.c.c.SolrZkClient Using default ZkACLProvider
    [junit4] 2> 600150 INFO (OverseerStateUpdate-96084970398416900-127.0.0.1:63375_-n_0000000000) [n:127.0.0.1:63375_ ] o.a.s.c.Overseer processMessage: queueSize: 1, message = {
    [junit4] 2> "operation":"create",
    [junit4] 2> "name":"collection1",
    [junit4] 2> "numShards":"2",
    [junit4] 2> "stateFormat":"2"} current state version: 3
    [junit4] 2> 600150 INFO (OverseerStateUpdate-96084970398416900-127.0.0.1:63375_-n_0000000000) [n:127.0.0.1:63375_ ] o.a.s.c.o.ClusterStateMutator building a new cName: collection1
    [junit4] 2> 600263 INFO (OverseerStateUpdate-96084970398416900-127.0.0.1:63375_-n_0000000000) [n:127.0.0.1:63375_ ] o.a.s.c.o.ZkStateWriter going to create_collection /collections/collection1/state.json
    [junit4] 2> 600441 INFO (TEST-LeaderFailoverAfterPartitionTest.test-seed#[23EB9BFCF38DAAE]) [ ] o.a.s.SolrTestCaseJ4 Writing core.properties file to /Users/jenkins/workspace/Lucene-Solr-master-MacOSX/solr/build/solr-core/test/J1/temp/solr.cloud.LeaderFailoverAfterPartitionTest_23EB9BFCF38DAAE-001/shard-1-001/cores/collection1
    [junit4] 2> 600442 INFO (TEST-LeaderFailoverAfterPartitionTest.test-seed#[23EB9BFCF38DAAE]) [ ] o.a.s.c.AbstractFullDistribZkTestBase create jetty 1 in directory /Users/jenkins/workspace/Lucene-Solr-master-MacOSX/solr/build/solr-core/test/J1/temp/solr.cloud.LeaderFailoverAfterPartitionTest_23EB9BFCF38DAAE-001/shard-1-001
    [junit4] 2> 600443 INFO (TEST-LeaderFailoverAfterPartitionTest.test-seed#[23EB9BFCF38DAAE]) [ ] o.e.j.s.Server jetty-9.3.8.v20160314
    [junit4] 2> 600445 INFO (TEST-LeaderFailoverAfterPartitionTest.test-seed#[23EB9BFCF38DAAE]) [ ] o.e.j.s.h.ContextHandler Started o.e.j.s.ServletContextHandler@6e8f681f{/,null,AVAILABLE}
    [junit4] 2> 600445 INFO (TEST-LeaderFailoverAfterPartitionTest.test-seed#[23EB9BFCF38DAAE]) [ ] o.e.j.s.ServerConnector Started ServerConnector@32bb9a07{HTTP/1.1,[http/1.1]}{127.0.0.1:63384}
    [junit4] 2> 600445 INFO (TEST-LeaderFailoverAfterPartitionTest.test-seed#[23EB9BFCF38DAAE]) [ ] o.e.j.s.Server Started @608475ms
    [junit4] 2> 600446 INFO (TEST-LeaderFailoverAfterPartitionTest.test-seed#[23EB9BFCF38DAAE]) [ ] o.a.s.c.s.e.JettySolrRunner Jetty properties: {solr.data.dir=/Users/jenkins/workspace/Lucene-Solr-master-MacOSX/solr/build/solr-core/test/J1/temp/solr.cloud.LeaderFailoverAfterPartitionTest_23EB9BFCF38DAAE-001/tempDir-001/jetty1, solrconfig=solrconfig.xml, hostContext=/, hostPort=63383, coreRootDirectory=/Users/jenkins/workspace/Lucene-Solr-master-MacOSX/solr/build/solr-core/test/J1/temp/solr.cloud.LeaderFailoverAfterPartitionTest_23EB9BFCF38DAAE-001/shard-1-001/cores}
    [junit4] 2> 600446 INFO (TEST-LeaderFailoverAfterPartitionTest.test-seed#[23EB9BFCF38DAAE]) [ ] o.a.s.s.SolrDispatchFilter SolrDispatchFilter.init(): sun.misc.Launcher$AppClassLoader@4554617c
    [junit4] 2> 600446 INFO (TEST-LeaderFailoverAfterPartitionTest.test-seed#[23EB9BFCF38DAAE]) [ ] o.a.s.c.SolrResourceLoader new SolrResourceLoader for directory: '/Users/jenkins/workspace/Lucene-Solr-master-MacOSX/solr/build/solr-core/test/J1/temp/solr.cloud.LeaderFailoverAfterPartitionTest_23EB9BFCF38DAAE-001/shard-1-001'
    [junit4] 2> 600446 INFO (TEST-LeaderFailoverAfterPartitionTest.test-seed#[23EB9BFCF38DAAE]) [ ] o.a.s.c.SolrResourceLoader JNDI not configured for solr (NoInitialContextEx)
    [junit4] 2> 600446 INFO (TEST-LeaderFailoverAfterPartitionTest.test-seed#[23EB9BFCF38DAAE]) [ ] o.a.s.c.SolrResourceLoader solr home defaulted to 'solr/' (could not find system property or JNDI)
    [junit4] 2> 600447 INFO (TEST-LeaderFailoverAfterPartitionTest.test-seed#[23EB9BFCF38DAAE]) [ ] o.a.s.c.c.SolrZkClient Using default ZkCredentialsProvider
    [junit4] 2> 600447 INFO (TEST-LeaderFailoverAfterPartitionTest.test-seed#[23EB9BFCF38DAAE]) [ ] o.a.s.c.c.ConnectionManager Waiting for client to connect to ZooKeeper
    [junit4] 2> 600449 INFO (zkCallback-662-thread-1) [ ] o.a.s.c.c.ConnectionManager Watcher org.apache.solr.common.cloud.ConnectionManager@1bd95b54 name:ZooKeeperConnection Watcher:127.0.0.1:63362/solr got event WatchedEvent state:SyncConnected type:None path:null path:null type:None
    [junit4] 2> 600449 INFO (TEST-LeaderFailoverAfterPartitionTest.test-seed#[23EB9BFCF38DAAE]) [ ] o.a.s.c.c.ConnectionManager Client is connected to ZooKeeper
    [junit4] 2> 600449 INFO (TEST-LeaderFailoverAfterPartitionTest.test-seed#[23EB9BFCF38DAAE]) [ ] o.a.s.c.c.SolrZkClient Using default ZkACLProvider
    [junit4] 2> 600451 INFO (TEST-LeaderFailoverAfterPartitionTest.test-seed#[23EB9BFCF38DAAE]) [ ] o.a.s.s.SolrDispatchFilter Loading solr.xml from SolrHome (not found in ZooKeeper)
    [junit4] 2> 600451 INFO (TEST-LeaderFailoverAfterPartitionTest.test-seed#[23EB9BFCF38DAAE]) [ ] o.a.s.c.SolrXmlConfig Loading container configuration from /Users/jenkins/workspace/Lucene-Solr-master-MacOSX/solr/build/solr-core/test/J1/temp/solr.cloud.LeaderFailoverAfterPartitionTest_23EB9BFCF38DAAE-001/shard-1-001/solr.xml
    [junit4] 2> 600507 INFO (TEST-LeaderFailoverAfterPartitionTest.test-seed#[23EB9BFCF38DAAE]) [ ] o.a.s.c.CorePropertiesLocator Config-defined core root directory: /Users/jenkins/workspace/Lucene-Solr-master-MacOSX/solr/build/solr-core/test/J1/temp/solr.cloud.LeaderFailoverAfterPartitionTest_23EB9BFCF38DAAE-001/shard-1-001/cores
    [junit4] 2> 600508 INFO (TEST-LeaderFailoverAfterPartitionTest.test-seed#[23EB9BFCF38DAAE]) [ ] o.a.s.c.CoreContainer New CoreContainer 1012081016
    [junit4] 2> 600508 INFO (TEST-LeaderFailoverAfterPartitionTest.test-seed#[23EB9BFCF38DAAE]) [ ] o.a.s.c.CoreContainer Loading cores into CoreContainer [instanceDir=/Users/jenkins/workspace/Lucene-Solr-master-MacOSX/solr/build/solr-core/test/J1/temp/solr.cloud.LeaderFailoverAfterPartitionTest_23EB9BFCF38DAAE-001/shard-1-001]
    [junit4] 2> 600508 WARN (TEST-LeaderFailoverAfterPartitionTest.test-seed#[23EB9BFCF38DAAE]) [ ] o.a.s.c.CoreContainer Couldn't add files from /Users/jenkins/workspace/Lucene-Solr-master-MacOSX/solr/build/solr-core/test/J1/temp/solr.cloud.LeaderFailoverAfterPartitionTest_23EB9BFCF38DAAE-001/shard-1-001/lib to classpath: /Users/jenkins/workspace/Lucene-Solr-master-MacOSX/solr/build/solr-core/test/J1/temp/solr.cloud.LeaderFailoverAfterPartitionTest_23EB9BFCF38DAAE-001/shard-1-001/lib
    [junit4] 2> 600508 INFO (TEST-LeaderFailoverAfterPartitionTest.test-seed#[23EB9BFCF38DAAE]) [ ] o.a.s.h.c.HttpShardHandlerFactory created with socketTimeout : 90000,urlScheme : ,connTimeout : 15000,maxConnectionsPerHost : 20,maxConnections : 10000,corePoolSize : 0,maximumPoolSize : 2147483647,maxThreadIdleTime : 5,sizeOfQueue : -1,fairnessPolicy : false,
    [junit4] 2> 600511 INFO (TEST-LeaderFailoverAfterPartitionTest.test-seed#[23EB9BFCF38DAAE]) [ ] o.a.s.u.UpdateShardHandler Creating UpdateShardHandler HTTP client with params:
    [junit4] 2> 600512 INFO (TEST-LeaderFailoverAfterPartitionTest.test-seed#[23EB9BFCF38DAAE]) [ ] o.a.s.l.LogWatcher SLF4J impl is org.slf4j.impl.Log4jLoggerFactory
    [junit4] 2> 600512 INFO (TEST-LeaderFailoverAfterPartitionTest.test-seed#[23EB9BFCF38DAAE]) [ ] o.a.s.l.LogWatcher Registering Log Listener [Log4j (org.slf4j.impl.Log4jLoggerFactory)]
    [junit4] 2> 600512 INFO (TEST-LeaderFailoverAfterPartitionTest.test-seed#[23EB9BFCF38DAAE]) [ ] o.a.s.c.ZkContainer Zookeeper client=127.0.0.1:63362/solr
    [junit4] 2> 600512 INFO (TEST-LeaderFailoverAfterPartitionTest.test-seed#[23EB9BFCF38DAAE]) [ ] o.a.s.c.ZkController zkHost includes chroot
    [junit4] 2> 600512 INFO (TEST-LeaderFailoverAfterPartitionTest.test-seed#[23EB9BFCF38DAAE]) [ ] o.a.s.c.c.SolrZkClient Using default ZkCredentialsProvider
    [junit4] 2> 600513 INFO (TEST-LeaderFailoverAfterPartitionTest.test-seed#[23EB9BFCF38DAAE]) [ ] o.a.s.c.c.ConnectionManager Waiting for client to connect to ZooKeeper
    [junit4] 2> 600514 INFO (zkCallback-665-thread-1) [ ] o.a.s.c.c.ConnectionManager Watcher org.apache.solr.common.cloud.ConnectionManager@6bea9b9e name:ZooKeeperConnection Watcher:127.0.0.1:63362 got event WatchedEvent state:SyncConnected type:None path:null path:null type:None
    [junit4] 2> 600515 INFO (TEST-LeaderFailoverAfterPartitionTest.test-seed#[23EB9BFCF38DAAE]) [ ] o.a.s.c.c.ConnectionManager Client is connected to ZooKeeper
    [junit4] 2> 600515 INFO (TEST-LeaderFailoverAfterPartitionTest.test-seed#[23EB9BFCF38DAAE]) [ ] o.a.s.c.c.SolrZkClient Using default ZkACLProvider
    [junit4] 2> 600517 INFO (TEST-LeaderFailoverAfterPartitionTest.test-seed#[23EB9BFCF38DAAE]) [n:127.0.0.1:63383_ ] o.a.s.c.ZkController Added new OnReconnect listener org.apache.solr.cloud.ZkController$$Lambda$50/209363892@76d66322
    [junit4] 2> 600517 INFO (TEST-LeaderFailoverAfterPartitionTest.test-seed#[23EB9BFCF38DAAE]) [n:127.0.0.1:63383_ ] o.a.s.c.c.ConnectionManager Waiting for client to connect to ZooKeeper
    [junit4] 2> 600519 INFO (zkCallback-666-thread-1-processing-n:127.0.0.1:63383_) [n:127.0.0.1:63383_ ] o.a.s.c.c.ConnectionManager Watcher org.apache.solr.common.cloud.ConnectionManager@63798e69 name:ZooKeeperConnection Watcher:127.0.0.1:63362/solr got event WatchedEvent state:SyncConnected type:None path:null path:null type:None
    [junit4] 2> 600519 INFO (TEST-LeaderFailoverAfterPartitionTest.test-seed#[23EB9BFCF38DAAE]) [n:127.0.0.1:63383_ ] o.a.s.c.c.ConnectionManager Client is connected to ZooKeeper
    [junit4] 2> 600529 INFO (TEST-LeaderFailoverAfterPartitionTest.test-seed#[23EB9BFCF38DAAE]) [n:127.0.0.1:63383_ ] o.a.s.c.c.ZkStateReader Updating cluster state from ZooKeeper...
    [junit4] 2> 600530 INFO (TEST-LeaderFailoverAfterPartitionTest.test-seed#[23EB9BFCF38DAAE]) [n:127.0.0.1:63383_ ] o.a.s.c.c.ZkStateReader Loaded empty cluster properties
    [junit4] 2> 600532 INFO (TEST-LeaderFailoverAfterPartitionTest.test-seed#[23EB9BFCF38DAAE]) [n:127.0.0.1:63383_ ] o.a.s.c.c.ZkStateReader Updated live nodes from ZooKeeper... (0) -> (1)
    [junit4] 2> 600536 INFO (TEST-LeaderFailoverAfterPartitionTest.test-seed#[23EB9BFCF38DAAE]) [n:127.0.0.1:63383_ ] o.a.s.c.Overseer Overseer (id=null) closing
    [junit4] 2> 600537 INFO (TEST-LeaderFailoverAfterPartitionTest.test-seed#[23EB9BFCF38DAAE]) [n:127.0.0.1:63383_ ] o.a.s.c.LeaderElector Joined leadership election with path: /overseer_elect/election/96084970398416905-127.0.0.1:63383_-n_0000000001
    [junit4] 2> 600538 INFO (TEST-LeaderFailoverAfterPartitionTest.test-seed#[23EB9BFCF38DAAE]) [n:127.0.0.1:63383_ ] o.a.s.c.LeaderElector Watching path /overseer_elect/election/96084970398416900-127.0.0.1:63375_-n_0000000000 to know if I could be the leader
    [junit4] 2> 600539 INFO (TEST-LeaderFailoverAfterPartitionTest.test-seed#[23EB9BFCF38DAAE]) [n:127.0.0.1:63383_ ] o.a.s.c.ZkController Publish node=127.0.0.1:63383_ as DOWN
    [junit4] 2> 600543 INFO (OverseerStateUpdate-96084970398416900-127.0.0.1:63375_-n_0000000000) [n:127.0.0.1:63375_ ] o.a.s.c.Overseer processMessage: queueSize: 1, message = {
    [junit4] 2> "operation":"downnode",
    [junit4] 2> "node_name":"127.0.0.1:63383_"} current state version: 3
    [junit4] 2> 600543 INFO (OverseerStateUpdate-96084970398416900-127.0.0.1:63375_-n_0000000000) [n:127.0.0.1:63375_ ] o.a.s.c.o.NodeMutator DownNode state invoked for node: 127.0.0.1:63383_
    [junit4] 2> 600545 INFO (zkCallback-660-thread-1) [ ] o.a.s.c.c.ZkStateReader A cluster state change: [WatchedEvent state:SyncConnected type:NodeDataChanged path:/clusterstate.json], has occurred - updating... (live nodes size: [1])
    [junit4] 2> 600545 INFO (zkCallback-666-thread-1-processing-n:127.0.0.1:63383_) [n:127.0.0.1:63383_ ] o.a.s.c.c.ZkStateReader A cluster state change: [WatchedEvent state:SyncConnected type:NodeDataChanged path:/clusterstate.json], has occurred - updating... (live nodes size: [1])
    [junit4] 2> 600545 INFO (zkCallback-656-thread-1-processing-n:127.0.0.1:63375_) [n:127.0.0.1:63375_ ] o.a.s.c.c.ZkStateReader A cluster state change: [WatchedEvent state:SyncConnected type:NodeDataChanged path:/clusterstate.json], has occurred - updating... (live nodes size: [1])
    [junit4] 2> 600655 INFO (OverseerStateUpdate-96084970398416900-127.0.0.1:63375_-n_0000000000) [n:127.0.0.1:63375_ ] o.a.s.c.o.ZkStateWriter going to update_collection /collections/collection1/state.json version: 0
    [junit4] 2> 601542 INFO (TEST-LeaderFailoverAfterPartitionTest.test-seed#[23EB9BFCF38DAAE]) [n:127.0.0.1:63383_ ] o.a.s.c.ZkController Register node as live in ZooKeeper:/live_nodes/127.0.0.1:63383_
    [junit4] 2> 601544 INFO (TEST-LeaderFailoverAfterPartitionTest.test-seed#[23EB9BFCF38DAAE]) [n:127.0.0.1:63383_ ] o.a.s.c.c.SolrZkClient makePath: /live_nodes/127.0.0.1:63383_
    [junit4] 2> 601546 INFO (zkCallback-660-thread-1) [ ] o.a.s.c.c.ZkStateReader A live node change: [WatchedEvent state:SyncConnected type:NodeChildrenChanged path:/live_nodes], has occurred - updating... (live nodes size: [1])
    [junit4] 2> 601546 INFO (zkCallback-666-thread-1-processing-n:127.0.0.1:63383_) [n:127.0.0.1:63383_ ] o.a.s.c.c.ZkStateReader A live node change: [WatchedEvent state:SyncConnected type:NodeChildrenChanged path:/live_nodes], has occurred - updating... (live nodes size: [1])
    [junit4] 2> 601546 INFO (zkCallback-656-thread-1-processing-n:127.0.0.1:63375_) [n:127.0.0.1:63375_ ] o.a.s.c.c.ZkStateReader A live node change: [WatchedEvent state:SyncConnected type:NodeChildrenChanged path:/live_nodes], has occurred - updating... (live nodes size: [1])
    [junit4] 2> 601546 INFO (zkCallback-660-thread-1) [ ] o.a.s.c.c.ZkStateReader Updated live nodes from ZooKeeper... (1) -> (2)
    [junit4] 2> 601546 INFO (zkCallback-656-thread-1-processing-n:127.0.0.1:63375_) [n:127.0.0.1:63375_ ] o.a.s.c.c.ZkStateReader Updated live nodes from ZooKeeper... (1) -> (2)
    [junit4] 2> 601546 INFO (zkCallback-666-thread-1-processing-n:127.0.0.1:63383_) [n:127.0.0.1:63383_ ] o.a.s.c.c.ZkStateReader Updated live nodes from ZooKeeper... (1) -> (2)
    [junit4] 2> 601569 INFO (TEST-LeaderFailoverAfterPartitionTest.test-seed#[23EB9BFCF38DAAE]) [n:127.0.0.1:63383_ ] o.a.s.c.CoreContainer Security conf doesn't exist. Skipping setup for authorization module.
    [junit4] 2> 601570 INFO (TEST-LeaderFailoverAfterPartitionTest.test-seed#[23EB9BFCF38DAAE]) [n:127.0.0.1:63383_ ] o.a.s.c.CoreContainer No authentication plugin used.
    [junit4] 2> 601570 INFO (TEST-LeaderFailoverAfterPartitionTest.test-seed#[23EB9BFCF38DAAE]) [n:127.0.0.1:63383_ ] o.a.s.c.CorePropertiesLocator Looking for core definitions underneath /Users/jenkins/workspace/Lucene-Solr-master-MacOSX/solr/build/solr-core/test/J1/temp/solr.cloud.LeaderFailoverAfterPartitionTest_23EB9BFCF38DAAE-001/shard-1-001/cores
    [junit4] 2> 601572 INFO (TEST-LeaderFailoverAfterPartitionTest.test-seed#[23EB9BFCF38DAAE]) [n:127.0.0.1:63383_ ] o.a.s.c.CoreDescriptor Created CoreDescriptor: {name=collection1, config=solrconfig.xml, transient=false, schema=schema.xml, loadOnStartup=true, configSetProperties=configsetprops.json, collection=collection1, coreNodeName=, dataDir=data/, shard=}
    [junit4] 2> 601572 INFO (TEST-LeaderFailoverAfterPartitionTest.test-seed#[23EB9BFCF38DAAE]) [n:127.0.0.1:63383_ ] o.a.s.c.CorePropertiesLocator Found core collection1 in /Users/jenkins/workspace/Lucene-Solr-master-MacOSX/solr/build/solr-core/test/J1/temp/solr.cloud.LeaderFailoverAfterPartitionTest_23EB9BFCF38DAAE-001/shard-1-001/cores/collection1
    [junit4] 2> 601572 INFO (TEST-LeaderFailoverAfterPartitionTest.test-seed#[23EB9BFCF38DAAE]) [n:127.0.0.1:63383_ ] o.a.s.c.CorePropertiesLocator Found 1 core definitions
    [junit4] 2> 601573 INFO (TEST-LeaderFailoverAfterPartitionTest.test-seed#[23EB9BFCF38DAAE]) [n:127.0.0.1:63383_ ] o.a.s.s.SolrDispatchFilter user.dir=/Users/jenkins/workspace/Lucene-Solr-master-MacOSX/solr/build/solr-core/test/J1
    [junit4] 2> 601573 INFO (TEST-LeaderFailoverAfterPartitionTest.test-seed#[23EB9BFCF38DAAE]) [n:127.0.0.1:63383_ ] o.a.s.s.SolrDispatchFilter SolrDispatchFilter.init() done
    [junit4] 2> 601573 INFO (coreLoadExecutor-2053-thread-1-processing-n:127.0.0.1:63383_) [n:127.0.0.1:63383_ c:collection1 x:collection1] o.a.s.c.ZkController publishing state=down
    [junit4] 2> 601574 INFO (coreLoadExecutor-2053-thread-1-processing-n:127.0.0.1:63383_) [n:127.0.0.1:63383_ c:collection1 x:collection1] o.a.s.c.ZkController numShards not found on descriptor - reading it from system property
    [junit4] 2> 601575 INFO (coreLoadExecutor-2053-thread-1-processing-n:127.0.0.1:63383_) [n:127.0.0.1:63383_ c:collection1 x:collection1] o.a.s.c.ZkController Registering watch for collection collection1
    [junit4] 2> 601576 INFO (coreLoadExecutor-2053-thread-1-processing-n:127.0.0.1:63383_) [n:127.0.0.1:63383_ c:collection1 x:collection1] o.a.s.c.c.ZkStateReader Add data for [collection1] ver [1]
    [junit4] 2> 601576 INFO (OverseerStateUpdate-96084970398416900-127.0.0.1:63375_-n_0000000000) [n:127.0.0.1:63375_ ] o.a.s.c.Overseer processMessage: queueSize: 1, message = {
    [junit4] 2> "core":"collection1",
    [junit4] 2> "roles":null,
    [junit4] 2> "base_url":"http://127.0.0.1:63383",
    [junit4] 2> "node_name":"127.0.0.1:63383_",
    [junit4] 2> "numShards":"2",
    [junit4] 2> "state":"down",
    [junit4] 2> "shard":null,
    [junit4] 2> "collection":"collection1",
    [junit4] 2> "operation":"state"} current state version: 4
    [junit4] 2> 601576 INFO (OverseerStateUpdate-96084970398416900-127.0.0.1:63375_-n_0000000000) [n:127.0.0.1:63375_ ] o.a.s.c.o.ReplicaMutator Update state numShards=2 message={
    [junit4] 2> "core":"collection1",
    [junit4] 2> "roles":null,
    [junit4] 2> "base_url":"http://127.0.0.1:63383",
    [junit4] 2> "node_name":"127.0.0.1:63383_",
    [junit4] 2> "numShards":"2",
    [junit4] 2> "state":"down",
    [junit4] 2> "shard":null,
    [junit4] 2> "collection":"collection1",
    [junit4] 2> "operation":"state"}
    [junit4] 2> 601576 INFO (coreLoadExecutor-2053-thread-1-processing-n:127.0.0.1:63383_) [n:127.0.0.1:63383_ c:collection1 x:collection1] o.a.s.c.ZkController look for our core node name
    [junit4] 2> 601576 INFO (OverseerStateUpdate-96084970398416900-127.0.0.1:63375_-n_0000000000) [n:127.0.0.1:63375_ ] o.a.s.c.o.ReplicaMutator Collection already exists with numShards=2
    [junit4] 2> 601576 INFO (OverseerStateUpdate-96084970398416900-127.0.0.1:63375_-n_0000000000) [n:127.0.0.1:63375_ ] o.a.s.c.o.ReplicaMutator Assigning new node to shard shard=shard2
    [junit4] 2> 601683 INFO (OverseerStateUpdate-96084970398416900-127.0.0.1:63375_-n_0000000000) [n:127.0.0.1:63375_ ] o.a.s.c.o.ZkStateWriter going to update_collection /collections/collection1/state.json version: 1
    [junit4] 2> 601684 INFO (zkCallback-666-thread-1-processing-n:127.0.0.1:63383_) [n:127.0.0.1:63383_ ] o.a.s.c.c.ZkStateReader A cluster state change: [WatchedEvent state:SyncConnected type:NodeDataChanged path:/collections/collection1/state.json] for collection [collection1] has occurred - updating... (live nodes size: [2])
    [junit4] 2> 601684 INFO (zkCallback-666-thread-1-processing-n:127.0.0.1:63383_) [n:127.0.0.1:63383_ ] o.a.s.c.c.ZkStateReader Updating data for [collection1] from [1] to [2]
    [junit4] 2> 602582 INFO (coreLoadExecutor-2053-thread-1-processing-n:127.0.0.1:63383_) [n:127.0.0.1:63383_ c:collection1 x:collection1] o.a.s.c.ZkController waiting to find shard id in clusterstate for collection1
    [junit4] 2> 602582 INFO (coreLoadExecutor-2053-thread-1-processing-n:127.0.0.1:63383_) [n:127.0.0.1:63383_ c:collection1 x:collection1] o.a.s.c.ZkController Check for collection zkNode:collection1
    [junit4] 2> 602584 INFO (coreLoadExecutor-2053-thread-1-processing-n:127.0.0.1:63383_) [n:127.0.0.1:63383_ c:collection1 x:collection1] o.a.s.c.ZkController Collection zkNode exists
    [junit4] 2> 602584 INFO (coreLoadExecutor-2053-thread-1-processing-n:127.0.0.1:63383_) [n:127.0.0.1:63383_ c:collection1 x:collection1] o.a.s.c.c.ZkStateReader Load collection config from: [/collections/collection1]
    [junit4] 2> 602585 INFO (coreLoadExecutor-2053-thread-1-processing-n:127.0.0.1:63383_) [n:127.0.0.1:63383_ c:collection1 x:collection1] o.a.s.c.c.ZkStateReader path=[/collections/collection1] [configName]=[conf1] specified config exists in ZooKeeper
    [junit4] 2> 602585 INFO (coreLoadExecutor-2053-thread-1-processing-n:127.0.0.1:63383_) [n:127.0.0.1:63383_ c:collection1 x:collection1] o.a.s.c.SolrResourceLoader new SolrResourceLoader for directory: '/Users/jenkins/workspace/Lucene-Solr-master-MacOSX/solr/build/solr-core/test/J1/temp/solr.cloud.LeaderFailoverAfterPartitionTest_23EB9BFCF38DAAE-001/shard-1-001/cores/collection1'
    [junit4] 2> 602585 INFO (coreLoadExecutor-2053-thread-1-processing-n:127.0.0.1:63383_) [n:127.0.0.1:63383_ c:collection1 x:collection1] o.a.s.c.SolrResourceLoader JNDI not configured for solr (NoInitialContextEx)
    [junit4] 2> 602585 INFO (coreLoadExecutor-2053-thread-1-processing-n:127.0.0.1:63383_) [n:127.0.0.1:63383_ c:collection1 x:collection1] o.a.s.c.SolrResourceLoader solr home defaulted to 'solr/' (could not find system property or JNDI)
    [junit4] 2> 602587 INFO (coreLoadExecutor-2053-thread-1-processing-n:127.0.0.1:63383_) [n:127.0.0.1:63383_ c:collection1 x:collection1] o.a.s.c.Config loaded config solrconfig.xml with version 0
    [junit4] 2> 602593 INFO (coreLoadExecutor-2053-thread-1-processing-n:127.0.0.1:63383_) [n:127.0.0.1:63383_ c:collection1 x:collection1] o.a.s.c.SolrConfig current version of requestparams : -1

[...truncated too long message...]

on.cloud.ZkCmdExecutor.retryOperation(ZkCmdExecutor.java:60)
    [junit4] 2> at org.apache.solr.common.cloud.SolrZkClient.delete(SolrZkClient.java:240)
    [junit4] 2> at org.apache.solr.cloud.ElectionContext.cancelElection(ElectionContext.java:86)
    [junit4] 2> at org.apache.solr.cloud.ShardLeaderElectionContextBase.cancelElection(ElectionContext.java:143)
    [junit4] 2> at org.apache.solr.cloud.ShardLeaderElectionContext.cancelElection(ElectionContext.java:279)
    [junit4] 2> at org.apache.solr.cloud.ShardLeaderElectionContext.runLeaderProcess(ElectionContext.java:455)
    [junit4] 2> at org.apache.solr.cloud.LeaderElector.runIamLeaderProcess(LeaderElector.java:170)
    [junit4] 2> at org.apache.solr.cloud.LeaderElector.checkIfIamLeader(LeaderElector.java:135)
    [junit4] 2> at org.apache.solr.cloud.LeaderElector.access$200(LeaderElector.java:56)
    [junit4] 2> at org.apache.solr.cloud.LeaderElector$ElectionWatcher.process(LeaderElector.java:348)
    [junit4] 2> at org.apache.solr.common.cloud.SolrZkClient$3.lambda$process$0(SolrZkClient.java:265)
    [junit4] 2> at java.util.concurrent.Executors$RunnableAdapter.call(Executors.java:511)
    [junit4] 2> at java.util.concurrent.FutureTask.run(FutureTask.java:266)
    [junit4] 2> at org.apache.solr.common.util.ExecutorUtil$MDCAwareThreadPoolExecutor.lambda$execute$0(ExecutorUtil.java:229)
    [junit4] 2> at java.util.concurrent.ThreadPoolExecutor.runWorker(ThreadPoolExecutor.java:1142)
    [junit4] 2> at java.util.concurrent.ThreadPoolExecutor$Worker.run(ThreadPoolExecutor.java:617)
    [junit4] 2> at java.lang.Thread.run(Thread.java:745)
    [junit4] 2> 721945 INFO (TEST-LeaderFailoverAfterPartitionTest.test-seed#[23EB9BFCF38DAAE]) [ ] o.e.j.s.ServerConnector Stopped ServerConnector@7131c9a0{HTTP/1.1,[http/1.1]}{127.0.0.1:0}
    [junit4] 2> 721946 INFO (TEST-LeaderFailoverAfterPartitionTest.test-seed#[23EB9BFCF38DAAE]) [ ] o.e.j.s.h.ContextHandler Stopped o.e.j.s.ServletContextHandler@24f5ffeb{/,null,UNAVAILABLE}
    [junit4] 2> 721948 INFO (TEST-LeaderFailoverAfterPartitionTest.test-seed#[23EB9BFCF38DAAE]) [ ] o.a.s.c.ZkTestServer connecting to 127.0.0.1:63362 63362
    [junit4] 2> 722039 INFO (Thread-1277) [ ] o.a.s.c.ZkTestServer connecting to 127.0.0.1:63362 63362
    [junit4] 2> 723621 WARN (Thread-1277) [ ] o.a.s.c.ZkTestServer Watch limit violations:
    [junit4] 2> Maximum concurrent create/delete watches above limit:
    [junit4] 2>
    [junit4] 2> 5 /solr/aliases.json
    [junit4] 2> 5 /solr/clusterprops.json
    [junit4] 2> 4 /solr/security.json
    [junit4] 2> 4 /solr/configs/conf1
    [junit4] 2>
    [junit4] 2> Maximum concurrent data watches above limit:
    [junit4] 2>
    [junit4] 2> 5 /solr/clusterstate.json
    [junit4] 2> 3 /solr/collections/c8n_1x3_lf/state.json
    [junit4] 2> 3 /solr/collections/collection1/state.json
    [junit4] 2>
    [junit4] 2> Maximum concurrent children watches above limit:
    [junit4] 2>
    [junit4] 2> 120 /solr/overseer/collection-queue-work
    [junit4] 2> 64 /solr/overseer/queue
    [junit4] 2> 21 /solr/overseer/queue-work
    [junit4] 2> 5 /solr/live_nodes
    [junit4] 2> 5 /solr/collections
    [junit4] 2>
    [junit4] 2> 723623 WARN (TEST-LeaderFailoverAfterPartitionTest.test-seed#[23EB9BFCF38DAAE]) [ ] o.a.s.c.SocketProxy Closing 0 connections to: http://127.0.0.1:63375/, target: http://127.0.0.1:63376/
    [junit4] 2> 723623 WARN (TEST-LeaderFailoverAfterPartitionTest.test-seed#[23EB9BFCF38DAAE]) [ ] o.a.s.c.SocketProxy Closing 1 connections to: http://127.0.0.1:63391/, target: http://127.0.0.1:63392/
    [junit4] 2> 723625 WARN (TEST-LeaderFailoverAfterPartitionTest.test-seed#[23EB9BFCF38DAAE]) [ ] o.a.s.c.SocketProxy Closing 6 connections to: http://127.0.0.1:63383/, target: http://127.0.0.1:63384/
    [junit4] 2> 723626 WARN (TEST-LeaderFailoverAfterPartitionTest.test-seed#[23EB9BFCF38DAAE]) [ ] o.a.s.c.SocketProxy Closing 6 connections to: http://127.0.0.1:63397/, target: http://127.0.0.1:63398/
    [junit4] 2> NOTE: reproduce with: ant test -Dtestcase=LeaderFailoverAfterPartitionTest -Dtests.method=test -Dtests.seed=23EB9BFCF38DAAE -Dtests.slow=true -Dtests.locale=da -Dtests.timezone=Indian/Maldives -Dtests.asserts=true -Dtests.file.encoding=US-ASCII
    [junit4] FAILURE 126s J1 | LeaderFailoverAfterPartitionTest.test <<<
    [junit4] > Throwable #1: java.lang.AssertionError: Expected 2 of 3 replicas to be active but only found 1; [core_node3:{"core":"c8n_1x3_lf_shard1_replica1","base_url":"http://127.0.0.1:63397","node_name":"127.0.0.1:63397_","state":"active","leader":"true"}]; clusterState: DocCollection(c8n_1x3_lf)={
    [junit4] > "replicationFactor":"3",
    [junit4] > "shards":{"shard1":{
    [junit4] > "range":"80000000-7fffffff",
    [junit4] > "state":"active",
    [junit4] > "replicas":{
    [junit4] > "core_node1":{
    [junit4] > "core":"c8n_1x3_lf_shard1_replica3",
    [junit4] > "base_url":"http://127.0.0.1:63375",
    [junit4] > "node_name":"127.0.0.1:63375_",
    [junit4] > "state":"down"},
    [junit4] > "core_node2":{
    [junit4] > "state":"down",
    [junit4] > "base_url":"http://127.0.0.1:63391",
    [junit4] > "core":"c8n_1x3_lf_shard1_replica2",
    [junit4] > "node_name":"127.0.0.1:63391_"},
    [junit4] > "core_node3":{
    [junit4] > "core":"c8n_1x3_lf_shard1_replica1",
    [junit4] > "base_url":"http://127.0.0.1:63397",
    [junit4] > "node_name":"127.0.0.1:63397_",
    [junit4] > "state":"active",
    [junit4] > "leader":"true"}}}},
    [junit4] > "router":{"name":"compositeId"},
    [junit4] > "maxShardsPerNode":"1",
    [junit4] > "autoAddReplicas":"false"}
    [junit4] > at __randomizedtesting.SeedInfo.seed([23EB9BFCF38DAAE:8A6A866561C4B756]:0)
    [junit4] > at org.apache.solr.cloud.LeaderFailoverAfterPartitionTest.testRf3WithLeaderFailover(LeaderFailoverAfterPartitionTest.java:170)
    [junit4] > at org.apache.solr.cloud.LeaderFailoverAfterPartitionTest.test(LeaderFailoverAfterPartitionTest.java:57)
    [junit4] > at org.apache.solr.BaseDistributedSearchTestCase$ShardsRepeatRule$ShardsFixedStatement.callStatement(BaseDistributedSearchTestCase.java:985)
    [junit4] > at org.apache.solr.BaseDistributedSearchTestCase$ShardsRepeatRule$ShardsStatement.evaluate(BaseDistributedSearchTestCase.java:960)
    [junit4] > at java.lang.Thread.run(Thread.java:745)
    [junit4] 2> 723629 INFO (SUITE-LeaderFailoverAfterPartitionTest-seed#[23EB9BFCF38DAAE]-worker) [ ] o.a.s.SolrTestCaseJ4 ###deleteCore
    [junit4] 2> NOTE: leaving temporary files on disk at: /Users/jenkins/workspace/Lucene-Solr-master-MacOSX/solr/build/solr-core/test/J1/temp/solr.cloud.LeaderFailoverAfterPartitionTest_23EB9BFCF38DAAE-001
    [junit4] 2> NOTE: test params are: codec=Asserting(Lucene62), sim=RandomSimilarity(queryNorm=false,coord=no): {}, locale=da, timezone=Indian/Maldives
    [junit4] 2> NOTE: Mac OS X 10.11.5 x86_64/Oracle Corporation 1.8.0_92 (64-bit)/cpus=3,threads=1,free=89565784,total=355991552
    [junit4] 2> NOTE: All tests run in this JVM: [TestInitQParser, NoCacheHeaderTest, TestJsonFacets, ShardSplitTest, TestDistribDocBasedVersion, BasicDistributedZk2Test, SolrCmdDistributorTest, TestSolr4Spatial, ChangedSchemaMergeTest, ExitableDirectoryReaderTest, ClassificationUpdateProcessorFactoryTest, DistributedIntervalFacetingTest, RestartWhileUpdatingTest, TestUseDocValuesAsStored2, DirectSolrConnectionTest, SpellCheckComponentTest, LoggingHandlerTest, UniqFieldsUpdateProcessorFactoryTest, TestNumericTerms64, TestManagedSchema, DeleteStatusTest, TestQuerySenderListener, SuggesterWFSTTest, PluginInfoTest, OverriddenZkACLAndCredentialsProvidersTest, ConnectionReuseTest, BlobRepositoryCloudTest, OpenCloseCoreStressTest, TestIntervalFaceting, TestDocBasedVersionConstraints, BaseCdcrDistributedZkTest, StatsComponentTest, TestTrieFacet, TestConfigSetsAPI, TestOverriddenPrefixQueryForCustomFieldType, HLLUtilTest, OpenExchangeRatesOrgProviderTest, TestCloudPivotFacet, TestRebalanceLeaders, TestDocTermOrds, MinimalSchemaTest, TestConfigSetImmutable, TestSolrIndexConfig, AutoCommitTest, HdfsDirectoryTest, TestCrossCoreJoin, TestCSVResponseWriter, BigEndianAscendingWordDeserializerTest, SpatialRPTFieldTypeTest, BlockDirectoryTest, TestRequestForwarding, LeaderFailoverAfterPartitionTest]
    [junit4] Completed [144/614 (1!)] on J1 in 125.83s, 1 test, 1 failure <<< FAILURES!

[...truncated 1504 lines...]
BUILD FAILED
/Users/jenkins/workspace/Lucene-Solr-master-MacOSX/build.xml:740: The following error occurred while executing this line:
/Users/jenkins/workspace/Lucene-Solr-master-MacOSX/build.xml:684: The following error occurred while executing this line:
/Users/jenkins/workspace/Lucene-Solr-master-MacOSX/build.xml:59: The following error occurred while executing this line:
/Users/jenkins/workspace/Lucene-Solr-master-MacOSX/solr/build.xml:233: The following error occurred while executing this line:
/Users/jenkins/workspace/Lucene-Solr-master-MacOSX/solr/common-build.xml:531: The following error occurred while executing this line:
/Users/jenkins/workspace/Lucene-Solr-master-MacOSX/lucene/common-build.xml:1427: The following error occurred while executing this line:
/Users/jenkins/workspace/Lucene-Solr-master-MacOSX/lucene/common-build.xml:984: There were test failures: 614 suites (10 ignored), 2584 tests, 1 failure, 122 ignored (72 assumptions) [seed: 23EB9BFCF38DAAE]

Total time: 79 minutes 56 seconds
Build step 'Invoke Ant' marked build as failure
Archiving artifacts
[WARNINGS] Skipping publisher since build result is FAILURE
Recording test results
Email was triggered for: Failure - Any
Sending email for trigger: Failure - Any

Search Discussions

Related Discussions

Discussion Navigation
viewthread | post
posts ‹ prev | 1 of 1 | next ›
Discussion Overview
groupdev @
categorieslucene
postedJun 17, '16 at 5:58a
activeJun 17, '16 at 5:58a
posts1
users1
websitelucene.apache.org

1 user in discussion

Policeman Jenkins Server: 1 post

People

Translate

site design / logo © 2017 Grokbase