Grokbase Groups Lucene dev June 2016
FAQ
Build: http://jenkins.thetaphi.de/job/Lucene-Solr-5.5-Windows/84/
Java: 64bit/jdk1.8.0_92 -XX:+UseCompressedOops -XX:+UseParallelGC

4 tests failed.
FAILED: org.apache.lucene.search.TestBoolean2.testQueries01

Error Message:
hits1 doc nrs for hit 0 expected:<4240> but was:<6289>

Stack Trace:
junit.framework.AssertionFailedError: hits1 doc nrs for hit 0 expected:<4240> but was:[A7B8C09A76BE9E0:1725CA7A32170208]:0)
  at junit.framework.Assert.fail(Assert.java:50)
  at junit.framework.Assert.failNotEquals(Assert.java:287)
  at junit.framework.Assert.assertEquals(Assert.java:67)
  at junit.framework.Assert.assertEquals(Assert.java:199)
  at org.apache.lucene.search.CheckHits.checkDocIds(CheckHits.java:190)
  at org.apache.lucene.search.CheckHits.checkHitsQuery(CheckHits.java:203)
  at org.apache.lucene.search.TestBoolean2.queriesTest(TestBoolean2.java:192)
  at org.apache.lucene.search.TestBoolean2.testQueries01(TestBoolean2.java:226)
  at sun.reflect.NativeMethodAccessorImpl.invoke0(Native Method)
  at sun.reflect.NativeMethodAccessorImpl.invoke(NativeMethodAccessorImpl.java:62)
  at sun.reflect.DelegatingMethodAccessorImpl.invoke(DelegatingMethodAccessorImpl.java:43)
  at java.lang.reflect.Method.invoke(Method.java:498)
  at com.carrotsearch.randomizedtesting.RandomizedRunner.invoke(RandomizedRunner.java:1764)
  at com.carrotsearch.randomizedtesting.RandomizedRunner$8.evaluate(RandomizedRunner.java:871)
  at com.carrotsearch.randomizedtesting.RandomizedRunner$9.evaluate(RandomizedRunner.java:907)
  at com.carrotsearch.randomizedtesting.RandomizedRunner$10.evaluate(RandomizedRunner.java:921)
  at org.apache.lucene.util.TestRuleSetupTeardownChained$1.evaluate(TestRuleSetupTeardownChained.java:49)
  at org.apache.lucene.util.AbstractBeforeAfterRule$1.evaluate(AbstractBeforeAfterRule.java:45)
  at org.apache.lucene.util.TestRuleThreadAndTestName$1.evaluate(TestRuleThreadAndTestName.java:48)
  at org.apache.lucene.util.TestRuleIgnoreAfterMaxFailures$1.evaluate(TestRuleIgnoreAfterMaxFailures.java:64)
  at org.apache.lucene.util.TestRuleMarkFailure$1.evaluate(TestRuleMarkFailure.java:47)
  at com.carrotsearch.randomizedtesting.rules.StatementAdapter.evaluate(StatementAdapter.java:36)
  at com.carrotsearch.randomizedtesting.ThreadLeakControl$StatementRunner.run(ThreadLeakControl.java:367)
  at com.carrotsearch.randomizedtesting.ThreadLeakControl.forkTimeoutingTask(ThreadLeakControl.java:809)
  at com.carrotsearch.randomizedtesting.ThreadLeakControl$3.evaluate(ThreadLeakControl.java:460)
  at com.carrotsearch.randomizedtesting.RandomizedRunner.runSingleTest(RandomizedRunner.java:880)
  at com.carrotsearch.randomizedtesting.RandomizedRunner$5.evaluate(RandomizedRunner.java:781)
  at com.carrotsearch.randomizedtesting.RandomizedRunner$6.evaluate(RandomizedRunner.java:816)
  at com.carrotsearch.randomizedtesting.RandomizedRunner$7.evaluate(RandomizedRunner.java:827)
  at org.apache.lucene.util.AbstractBeforeAfterRule$1.evaluate(AbstractBeforeAfterRule.java:45)
  at com.carrotsearch.randomizedtesting.rules.StatementAdapter.evaluate(StatementAdapter.java:36)
  at org.apache.lucene.util.TestRuleStoreClassName$1.evaluate(TestRuleStoreClassName.java:41)
  at com.carrotsearch.randomizedtesting.rules.NoShadowingOrOverridesOnMethodsRule$1.evaluate(NoShadowingOrOverridesOnMethodsRule.java:40)
  at com.carrotsearch.randomizedtesting.rules.NoShadowingOrOverridesOnMethodsRule$1.evaluate(NoShadowingOrOverridesOnMethodsRule.java:40)
  at com.carrotsearch.randomizedtesting.rules.StatementAdapter.evaluate(StatementAdapter.java:36)
  at com.carrotsearch.randomizedtesting.rules.StatementAdapter.evaluate(StatementAdapter.java:36)
  at com.carrotsearch.randomizedtesting.rules.StatementAdapter.evaluate(StatementAdapter.java:36)
  at org.apache.lucene.util.TestRuleAssertionsRequired$1.evaluate(TestRuleAssertionsRequired.java:53)
  at org.apache.lucene.util.TestRuleMarkFailure$1.evaluate(TestRuleMarkFailure.java:47)
  at org.apache.lucene.util.TestRuleIgnoreAfterMaxFailures$1.evaluate(TestRuleIgnoreAfterMaxFailures.java:64)
  at org.apache.lucene.util.TestRuleIgnoreTestSuites$1.evaluate(TestRuleIgnoreTestSuites.java:54)
  at com.carrotsearch.randomizedtesting.rules.StatementAdapter.evaluate(StatementAdapter.java:36)
  at com.carrotsearch.randomizedtesting.ThreadLeakControl$StatementRunner.run(ThreadLeakControl.java:367)
  at java.lang.Thread.run(Thread.java:745)


FAILED: org.apache.lucene.search.TestBoolean2.testQueries03

Error Message:
hits1 doc nrs for hit 0 expected:<4240> but was:<6289>

Stack Trace:
junit.framework.AssertionFailedError: hits1 doc nrs for hit 0 expected:<4240> but was:[A7B8C09A76BE9E0:4F9E323F47BDA860]:0)
  at junit.framework.Assert.fail(Assert.java:50)
  at junit.framework.Assert.failNotEquals(Assert.java:287)
  at junit.framework.Assert.assertEquals(Assert.java:67)
  at junit.framework.Assert.assertEquals(Assert.java:199)
  at org.apache.lucene.search.CheckHits.checkDocIds(CheckHits.java:190)
  at org.apache.lucene.search.CheckHits.checkHitsQuery(CheckHits.java:203)
  at org.apache.lucene.search.TestBoolean2.queriesTest(TestBoolean2.java:192)
  at org.apache.lucene.search.TestBoolean2.testQueries03(TestBoolean2.java:246)
  at sun.reflect.NativeMethodAccessorImpl.invoke0(Native Method)
  at sun.reflect.NativeMethodAccessorImpl.invoke(NativeMethodAccessorImpl.java:62)
  at sun.reflect.DelegatingMethodAccessorImpl.invoke(DelegatingMethodAccessorImpl.java:43)
  at java.lang.reflect.Method.invoke(Method.java:498)
  at com.carrotsearch.randomizedtesting.RandomizedRunner.invoke(RandomizedRunner.java:1764)
  at com.carrotsearch.randomizedtesting.RandomizedRunner$8.evaluate(RandomizedRunner.java:871)
  at com.carrotsearch.randomizedtesting.RandomizedRunner$9.evaluate(RandomizedRunner.java:907)
  at com.carrotsearch.randomizedtesting.RandomizedRunner$10.evaluate(RandomizedRunner.java:921)
  at org.apache.lucene.util.TestRuleSetupTeardownChained$1.evaluate(TestRuleSetupTeardownChained.java:49)
  at org.apache.lucene.util.AbstractBeforeAfterRule$1.evaluate(AbstractBeforeAfterRule.java:45)
  at org.apache.lucene.util.TestRuleThreadAndTestName$1.evaluate(TestRuleThreadAndTestName.java:48)
  at org.apache.lucene.util.TestRuleIgnoreAfterMaxFailures$1.evaluate(TestRuleIgnoreAfterMaxFailures.java:64)
  at org.apache.lucene.util.TestRuleMarkFailure$1.evaluate(TestRuleMarkFailure.java:47)
  at com.carrotsearch.randomizedtesting.rules.StatementAdapter.evaluate(StatementAdapter.java:36)
  at com.carrotsearch.randomizedtesting.ThreadLeakControl$StatementRunner.run(ThreadLeakControl.java:367)
  at com.carrotsearch.randomizedtesting.ThreadLeakControl.forkTimeoutingTask(ThreadLeakControl.java:809)
  at com.carrotsearch.randomizedtesting.ThreadLeakControl$3.evaluate(ThreadLeakControl.java:460)
  at com.carrotsearch.randomizedtesting.RandomizedRunner.runSingleTest(RandomizedRunner.java:880)
  at com.carrotsearch.randomizedtesting.RandomizedRunner$5.evaluate(RandomizedRunner.java:781)
  at com.carrotsearch.randomizedtesting.RandomizedRunner$6.evaluate(RandomizedRunner.java:816)
  at com.carrotsearch.randomizedtesting.RandomizedRunner$7.evaluate(RandomizedRunner.java:827)
  at org.apache.lucene.util.AbstractBeforeAfterRule$1.evaluate(AbstractBeforeAfterRule.java:45)
  at com.carrotsearch.randomizedtesting.rules.StatementAdapter.evaluate(StatementAdapter.java:36)
  at org.apache.lucene.util.TestRuleStoreClassName$1.evaluate(TestRuleStoreClassName.java:41)
  at com.carrotsearch.randomizedtesting.rules.NoShadowingOrOverridesOnMethodsRule$1.evaluate(NoShadowingOrOverridesOnMethodsRule.java:40)
  at com.carrotsearch.randomizedtesting.rules.NoShadowingOrOverridesOnMethodsRule$1.evaluate(NoShadowingOrOverridesOnMethodsRule.java:40)
  at com.carrotsearch.randomizedtesting.rules.StatementAdapter.evaluate(StatementAdapter.java:36)
  at com.carrotsearch.randomizedtesting.rules.StatementAdapter.evaluate(StatementAdapter.java:36)
  at com.carrotsearch.randomizedtesting.rules.StatementAdapter.evaluate(StatementAdapter.java:36)
  at org.apache.lucene.util.TestRuleAssertionsRequired$1.evaluate(TestRuleAssertionsRequired.java:53)
  at org.apache.lucene.util.TestRuleMarkFailure$1.evaluate(TestRuleMarkFailure.java:47)
  at org.apache.lucene.util.TestRuleIgnoreAfterMaxFailures$1.evaluate(TestRuleIgnoreAfterMaxFailures.java:64)
  at org.apache.lucene.util.TestRuleIgnoreTestSuites$1.evaluate(TestRuleIgnoreTestSuites.java:54)
  at com.carrotsearch.randomizedtesting.rules.StatementAdapter.evaluate(StatementAdapter.java:36)
  at com.carrotsearch.randomizedtesting.ThreadLeakControl$StatementRunner.run(ThreadLeakControl.java:367)
  at java.lang.Thread.run(Thread.java:745)


FAILED: org.apache.lucene.search.TestBoolean2.testQueries08

Error Message:
hits1 doc nrs for hit 0 expected:<4240> but was:<6289>

Stack Trace:
junit.framework.AssertionFailedError: hits1 doc nrs for hit 0 expected:<4240> but was:[A7B8C09A76BE9E0:369F779C308420C9]:0)
  at junit.framework.Assert.fail(Assert.java:50)
  at junit.framework.Assert.failNotEquals(Assert.java:287)
  at junit.framework.Assert.assertEquals(Assert.java:67)
  at junit.framework.Assert.assertEquals(Assert.java:199)
  at org.apache.lucene.search.CheckHits.checkDocIds(CheckHits.java:190)
  at org.apache.lucene.search.CheckHits.checkHitsQuery(CheckHits.java:203)
  at org.apache.lucene.search.TestBoolean2.queriesTest(TestBoolean2.java:192)
  at org.apache.lucene.search.TestBoolean2.testQueries08(TestBoolean2.java:299)
  at sun.reflect.NativeMethodAccessorImpl.invoke0(Native Method)
  at sun.reflect.NativeMethodAccessorImpl.invoke(NativeMethodAccessorImpl.java:62)
  at sun.reflect.DelegatingMethodAccessorImpl.invoke(DelegatingMethodAccessorImpl.java:43)
  at java.lang.reflect.Method.invoke(Method.java:498)
  at com.carrotsearch.randomizedtesting.RandomizedRunner.invoke(RandomizedRunner.java:1764)
  at com.carrotsearch.randomizedtesting.RandomizedRunner$8.evaluate(RandomizedRunner.java:871)
  at com.carrotsearch.randomizedtesting.RandomizedRunner$9.evaluate(RandomizedRunner.java:907)
  at com.carrotsearch.randomizedtesting.RandomizedRunner$10.evaluate(RandomizedRunner.java:921)
  at org.apache.lucene.util.TestRuleSetupTeardownChained$1.evaluate(TestRuleSetupTeardownChained.java:49)
  at org.apache.lucene.util.AbstractBeforeAfterRule$1.evaluate(AbstractBeforeAfterRule.java:45)
  at org.apache.lucene.util.TestRuleThreadAndTestName$1.evaluate(TestRuleThreadAndTestName.java:48)
  at org.apache.lucene.util.TestRuleIgnoreAfterMaxFailures$1.evaluate(TestRuleIgnoreAfterMaxFailures.java:64)
  at org.apache.lucene.util.TestRuleMarkFailure$1.evaluate(TestRuleMarkFailure.java:47)
  at com.carrotsearch.randomizedtesting.rules.StatementAdapter.evaluate(StatementAdapter.java:36)
  at com.carrotsearch.randomizedtesting.ThreadLeakControl$StatementRunner.run(ThreadLeakControl.java:367)
  at com.carrotsearch.randomizedtesting.ThreadLeakControl.forkTimeoutingTask(ThreadLeakControl.java:809)
  at com.carrotsearch.randomizedtesting.ThreadLeakControl$3.evaluate(ThreadLeakControl.java:460)
  at com.carrotsearch.randomizedtesting.RandomizedRunner.runSingleTest(RandomizedRunner.java:880)
  at com.carrotsearch.randomizedtesting.RandomizedRunner$5.evaluate(RandomizedRunner.java:781)
  at com.carrotsearch.randomizedtesting.RandomizedRunner$6.evaluate(RandomizedRunner.java:816)
  at com.carrotsearch.randomizedtesting.RandomizedRunner$7.evaluate(RandomizedRunner.java:827)
  at org.apache.lucene.util.AbstractBeforeAfterRule$1.evaluate(AbstractBeforeAfterRule.java:45)
  at com.carrotsearch.randomizedtesting.rules.StatementAdapter.evaluate(StatementAdapter.java:36)
  at org.apache.lucene.util.TestRuleStoreClassName$1.evaluate(TestRuleStoreClassName.java:41)
  at com.carrotsearch.randomizedtesting.rules.NoShadowingOrOverridesOnMethodsRule$1.evaluate(NoShadowingOrOverridesOnMethodsRule.java:40)
  at com.carrotsearch.randomizedtesting.rules.NoShadowingOrOverridesOnMethodsRule$1.evaluate(NoShadowingOrOverridesOnMethodsRule.java:40)
  at com.carrotsearch.randomizedtesting.rules.StatementAdapter.evaluate(StatementAdapter.java:36)
  at com.carrotsearch.randomizedtesting.rules.StatementAdapter.evaluate(StatementAdapter.java:36)
  at com.carrotsearch.randomizedtesting.rules.StatementAdapter.evaluate(StatementAdapter.java:36)
  at org.apache.lucene.util.TestRuleAssertionsRequired$1.evaluate(TestRuleAssertionsRequired.java:53)
  at org.apache.lucene.util.TestRuleMarkFailure$1.evaluate(TestRuleMarkFailure.java:47)
  at org.apache.lucene.util.TestRuleIgnoreAfterMaxFailures$1.evaluate(TestRuleIgnoreAfterMaxFailures.java:64)
  at org.apache.lucene.util.TestRuleIgnoreTestSuites$1.evaluate(TestRuleIgnoreTestSuites.java:54)
  at com.carrotsearch.randomizedtesting.rules.StatementAdapter.evaluate(StatementAdapter.java:36)
  at com.carrotsearch.randomizedtesting.ThreadLeakControl$StatementRunner.run(ThreadLeakControl.java:367)
  at java.lang.Thread.run(Thread.java:745)


FAILED: org.apache.lucene.search.TestBoolean2.testQueries02

Error Message:
hits1 doc nrs for hit 0 expected:<4240> but was:<6289>

Stack Trace:
junit.framework.AssertionFailedError: hits1 doc nrs for hit 0 expected:<4240> but was:[A7B8C09A76BE9E0:797A8F466C57CD7F]:0)
  at junit.framework.Assert.fail(Assert.java:50)
  at junit.framework.Assert.failNotEquals(Assert.java:287)
  at junit.framework.Assert.assertEquals(Assert.java:67)
  at junit.framework.Assert.assertEquals(Assert.java:199)
  at org.apache.lucene.search.CheckHits.checkDocIds(CheckHits.java:190)
  at org.apache.lucene.search.CheckHits.checkHitsQuery(CheckHits.java:203)
  at org.apache.lucene.search.TestBoolean2.queriesTest(TestBoolean2.java:192)
  at org.apache.lucene.search.TestBoolean2.testQueries02(TestBoolean2.java:236)
  at sun.reflect.NativeMethodAccessorImpl.invoke0(Native Method)
  at sun.reflect.NativeMethodAccessorImpl.invoke(NativeMethodAccessorImpl.java:62)
  at sun.reflect.DelegatingMethodAccessorImpl.invoke(DelegatingMethodAccessorImpl.java:43)
  at java.lang.reflect.Method.invoke(Method.java:498)
  at com.carrotsearch.randomizedtesting.RandomizedRunner.invoke(RandomizedRunner.java:1764)
  at com.carrotsearch.randomizedtesting.RandomizedRunner$8.evaluate(RandomizedRunner.java:871)
  at com.carrotsearch.randomizedtesting.RandomizedRunner$9.evaluate(RandomizedRunner.java:907)
  at com.carrotsearch.randomizedtesting.RandomizedRunner$10.evaluate(RandomizedRunner.java:921)
  at org.apache.lucene.util.TestRuleSetupTeardownChained$1.evaluate(TestRuleSetupTeardownChained.java:49)
  at org.apache.lucene.util.AbstractBeforeAfterRule$1.evaluate(AbstractBeforeAfterRule.java:45)
  at org.apache.lucene.util.TestRuleThreadAndTestName$1.evaluate(TestRuleThreadAndTestName.java:48)
  at org.apache.lucene.util.TestRuleIgnoreAfterMaxFailures$1.evaluate(TestRuleIgnoreAfterMaxFailures.java:64)
  at org.apache.lucene.util.TestRuleMarkFailure$1.evaluate(TestRuleMarkFailure.java:47)
  at com.carrotsearch.randomizedtesting.rules.StatementAdapter.evaluate(StatementAdapter.java:36)
  at com.carrotsearch.randomizedtesting.ThreadLeakControl$StatementRunner.run(ThreadLeakControl.java:367)
  at com.carrotsearch.randomizedtesting.ThreadLeakControl.forkTimeoutingTask(ThreadLeakControl.java:809)
  at com.carrotsearch.randomizedtesting.ThreadLeakControl$3.evaluate(ThreadLeakControl.java:460)
  at com.carrotsearch.randomizedtesting.RandomizedRunner.runSingleTest(RandomizedRunner.java:880)
  at com.carrotsearch.randomizedtesting.RandomizedRunner$5.evaluate(RandomizedRunner.java:781)
  at com.carrotsearch.randomizedtesting.RandomizedRunner$6.evaluate(RandomizedRunner.java:816)
  at com.carrotsearch.randomizedtesting.RandomizedRunner$7.evaluate(RandomizedRunner.java:827)
  at org.apache.lucene.util.AbstractBeforeAfterRule$1.evaluate(AbstractBeforeAfterRule.java:45)
  at com.carrotsearch.randomizedtesting.rules.StatementAdapter.evaluate(StatementAdapter.java:36)
  at org.apache.lucene.util.TestRuleStoreClassName$1.evaluate(TestRuleStoreClassName.java:41)
  at com.carrotsearch.randomizedtesting.rules.NoShadowingOrOverridesOnMethodsRule$1.evaluate(NoShadowingOrOverridesOnMethodsRule.java:40)
  at com.carrotsearch.randomizedtesting.rules.NoShadowingOrOverridesOnMethodsRule$1.evaluate(NoShadowingOrOverridesOnMethodsRule.java:40)
  at com.carrotsearch.randomizedtesting.rules.StatementAdapter.evaluate(StatementAdapter.java:36)
  at com.carrotsearch.randomizedtesting.rules.StatementAdapter.evaluate(StatementAdapter.java:36)
  at com.carrotsearch.randomizedtesting.rules.StatementAdapter.evaluate(StatementAdapter.java:36)
  at org.apache.lucene.util.TestRuleAssertionsRequired$1.evaluate(TestRuleAssertionsRequired.java:53)
  at org.apache.lucene.util.TestRuleMarkFailure$1.evaluate(TestRuleMarkFailure.java:47)
  at org.apache.lucene.util.TestRuleIgnoreAfterMaxFailures$1.evaluate(TestRuleIgnoreAfterMaxFailures.java:64)
  at org.apache.lucene.util.TestRuleIgnoreTestSuites$1.evaluate(TestRuleIgnoreTestSuites.java:54)
  at com.carrotsearch.randomizedtesting.rules.StatementAdapter.evaluate(StatementAdapter.java:36)
  at com.carrotsearch.randomizedtesting.ThreadLeakControl$StatementRunner.run(ThreadLeakControl.java:367)
  at java.lang.Thread.run(Thread.java:745)




Build Log:
[...truncated 1334 lines...]
    [junit4] Suite: org.apache.lucene.search.TestBoolean2
    [junit4] 2> NOTE: reproduce with: ant test -Dtestcase=TestBoolean2 -Dtests.method=testQueries01 -Dtests.seed=A7B8C09A76BE9E0 -Dtests.slow=true -Dtests.locale=sl-SI -Dtests.timezone=SystemV/CST6CDT -Dtests.asserts=true -Dtests.file.encoding=ISO-8859-1
    [junit4] FAILURE 0.01s J0 | TestBoolean2.testQueries01 <<<
    [junit4] > Throwable #1: junit.framework.AssertionFailedError: hits1 doc nrs for hit 0 expected:<4240> but was:<6289>
    [junit4] > at __randomizedtesting.SeedInfo.seed([A7B8C09A76BE9E0:1725CA7A32170208]:0)
    [junit4] > at junit.framework.Assert.fail(Assert.java:50)
    [junit4] > at junit.framework.Assert.failNotEquals(Assert.java:287)
    [junit4] > at junit.framework.Assert.assertEquals(Assert.java:67)
    [junit4] > at junit.framework.Assert.assertEquals(Assert.java:199)
    [junit4] > at org.apache.lucene.search.CheckHits.checkDocIds(CheckHits.java:190)
    [junit4] > at org.apache.lucene.search.CheckHits.checkHitsQuery(CheckHits.java:203)
    [junit4] > at org.apache.lucene.search.TestBoolean2.queriesTest(TestBoolean2.java:192)
    [junit4] > at org.apache.lucene.search.TestBoolean2.testQueries01(TestBoolean2.java:226)
    [junit4] > at java.lang.Thread.run(Thread.java:745)
    [junit4] 2> NOTE: reproduce with: ant test -Dtestcase=TestBoolean2 -Dtests.method=testQueries03 -Dtests.seed=A7B8C09A76BE9E0 -Dtests.slow=true -Dtests.locale=sl-SI -Dtests.timezone=SystemV/CST6CDT -Dtests.asserts=true -Dtests.file.encoding=ISO-8859-1
    [junit4] FAILURE 0.00s J0 | TestBoolean2.testQueries03 <<<
    [junit4] > Throwable #1: junit.framework.AssertionFailedError: hits1 doc nrs for hit 0 expected:<4240> but was:<6289>
    [junit4] > at __randomizedtesting.SeedInfo.seed([A7B8C09A76BE9E0:4F9E323F47BDA860]:0)
    [junit4] > at junit.framework.Assert.fail(Assert.java:50)
    [junit4] > at junit.framework.Assert.failNotEquals(Assert.java:287)
    [junit4] > at junit.framework.Assert.assertEquals(Assert.java:67)
    [junit4] > at junit.framework.Assert.assertEquals(Assert.java:199)
    [junit4] > at org.apache.lucene.search.CheckHits.checkDocIds(CheckHits.java:190)
    [junit4] > at org.apache.lucene.search.CheckHits.checkHitsQuery(CheckHits.java:203)
    [junit4] > at org.apache.lucene.search.TestBoolean2.queriesTest(TestBoolean2.java:192)
    [junit4] > at org.apache.lucene.search.TestBoolean2.testQueries03(TestBoolean2.java:246)
    [junit4] > at java.lang.Thread.run(Thread.java:745)
    [junit4] 2> NOTE: reproduce with: ant test -Dtestcase=TestBoolean2 -Dtests.method=testQueries08 -Dtests.seed=A7B8C09A76BE9E0 -Dtests.slow=true -Dtests.locale=sl-SI -Dtests.timezone=SystemV/CST6CDT -Dtests.asserts=true -Dtests.file.encoding=ISO-8859-1
    [junit4] FAILURE 0.00s J0 | TestBoolean2.testQueries08 <<<
    [junit4] > Throwable #1: junit.framework.AssertionFailedError: hits1 doc nrs for hit 0 expected:<4240> but was:<6289>
    [junit4] > at __randomizedtesting.SeedInfo.seed([A7B8C09A76BE9E0:369F779C308420C9]:0)
    [junit4] > at junit.framework.Assert.fail(Assert.java:50)
    [junit4] > at junit.framework.Assert.failNotEquals(Assert.java:287)
    [junit4] > at junit.framework.Assert.assertEquals(Assert.java:67)
    [junit4] > at junit.framework.Assert.assertEquals(Assert.java:199)
    [junit4] > at org.apache.lucene.search.CheckHits.checkDocIds(CheckHits.java:190)
    [junit4] > at org.apache.lucene.search.CheckHits.checkHitsQuery(CheckHits.java:203)
    [junit4] > at org.apache.lucene.search.TestBoolean2.queriesTest(TestBoolean2.java:192)
    [junit4] > at org.apache.lucene.search.TestBoolean2.testQueries08(TestBoolean2.java:299)
    [junit4] > at java.lang.Thread.run(Thread.java:745)
    [junit4] 2> NOTE: reproduce with: ant test -Dtestcase=TestBoolean2 -Dtests.method=testQueries02 -Dtests.seed=A7B8C09A76BE9E0 -Dtests.slow=true -Dtests.locale=sl-SI -Dtests.timezone=SystemV/CST6CDT -Dtests.asserts=true -Dtests.file.encoding=ISO-8859-1
    [junit4] FAILURE 0.00s J0 | TestBoolean2.testQueries02 <<<
    [junit4] > Throwable #1: junit.framework.AssertionFailedError: hits1 doc nrs for hit 0 expected:<4240> but was:<6289>
    [junit4] > at __randomizedtesting.SeedInfo.seed([A7B8C09A76BE9E0:797A8F466C57CD7F]:0)
    [junit4] > at junit.framework.Assert.fail(Assert.java:50)
    [junit4] > at junit.framework.Assert.failNotEquals(Assert.java:287)
    [junit4] > at junit.framework.Assert.assertEquals(Assert.java:67)
    [junit4] > at junit.framework.Assert.assertEquals(Assert.java:199)
    [junit4] > at org.apache.lucene.search.CheckHits.checkDocIds(CheckHits.java:190)
    [junit4] > at org.apache.lucene.search.CheckHits.checkHitsQuery(CheckHits.java:203)
    [junit4] > at org.apache.lucene.search.TestBoolean2.queriesTest(TestBoolean2.java:192)
    [junit4] > at org.apache.lucene.search.TestBoolean2.testQueries02(TestBoolean2.java:236)
    [junit4] > at java.lang.Thread.run(Thread.java:745)
    [junit4] 2> NOTE: test params are: codec=Asserting(Lucene54): {field=Lucene50(blocksize=128), field2=Lucene50(blocksize=128)}, docValues:{}, sim=RandomSimilarity(queryNorm=true,coord=no): {field=DFR I(n)L1, field2=DFR I(F)LZ(0.3)}, locale=sl-SI, timezone=SystemV/CST6CDT
    [junit4] 2> NOTE: Windows 10 10.0 amd64/Oracle Corporation 1.8.0_92 (64-bit)/cpus=3,threads=1,free=147643120,total=316669952
    [junit4] 2> NOTE: All tests run in this JVM: [TestDirectoryReaderReopen, TestIndexWriterNRTIsCurrent, TestSimpleAttributeImpl, TestFuzzyQuery, TestMultiPhraseQuery, TestMultiTermQueryRewrites, TestScorerPerf, TestSubScorerFreqs, TestComplexExplanationsOfNonMatches, TestPayloadsOnVectors, TestOmitTf, TestAutomatonQuery, TestSortedSetSortField, TestIndexInput, TestCharTermAttributeImpl, TestSloppyPhraseQuery2, TestIndexWriterOnJRECrash, TestNorms, TestIndexWriterDeleteByQuery, TestConcurrentMergeScheduler, TestSort, TestTransactions, TestFlushByRamOrCountsPolicy, TestInPlaceMergeSorter, TestSleepingLockWrapper, Test2BSortedDocValuesFixedSorted, TestRollingBuffer, TestExitableDirectoryReader, TestRollingUpdates, TestEarlyTermination, TestRollback, TestLucene50StoredFieldsFormat, Test2BNumericDocValues, TestPositiveScoresOnlyCollector, TestSparseFixedBitSet, TestNIOFSDirectory, TestDocCount, TestFilterLeafReader, TestDocBoost, TestMultiTermsEnum, TestParallelTermEnum, TestMultiThreadTermVectors, TestWeakIdentityMap, TestSpanOrQuery, TestDuelingCodecs, TestPriorityQueue, TestLazyProxSkipping, TestCollectionUtil, TestStressIndexing2, TestIndexWriterWithThreads, TestMaxTermFrequency, TestDeletionPolicy, TestPerFieldPostingsFormat2, TestDocsAndPositions, TestLRUQueryCache, TestTryDelete, TestRoaringDocIdSet, TestCodecUtil, TestReadOnlyIndex, TestSimilarityBase, TestIndexableField, TestPhraseQuery, TestMaxPosition, TestFieldMaskingSpanQuery, TestBitDocIdSetBuilder, TestHugeRamFile, TestSegmentInfos, Test2BTerms, TestSmallFloat, TestIndexWriterDelete, TestSpanNearQuery, TestNeedsScores, TestIntroSorter, TestSimpleExplanationsOfNonMatches, TestLucene50FieldInfoFormat, TestBM25Similarity, TestSortRandom, TestMixedCodecs, TestVersion, TestDeterminizeLexicon, TestReusableStringReader, TestFSTs, TestTerm, TestTermScorer, TestControlledRealTimeReopenThread, TestBooleanRewrites, TestBlockPostingsFormat2, TestCachingTokenFilter, TestTermsEnum, TestSimpleFSLockFactory, TestLiveFieldValues, TestWildcardRandom, TestCloseableThreadLocal, TestSpanCollection, TestNumericTokenStream, TestReaderClosed, TestDuelingCodecsAtNight, TestSimilarity, TestNumericDocValuesUpdates, TestBufferedIndexInput, TestOfflineSorter, TestUTF32ToUTF8, TestByteBlockPool, TestIndexWriterOnVMError, TestTransactionRollback, TestIndexWriterReader, TestIndexWriterMerging, TestShardSearching, TestSearcherManager, TestBooleanOr, TestBasics, TestBoolean2]
    [junit4] Completed [349/422 (1!)] on J0 in 99.17s, 11 tests, 4 failures <<< FAILURES!

[...truncated 258 lines...]
BUILD FAILED
C:\Users\jenkins\workspace\Lucene-Solr-5.5-Windows\build.xml:750: The following error occurred while executing this line:
C:\Users\jenkins\workspace\Lucene-Solr-5.5-Windows\build.xml:694: The following error occurred while executing this line:
C:\Users\jenkins\workspace\Lucene-Solr-5.5-Windows\build.xml:59: The following error occurred while executing this line:
C:\Users\jenkins\workspace\Lucene-Solr-5.5-Windows\lucene\build.xml:50: The following error occurred while executing this line:
C:\Users\jenkins\workspace\Lucene-Solr-5.5-Windows\lucene\common-build.xml:1477: The following error occurred while executing this line:
C:\Users\jenkins\workspace\Lucene-Solr-5.5-Windows\lucene\common-build.xml:1033: There were test failures: 422 suites (1 ignored), 3464 tests, 4 failures, 61 ignored (57 assumptions) [seed: A7B8C09A76BE9E0]

Total time: 8 minutes 26 seconds
Build step 'Invoke Ant' marked build as failure
Archiving artifacts
[WARNINGS] Skipping publisher since build result is FAILURE
Recording test results
Email was triggered for: Failure - Any
Sending email for trigger: Failure - Any

Search Discussions

Discussion Posts

Previous

Related Discussions

Discussion Navigation
viewthread | post
posts ‹ prev | 3 of 3 | next ›
Discussion Overview
groupdev @
categorieslucene
postedJun 16, '16 at 5:49a
activeJun 17, '16 at 4:36a
posts3
users1
websitelucene.apache.org

1 user in discussion

Policeman Jenkins Server: 3 posts

People

Translate

site design / logo © 2017 Grokbase