Grokbase Groups Lucene dev June 2016
FAQ
Build: http://jenkins.thetaphi.de/job/Lucene-Solr-5.5-Linux/294/
Java: 32bit/jdk1.8.0_92 -server -XX:+UseG1GC

4 tests failed.
FAILED: org.apache.lucene.search.TestBoolean2.testQueries03

Error Message:
hits1 doc nrs for hit 0 expected:<4381> but was:<6430>

Stack Trace:
junit.framework.AssertionFailedError: hits1 doc nrs for hit 0 expected:<4381> but was:[55D8DFC8BCFC02AB:103D61FE5C2A432B]:0)
  at junit.framework.Assert.fail(Assert.java:50)
  at junit.framework.Assert.failNotEquals(Assert.java:287)
  at junit.framework.Assert.assertEquals(Assert.java:67)
  at junit.framework.Assert.assertEquals(Assert.java:199)
  at org.apache.lucene.search.CheckHits.checkDocIds(CheckHits.java:190)
  at org.apache.lucene.search.CheckHits.checkHitsQuery(CheckHits.java:203)
  at org.apache.lucene.search.TestBoolean2.queriesTest(TestBoolean2.java:192)
  at org.apache.lucene.search.TestBoolean2.testQueries03(TestBoolean2.java:246)
  at sun.reflect.NativeMethodAccessorImpl.invoke0(Native Method)
  at sun.reflect.NativeMethodAccessorImpl.invoke(NativeMethodAccessorImpl.java:62)
  at sun.reflect.DelegatingMethodAccessorImpl.invoke(DelegatingMethodAccessorImpl.java:43)
  at java.lang.reflect.Method.invoke(Method.java:498)
  at com.carrotsearch.randomizedtesting.RandomizedRunner.invoke(RandomizedRunner.java:1764)
  at com.carrotsearch.randomizedtesting.RandomizedRunner$8.evaluate(RandomizedRunner.java:871)
  at com.carrotsearch.randomizedtesting.RandomizedRunner$9.evaluate(RandomizedRunner.java:907)
  at com.carrotsearch.randomizedtesting.RandomizedRunner$10.evaluate(RandomizedRunner.java:921)
  at org.apache.lucene.util.TestRuleSetupTeardownChained$1.evaluate(TestRuleSetupTeardownChained.java:49)
  at org.apache.lucene.util.AbstractBeforeAfterRule$1.evaluate(AbstractBeforeAfterRule.java:45)
  at org.apache.lucene.util.TestRuleThreadAndTestName$1.evaluate(TestRuleThreadAndTestName.java:48)
  at org.apache.lucene.util.TestRuleIgnoreAfterMaxFailures$1.evaluate(TestRuleIgnoreAfterMaxFailures.java:64)
  at org.apache.lucene.util.TestRuleMarkFailure$1.evaluate(TestRuleMarkFailure.java:47)
  at com.carrotsearch.randomizedtesting.rules.StatementAdapter.evaluate(StatementAdapter.java:36)
  at com.carrotsearch.randomizedtesting.ThreadLeakControl$StatementRunner.run(ThreadLeakControl.java:367)
  at com.carrotsearch.randomizedtesting.ThreadLeakControl.forkTimeoutingTask(ThreadLeakControl.java:809)
  at com.carrotsearch.randomizedtesting.ThreadLeakControl$3.evaluate(ThreadLeakControl.java:460)
  at com.carrotsearch.randomizedtesting.RandomizedRunner.runSingleTest(RandomizedRunner.java:880)
  at com.carrotsearch.randomizedtesting.RandomizedRunner$5.evaluate(RandomizedRunner.java:781)
  at com.carrotsearch.randomizedtesting.RandomizedRunner$6.evaluate(RandomizedRunner.java:816)
  at com.carrotsearch.randomizedtesting.RandomizedRunner$7.evaluate(RandomizedRunner.java:827)
  at org.apache.lucene.util.AbstractBeforeAfterRule$1.evaluate(AbstractBeforeAfterRule.java:45)
  at com.carrotsearch.randomizedtesting.rules.StatementAdapter.evaluate(StatementAdapter.java:36)
  at org.apache.lucene.util.TestRuleStoreClassName$1.evaluate(TestRuleStoreClassName.java:41)
  at com.carrotsearch.randomizedtesting.rules.NoShadowingOrOverridesOnMethodsRule$1.evaluate(NoShadowingOrOverridesOnMethodsRule.java:40)
  at com.carrotsearch.randomizedtesting.rules.NoShadowingOrOverridesOnMethodsRule$1.evaluate(NoShadowingOrOverridesOnMethodsRule.java:40)
  at com.carrotsearch.randomizedtesting.rules.StatementAdapter.evaluate(StatementAdapter.java:36)
  at com.carrotsearch.randomizedtesting.rules.StatementAdapter.evaluate(StatementAdapter.java:36)
  at com.carrotsearch.randomizedtesting.rules.StatementAdapter.evaluate(StatementAdapter.java:36)
  at org.apache.lucene.util.TestRuleAssertionsRequired$1.evaluate(TestRuleAssertionsRequired.java:53)
  at org.apache.lucene.util.TestRuleMarkFailure$1.evaluate(TestRuleMarkFailure.java:47)
  at org.apache.lucene.util.TestRuleIgnoreAfterMaxFailures$1.evaluate(TestRuleIgnoreAfterMaxFailures.java:64)
  at org.apache.lucene.util.TestRuleIgnoreTestSuites$1.evaluate(TestRuleIgnoreTestSuites.java:54)
  at com.carrotsearch.randomizedtesting.rules.StatementAdapter.evaluate(StatementAdapter.java:36)
  at com.carrotsearch.randomizedtesting.ThreadLeakControl$StatementRunner.run(ThreadLeakControl.java:367)
  at java.lang.Thread.run(Thread.java:745)


FAILED: org.apache.lucene.search.TestBoolean2.testQueries02

Error Message:
hits1 doc nrs for hit 0 expected:<4381> but was:<6430>

Stack Trace:
junit.framework.AssertionFailedError: hits1 doc nrs for hit 0 expected:<4381> but was:[55D8DFC8BCFC02AB:26D9DC8777C02634]:0)
  at junit.framework.Assert.fail(Assert.java:50)
  at junit.framework.Assert.failNotEquals(Assert.java:287)
  at junit.framework.Assert.assertEquals(Assert.java:67)
  at junit.framework.Assert.assertEquals(Assert.java:199)
  at org.apache.lucene.search.CheckHits.checkDocIds(CheckHits.java:190)
  at org.apache.lucene.search.CheckHits.checkHitsQuery(CheckHits.java:203)
  at org.apache.lucene.search.TestBoolean2.queriesTest(TestBoolean2.java:192)
  at org.apache.lucene.search.TestBoolean2.testQueries02(TestBoolean2.java:236)
  at sun.reflect.NativeMethodAccessorImpl.invoke0(Native Method)
  at sun.reflect.NativeMethodAccessorImpl.invoke(NativeMethodAccessorImpl.java:62)
  at sun.reflect.DelegatingMethodAccessorImpl.invoke(DelegatingMethodAccessorImpl.java:43)
  at java.lang.reflect.Method.invoke(Method.java:498)
  at com.carrotsearch.randomizedtesting.RandomizedRunner.invoke(RandomizedRunner.java:1764)
  at com.carrotsearch.randomizedtesting.RandomizedRunner$8.evaluate(RandomizedRunner.java:871)
  at com.carrotsearch.randomizedtesting.RandomizedRunner$9.evaluate(RandomizedRunner.java:907)
  at com.carrotsearch.randomizedtesting.RandomizedRunner$10.evaluate(RandomizedRunner.java:921)
  at org.apache.lucene.util.TestRuleSetupTeardownChained$1.evaluate(TestRuleSetupTeardownChained.java:49)
  at org.apache.lucene.util.AbstractBeforeAfterRule$1.evaluate(AbstractBeforeAfterRule.java:45)
  at org.apache.lucene.util.TestRuleThreadAndTestName$1.evaluate(TestRuleThreadAndTestName.java:48)
  at org.apache.lucene.util.TestRuleIgnoreAfterMaxFailures$1.evaluate(TestRuleIgnoreAfterMaxFailures.java:64)
  at org.apache.lucene.util.TestRuleMarkFailure$1.evaluate(TestRuleMarkFailure.java:47)
  at com.carrotsearch.randomizedtesting.rules.StatementAdapter.evaluate(StatementAdapter.java:36)
  at com.carrotsearch.randomizedtesting.ThreadLeakControl$StatementRunner.run(ThreadLeakControl.java:367)
  at com.carrotsearch.randomizedtesting.ThreadLeakControl.forkTimeoutingTask(ThreadLeakControl.java:809)
  at com.carrotsearch.randomizedtesting.ThreadLeakControl$3.evaluate(ThreadLeakControl.java:460)
  at com.carrotsearch.randomizedtesting.RandomizedRunner.runSingleTest(RandomizedRunner.java:880)
  at com.carrotsearch.randomizedtesting.RandomizedRunner$5.evaluate(RandomizedRunner.java:781)
  at com.carrotsearch.randomizedtesting.RandomizedRunner$6.evaluate(RandomizedRunner.java:816)
  at com.carrotsearch.randomizedtesting.RandomizedRunner$7.evaluate(RandomizedRunner.java:827)
  at org.apache.lucene.util.AbstractBeforeAfterRule$1.evaluate(AbstractBeforeAfterRule.java:45)
  at com.carrotsearch.randomizedtesting.rules.StatementAdapter.evaluate(StatementAdapter.java:36)
  at org.apache.lucene.util.TestRuleStoreClassName$1.evaluate(TestRuleStoreClassName.java:41)
  at com.carrotsearch.randomizedtesting.rules.NoShadowingOrOverridesOnMethodsRule$1.evaluate(NoShadowingOrOverridesOnMethodsRule.java:40)
  at com.carrotsearch.randomizedtesting.rules.NoShadowingOrOverridesOnMethodsRule$1.evaluate(NoShadowingOrOverridesOnMethodsRule.java:40)
  at com.carrotsearch.randomizedtesting.rules.StatementAdapter.evaluate(StatementAdapter.java:36)
  at com.carrotsearch.randomizedtesting.rules.StatementAdapter.evaluate(StatementAdapter.java:36)
  at com.carrotsearch.randomizedtesting.rules.StatementAdapter.evaluate(StatementAdapter.java:36)
  at org.apache.lucene.util.TestRuleAssertionsRequired$1.evaluate(TestRuleAssertionsRequired.java:53)
  at org.apache.lucene.util.TestRuleMarkFailure$1.evaluate(TestRuleMarkFailure.java:47)
  at org.apache.lucene.util.TestRuleIgnoreAfterMaxFailures$1.evaluate(TestRuleIgnoreAfterMaxFailures.java:64)
  at org.apache.lucene.util.TestRuleIgnoreTestSuites$1.evaluate(TestRuleIgnoreTestSuites.java:54)
  at com.carrotsearch.randomizedtesting.rules.StatementAdapter.evaluate(StatementAdapter.java:36)
  at com.carrotsearch.randomizedtesting.ThreadLeakControl$StatementRunner.run(ThreadLeakControl.java:367)
  at java.lang.Thread.run(Thread.java:745)


FAILED: org.apache.lucene.search.TestBoolean2.testQueries08

Error Message:
hits1 doc nrs for hit 0 expected:<4381> but was:<6430>

Stack Trace:
junit.framework.AssertionFailedError: hits1 doc nrs for hit 0 expected:<4381> but was:[55D8DFC8BCFC02AB:693C245D2B13CB82]:0)
  at junit.framework.Assert.fail(Assert.java:50)
  at junit.framework.Assert.failNotEquals(Assert.java:287)
  at junit.framework.Assert.assertEquals(Assert.java:67)
  at junit.framework.Assert.assertEquals(Assert.java:199)
  at org.apache.lucene.search.CheckHits.checkDocIds(CheckHits.java:190)
  at org.apache.lucene.search.CheckHits.checkHitsQuery(CheckHits.java:203)
  at org.apache.lucene.search.TestBoolean2.queriesTest(TestBoolean2.java:192)
  at org.apache.lucene.search.TestBoolean2.testQueries08(TestBoolean2.java:299)
  at sun.reflect.NativeMethodAccessorImpl.invoke0(Native Method)
  at sun.reflect.NativeMethodAccessorImpl.invoke(NativeMethodAccessorImpl.java:62)
  at sun.reflect.DelegatingMethodAccessorImpl.invoke(DelegatingMethodAccessorImpl.java:43)
  at java.lang.reflect.Method.invoke(Method.java:498)
  at com.carrotsearch.randomizedtesting.RandomizedRunner.invoke(RandomizedRunner.java:1764)
  at com.carrotsearch.randomizedtesting.RandomizedRunner$8.evaluate(RandomizedRunner.java:871)
  at com.carrotsearch.randomizedtesting.RandomizedRunner$9.evaluate(RandomizedRunner.java:907)
  at com.carrotsearch.randomizedtesting.RandomizedRunner$10.evaluate(RandomizedRunner.java:921)
  at org.apache.lucene.util.TestRuleSetupTeardownChained$1.evaluate(TestRuleSetupTeardownChained.java:49)
  at org.apache.lucene.util.AbstractBeforeAfterRule$1.evaluate(AbstractBeforeAfterRule.java:45)
  at org.apache.lucene.util.TestRuleThreadAndTestName$1.evaluate(TestRuleThreadAndTestName.java:48)
  at org.apache.lucene.util.TestRuleIgnoreAfterMaxFailures$1.evaluate(TestRuleIgnoreAfterMaxFailures.java:64)
  at org.apache.lucene.util.TestRuleMarkFailure$1.evaluate(TestRuleMarkFailure.java:47)
  at com.carrotsearch.randomizedtesting.rules.StatementAdapter.evaluate(StatementAdapter.java:36)
  at com.carrotsearch.randomizedtesting.ThreadLeakControl$StatementRunner.run(ThreadLeakControl.java:367)
  at com.carrotsearch.randomizedtesting.ThreadLeakControl.forkTimeoutingTask(ThreadLeakControl.java:809)
  at com.carrotsearch.randomizedtesting.ThreadLeakControl$3.evaluate(ThreadLeakControl.java:460)
  at com.carrotsearch.randomizedtesting.RandomizedRunner.runSingleTest(RandomizedRunner.java:880)
  at com.carrotsearch.randomizedtesting.RandomizedRunner$5.evaluate(RandomizedRunner.java:781)
  at com.carrotsearch.randomizedtesting.RandomizedRunner$6.evaluate(RandomizedRunner.java:816)
  at com.carrotsearch.randomizedtesting.RandomizedRunner$7.evaluate(RandomizedRunner.java:827)
  at org.apache.lucene.util.AbstractBeforeAfterRule$1.evaluate(AbstractBeforeAfterRule.java:45)
  at com.carrotsearch.randomizedtesting.rules.StatementAdapter.evaluate(StatementAdapter.java:36)
  at org.apache.lucene.util.TestRuleStoreClassName$1.evaluate(TestRuleStoreClassName.java:41)
  at com.carrotsearch.randomizedtesting.rules.NoShadowingOrOverridesOnMethodsRule$1.evaluate(NoShadowingOrOverridesOnMethodsRule.java:40)
  at com.carrotsearch.randomizedtesting.rules.NoShadowingOrOverridesOnMethodsRule$1.evaluate(NoShadowingOrOverridesOnMethodsRule.java:40)
  at com.carrotsearch.randomizedtesting.rules.StatementAdapter.evaluate(StatementAdapter.java:36)
  at com.carrotsearch.randomizedtesting.rules.StatementAdapter.evaluate(StatementAdapter.java:36)
  at com.carrotsearch.randomizedtesting.rules.StatementAdapter.evaluate(StatementAdapter.java:36)
  at org.apache.lucene.util.TestRuleAssertionsRequired$1.evaluate(TestRuleAssertionsRequired.java:53)
  at org.apache.lucene.util.TestRuleMarkFailure$1.evaluate(TestRuleMarkFailure.java:47)
  at org.apache.lucene.util.TestRuleIgnoreAfterMaxFailures$1.evaluate(TestRuleIgnoreAfterMaxFailures.java:64)
  at org.apache.lucene.util.TestRuleIgnoreTestSuites$1.evaluate(TestRuleIgnoreTestSuites.java:54)
  at com.carrotsearch.randomizedtesting.rules.StatementAdapter.evaluate(StatementAdapter.java:36)
  at com.carrotsearch.randomizedtesting.ThreadLeakControl$StatementRunner.run(ThreadLeakControl.java:367)
  at java.lang.Thread.run(Thread.java:745)


FAILED: org.apache.lucene.search.TestBoolean2.testQueries01

Error Message:
hits1 doc nrs for hit 0 expected:<4381> but was:<6430>

Stack Trace:
junit.framework.AssertionFailedError: hits1 doc nrs for hit 0 expected:<4381> but was:[55D8DFC8BCFC02AB:488699BB2980E943]:0)
  at junit.framework.Assert.fail(Assert.java:50)
  at junit.framework.Assert.failNotEquals(Assert.java:287)
  at junit.framework.Assert.assertEquals(Assert.java:67)
  at junit.framework.Assert.assertEquals(Assert.java:199)
  at org.apache.lucene.search.CheckHits.checkDocIds(CheckHits.java:190)
  at org.apache.lucene.search.CheckHits.checkHitsQuery(CheckHits.java:203)
  at org.apache.lucene.search.TestBoolean2.queriesTest(TestBoolean2.java:192)
  at org.apache.lucene.search.TestBoolean2.testQueries01(TestBoolean2.java:226)
  at sun.reflect.NativeMethodAccessorImpl.invoke0(Native Method)
  at sun.reflect.NativeMethodAccessorImpl.invoke(NativeMethodAccessorImpl.java:62)
  at sun.reflect.DelegatingMethodAccessorImpl.invoke(DelegatingMethodAccessorImpl.java:43)
  at java.lang.reflect.Method.invoke(Method.java:498)
  at com.carrotsearch.randomizedtesting.RandomizedRunner.invoke(RandomizedRunner.java:1764)
  at com.carrotsearch.randomizedtesting.RandomizedRunner$8.evaluate(RandomizedRunner.java:871)
  at com.carrotsearch.randomizedtesting.RandomizedRunner$9.evaluate(RandomizedRunner.java:907)
  at com.carrotsearch.randomizedtesting.RandomizedRunner$10.evaluate(RandomizedRunner.java:921)
  at org.apache.lucene.util.TestRuleSetupTeardownChained$1.evaluate(TestRuleSetupTeardownChained.java:49)
  at org.apache.lucene.util.AbstractBeforeAfterRule$1.evaluate(AbstractBeforeAfterRule.java:45)
  at org.apache.lucene.util.TestRuleThreadAndTestName$1.evaluate(TestRuleThreadAndTestName.java:48)
  at org.apache.lucene.util.TestRuleIgnoreAfterMaxFailures$1.evaluate(TestRuleIgnoreAfterMaxFailures.java:64)
  at org.apache.lucene.util.TestRuleMarkFailure$1.evaluate(TestRuleMarkFailure.java:47)
  at com.carrotsearch.randomizedtesting.rules.StatementAdapter.evaluate(StatementAdapter.java:36)
  at com.carrotsearch.randomizedtesting.ThreadLeakControl$StatementRunner.run(ThreadLeakControl.java:367)
  at com.carrotsearch.randomizedtesting.ThreadLeakControl.forkTimeoutingTask(ThreadLeakControl.java:809)
  at com.carrotsearch.randomizedtesting.ThreadLeakControl$3.evaluate(ThreadLeakControl.java:460)
  at com.carrotsearch.randomizedtesting.RandomizedRunner.runSingleTest(RandomizedRunner.java:880)
  at com.carrotsearch.randomizedtesting.RandomizedRunner$5.evaluate(RandomizedRunner.java:781)
  at com.carrotsearch.randomizedtesting.RandomizedRunner$6.evaluate(RandomizedRunner.java:816)
  at com.carrotsearch.randomizedtesting.RandomizedRunner$7.evaluate(RandomizedRunner.java:827)
  at org.apache.lucene.util.AbstractBeforeAfterRule$1.evaluate(AbstractBeforeAfterRule.java:45)
  at com.carrotsearch.randomizedtesting.rules.StatementAdapter.evaluate(StatementAdapter.java:36)
  at org.apache.lucene.util.TestRuleStoreClassName$1.evaluate(TestRuleStoreClassName.java:41)
  at com.carrotsearch.randomizedtesting.rules.NoShadowingOrOverridesOnMethodsRule$1.evaluate(NoShadowingOrOverridesOnMethodsRule.java:40)
  at com.carrotsearch.randomizedtesting.rules.NoShadowingOrOverridesOnMethodsRule$1.evaluate(NoShadowingOrOverridesOnMethodsRule.java:40)
  at com.carrotsearch.randomizedtesting.rules.StatementAdapter.evaluate(StatementAdapter.java:36)
  at com.carrotsearch.randomizedtesting.rules.StatementAdapter.evaluate(StatementAdapter.java:36)
  at com.carrotsearch.randomizedtesting.rules.StatementAdapter.evaluate(StatementAdapter.java:36)
  at org.apache.lucene.util.TestRuleAssertionsRequired$1.evaluate(TestRuleAssertionsRequired.java:53)
  at org.apache.lucene.util.TestRuleMarkFailure$1.evaluate(TestRuleMarkFailure.java:47)
  at org.apache.lucene.util.TestRuleIgnoreAfterMaxFailures$1.evaluate(TestRuleIgnoreAfterMaxFailures.java:64)
  at org.apache.lucene.util.TestRuleIgnoreTestSuites$1.evaluate(TestRuleIgnoreTestSuites.java:54)
  at com.carrotsearch.randomizedtesting.rules.StatementAdapter.evaluate(StatementAdapter.java:36)
  at com.carrotsearch.randomizedtesting.ThreadLeakControl$StatementRunner.run(ThreadLeakControl.java:367)
  at java.lang.Thread.run(Thread.java:745)




Build Log:
[...truncated 278 lines...]
    [junit4] Suite: org.apache.lucene.search.TestBoolean2
    [junit4] 2> NOTE: reproduce with: ant test -Dtestcase=TestBoolean2 -Dtests.method=testQueries03 -Dtests.seed=55D8DFC8BCFC02AB -Dtests.multiplier=3 -Dtests.slow=true -Dtests.locale=fr-LU -Dtests.timezone=Asia/Yakutsk -Dtests.asserts=true -Dtests.file.encoding=US-ASCII
    [junit4] FAILURE 0.02s J1 | TestBoolean2.testQueries03 <<<
    [junit4] > Throwable #1: junit.framework.AssertionFailedError: hits1 doc nrs for hit 0 expected:<4381> but was:<6430>
    [junit4] > at __randomizedtesting.SeedInfo.seed([55D8DFC8BCFC02AB:103D61FE5C2A432B]:0)
    [junit4] > at junit.framework.Assert.fail(Assert.java:50)
    [junit4] > at junit.framework.Assert.failNotEquals(Assert.java:287)
    [junit4] > at junit.framework.Assert.assertEquals(Assert.java:67)
    [junit4] > at junit.framework.Assert.assertEquals(Assert.java:199)
    [junit4] > at org.apache.lucene.search.CheckHits.checkDocIds(CheckHits.java:190)
    [junit4] > at org.apache.lucene.search.CheckHits.checkHitsQuery(CheckHits.java:203)
    [junit4] > at org.apache.lucene.search.TestBoolean2.queriesTest(TestBoolean2.java:192)
    [junit4] > at org.apache.lucene.search.TestBoolean2.testQueries03(TestBoolean2.java:246)
    [junit4] > at java.lang.Thread.run(Thread.java:745)
    [junit4] 2> NOTE: reproduce with: ant test -Dtestcase=TestBoolean2 -Dtests.method=testQueries02 -Dtests.seed=55D8DFC8BCFC02AB -Dtests.multiplier=3 -Dtests.slow=true -Dtests.locale=fr-LU -Dtests.timezone=Asia/Yakutsk -Dtests.asserts=true -Dtests.file.encoding=US-ASCII
    [junit4] FAILURE 0.01s J1 | TestBoolean2.testQueries02 <<<
    [junit4] > Throwable #1: junit.framework.AssertionFailedError: hits1 doc nrs for hit 0 expected:<4381> but was:<6430>
    [junit4] > at __randomizedtesting.SeedInfo.seed([55D8DFC8BCFC02AB:26D9DC8777C02634]:0)
    [junit4] > at junit.framework.Assert.fail(Assert.java:50)
    [junit4] > at junit.framework.Assert.failNotEquals(Assert.java:287)
    [junit4] > at junit.framework.Assert.assertEquals(Assert.java:67)
    [junit4] > at junit.framework.Assert.assertEquals(Assert.java:199)
    [junit4] > at org.apache.lucene.search.CheckHits.checkDocIds(CheckHits.java:190)
    [junit4] > at org.apache.lucene.search.CheckHits.checkHitsQuery(CheckHits.java:203)
    [junit4] > at org.apache.lucene.search.TestBoolean2.queriesTest(TestBoolean2.java:192)
    [junit4] > at org.apache.lucene.search.TestBoolean2.testQueries02(TestBoolean2.java:236)
    [junit4] > at java.lang.Thread.run(Thread.java:745)
    [junit4] 2> NOTE: reproduce with: ant test -Dtestcase=TestBoolean2 -Dtests.method=testQueries08 -Dtests.seed=55D8DFC8BCFC02AB -Dtests.multiplier=3 -Dtests.slow=true -Dtests.locale=fr-LU -Dtests.timezone=Asia/Yakutsk -Dtests.asserts=true -Dtests.file.encoding=US-ASCII
    [junit4] FAILURE 0.01s J1 | TestBoolean2.testQueries08 <<<
    [junit4] > Throwable #1: junit.framework.AssertionFailedError: hits1 doc nrs for hit 0 expected:<4381> but was:<6430>
    [junit4] > at __randomizedtesting.SeedInfo.seed([55D8DFC8BCFC02AB:693C245D2B13CB82]:0)
    [junit4] > at junit.framework.Assert.fail(Assert.java:50)
    [junit4] > at junit.framework.Assert.failNotEquals(Assert.java:287)
    [junit4] > at junit.framework.Assert.assertEquals(Assert.java:67)
    [junit4] > at junit.framework.Assert.assertEquals(Assert.java:199)
    [junit4] > at org.apache.lucene.search.CheckHits.checkDocIds(CheckHits.java:190)
    [junit4] > at org.apache.lucene.search.CheckHits.checkHitsQuery(CheckHits.java:203)
    [junit4] > at org.apache.lucene.search.TestBoolean2.queriesTest(TestBoolean2.java:192)
    [junit4] > at org.apache.lucene.search.TestBoolean2.testQueries08(TestBoolean2.java:299)
    [junit4] > at java.lang.Thread.run(Thread.java:745)
    [junit4] 2> NOTE: reproduce with: ant test -Dtestcase=TestBoolean2 -Dtests.method=testQueries01 -Dtests.seed=55D8DFC8BCFC02AB -Dtests.multiplier=3 -Dtests.slow=true -Dtests.locale=fr-LU -Dtests.timezone=Asia/Yakutsk -Dtests.asserts=true -Dtests.file.encoding=US-ASCII
    [junit4] FAILURE 0.01s J1 | TestBoolean2.testQueries01 <<<
    [junit4] > Throwable #1: junit.framework.AssertionFailedError: hits1 doc nrs for hit 0 expected:<4381> but was:<6430>
    [junit4] > at __randomizedtesting.SeedInfo.seed([55D8DFC8BCFC02AB:488699BB2980E943]:0)
    [junit4] > at junit.framework.Assert.fail(Assert.java:50)
    [junit4] > at junit.framework.Assert.failNotEquals(Assert.java:287)
    [junit4] > at junit.framework.Assert.assertEquals(Assert.java:67)
    [junit4] > at junit.framework.Assert.assertEquals(Assert.java:199)
    [junit4] > at org.apache.lucene.search.CheckHits.checkDocIds(CheckHits.java:190)
    [junit4] > at org.apache.lucene.search.CheckHits.checkHitsQuery(CheckHits.java:203)
    [junit4] > at org.apache.lucene.search.TestBoolean2.queriesTest(TestBoolean2.java:192)
    [junit4] > at org.apache.lucene.search.TestBoolean2.testQueries01(TestBoolean2.java:226)
    [junit4] > at java.lang.Thread.run(Thread.java:745)
    [junit4] 2> NOTE: test params are: codec=Lucene54, sim=DefaultSimilarity, locale=fr-LU, timezone=Asia/Yakutsk
    [junit4] 2> NOTE: Linux 4.4.0-24-generic i386/Oracle Corporation 1.8.0_92 (32-bit)/cpus=12,threads=1,free=114124056,total=515899392
    [junit4] 2> NOTE: All tests run in this JVM: [TestIntArrayDocIdSet, TestBoolean2]
    [junit4] Completed [19/422 (1!)] on J1 in 27.99s, 11 tests, 4 failures <<< FAILURES!

[...truncated 1312 lines...]
BUILD FAILED
/home/jenkins/workspace/Lucene-Solr-5.5-Linux/build.xml:750: The following error occurred while executing this line:
/home/jenkins/workspace/Lucene-Solr-5.5-Linux/build.xml:694: The following error occurred while executing this line:
/home/jenkins/workspace/Lucene-Solr-5.5-Linux/build.xml:59: The following error occurred while executing this line:
/home/jenkins/workspace/Lucene-Solr-5.5-Linux/lucene/build.xml:50: The following error occurred while executing this line:
/home/jenkins/workspace/Lucene-Solr-5.5-Linux/lucene/common-build.xml:1477: The following error occurred while executing this line:
/home/jenkins/workspace/Lucene-Solr-5.5-Linux/lucene/common-build.xml:1033: There were test failures: 422 suites (1 ignored), 3464 tests, 4 failures, 49 ignored (45 assumptions) [seed: 55D8DFC8BCFC02AB]

Total time: 7 minutes 45 seconds
Build step 'Invoke Ant' marked build as failure
Archiving artifacts
[WARNINGS] Skipping publisher since build result is FAILURE
Recording test results
Email was triggered for: Failure - Any
Sending email for trigger: Failure - Any

Search Discussions

Discussion Posts

Follow ups

Related Discussions

Discussion Navigation
viewthread | post
posts ‹ prev | 1 of 3 | next ›
Discussion Overview
groupdev @
categorieslucene
postedJun 17, '16 at 3:25a
activeJun 17, '16 at 9:18a
posts3
users1
websitelucene.apache.org

1 user in discussion

Policeman Jenkins Server: 3 posts

People

Translate

site design / logo © 2017 Grokbase