Grokbase Groups Lucene dev June 2016
FAQ
Build: http://jenkins.thetaphi.de/job/Lucene-Solr-5.5-Linux/299/
Java: 32bit/jdk1.8.0_92 -client -XX:+UseSerialGC

4 tests failed.
FAILED: org.apache.lucene.search.TestBoolean2.testQueries01

Error Message:
hits1 doc nrs for hit 0 expected:<4268> but was:<6317>

Stack Trace:
junit.framework.AssertionFailedError: hits1 doc nrs for hit 0 expected:<4268> but was:[5AF949CD8CA453B1:47A70FBE19D8B859]:0)
  at junit.framework.Assert.fail(Assert.java:50)
  at junit.framework.Assert.failNotEquals(Assert.java:287)
  at junit.framework.Assert.assertEquals(Assert.java:67)
  at junit.framework.Assert.assertEquals(Assert.java:199)
  at org.apache.lucene.search.CheckHits.checkDocIds(CheckHits.java:190)
  at org.apache.lucene.search.CheckHits.checkHitsQuery(CheckHits.java:203)
  at org.apache.lucene.search.TestBoolean2.queriesTest(TestBoolean2.java:192)
  at org.apache.lucene.search.TestBoolean2.testQueries01(TestBoolean2.java:226)
  at sun.reflect.NativeMethodAccessorImpl.invoke0(Native Method)
  at sun.reflect.NativeMethodAccessorImpl.invoke(NativeMethodAccessorImpl.java:62)
  at sun.reflect.DelegatingMethodAccessorImpl.invoke(DelegatingMethodAccessorImpl.java:43)
  at java.lang.reflect.Method.invoke(Method.java:498)
  at com.carrotsearch.randomizedtesting.RandomizedRunner.invoke(RandomizedRunner.java:1764)
  at com.carrotsearch.randomizedtesting.RandomizedRunner$8.evaluate(RandomizedRunner.java:871)
  at com.carrotsearch.randomizedtesting.RandomizedRunner$9.evaluate(RandomizedRunner.java:907)
  at com.carrotsearch.randomizedtesting.RandomizedRunner$10.evaluate(RandomizedRunner.java:921)
  at org.apache.lucene.util.TestRuleSetupTeardownChained$1.evaluate(TestRuleSetupTeardownChained.java:49)
  at org.apache.lucene.util.AbstractBeforeAfterRule$1.evaluate(AbstractBeforeAfterRule.java:45)
  at org.apache.lucene.util.TestRuleThreadAndTestName$1.evaluate(TestRuleThreadAndTestName.java:48)
  at org.apache.lucene.util.TestRuleIgnoreAfterMaxFailures$1.evaluate(TestRuleIgnoreAfterMaxFailures.java:64)
  at org.apache.lucene.util.TestRuleMarkFailure$1.evaluate(TestRuleMarkFailure.java:47)
  at com.carrotsearch.randomizedtesting.rules.StatementAdapter.evaluate(StatementAdapter.java:36)
  at com.carrotsearch.randomizedtesting.ThreadLeakControl$StatementRunner.run(ThreadLeakControl.java:367)
  at com.carrotsearch.randomizedtesting.ThreadLeakControl.forkTimeoutingTask(ThreadLeakControl.java:809)
  at com.carrotsearch.randomizedtesting.ThreadLeakControl$3.evaluate(ThreadLeakControl.java:460)
  at com.carrotsearch.randomizedtesting.RandomizedRunner.runSingleTest(RandomizedRunner.java:880)
  at com.carrotsearch.randomizedtesting.RandomizedRunner$5.evaluate(RandomizedRunner.java:781)
  at com.carrotsearch.randomizedtesting.RandomizedRunner$6.evaluate(RandomizedRunner.java:816)
  at com.carrotsearch.randomizedtesting.RandomizedRunner$7.evaluate(RandomizedRunner.java:827)
  at org.apache.lucene.util.AbstractBeforeAfterRule$1.evaluate(AbstractBeforeAfterRule.java:45)
  at com.carrotsearch.randomizedtesting.rules.StatementAdapter.evaluate(StatementAdapter.java:36)
  at org.apache.lucene.util.TestRuleStoreClassName$1.evaluate(TestRuleStoreClassName.java:41)
  at com.carrotsearch.randomizedtesting.rules.NoShadowingOrOverridesOnMethodsRule$1.evaluate(NoShadowingOrOverridesOnMethodsRule.java:40)
  at com.carrotsearch.randomizedtesting.rules.NoShadowingOrOverridesOnMethodsRule$1.evaluate(NoShadowingOrOverridesOnMethodsRule.java:40)
  at com.carrotsearch.randomizedtesting.rules.StatementAdapter.evaluate(StatementAdapter.java:36)
  at com.carrotsearch.randomizedtesting.rules.StatementAdapter.evaluate(StatementAdapter.java:36)
  at com.carrotsearch.randomizedtesting.rules.StatementAdapter.evaluate(StatementAdapter.java:36)
  at org.apache.lucene.util.TestRuleAssertionsRequired$1.evaluate(TestRuleAssertionsRequired.java:53)
  at org.apache.lucene.util.TestRuleMarkFailure$1.evaluate(TestRuleMarkFailure.java:47)
  at org.apache.lucene.util.TestRuleIgnoreAfterMaxFailures$1.evaluate(TestRuleIgnoreAfterMaxFailures.java:64)
  at org.apache.lucene.util.TestRuleIgnoreTestSuites$1.evaluate(TestRuleIgnoreTestSuites.java:54)
  at com.carrotsearch.randomizedtesting.rules.StatementAdapter.evaluate(StatementAdapter.java:36)
  at com.carrotsearch.randomizedtesting.ThreadLeakControl$StatementRunner.run(ThreadLeakControl.java:367)
  at java.lang.Thread.run(Thread.java:745)


FAILED: org.apache.lucene.search.TestBoolean2.testQueries03

Error Message:
hits1 doc nrs for hit 0 expected:<4268> but was:<6317>

Stack Trace:
junit.framework.AssertionFailedError: hits1 doc nrs for hit 0 expected:<4268> but was:[5AF949CD8CA453B1:1F1CF7FB6C721231]:0)
  at junit.framework.Assert.fail(Assert.java:50)
  at junit.framework.Assert.failNotEquals(Assert.java:287)
  at junit.framework.Assert.assertEquals(Assert.java:67)
  at junit.framework.Assert.assertEquals(Assert.java:199)
  at org.apache.lucene.search.CheckHits.checkDocIds(CheckHits.java:190)
  at org.apache.lucene.search.CheckHits.checkHitsQuery(CheckHits.java:203)
  at org.apache.lucene.search.TestBoolean2.queriesTest(TestBoolean2.java:192)
  at org.apache.lucene.search.TestBoolean2.testQueries03(TestBoolean2.java:246)
  at sun.reflect.NativeMethodAccessorImpl.invoke0(Native Method)
  at sun.reflect.NativeMethodAccessorImpl.invoke(NativeMethodAccessorImpl.java:62)
  at sun.reflect.DelegatingMethodAccessorImpl.invoke(DelegatingMethodAccessorImpl.java:43)
  at java.lang.reflect.Method.invoke(Method.java:498)
  at com.carrotsearch.randomizedtesting.RandomizedRunner.invoke(RandomizedRunner.java:1764)
  at com.carrotsearch.randomizedtesting.RandomizedRunner$8.evaluate(RandomizedRunner.java:871)
  at com.carrotsearch.randomizedtesting.RandomizedRunner$9.evaluate(RandomizedRunner.java:907)
  at com.carrotsearch.randomizedtesting.RandomizedRunner$10.evaluate(RandomizedRunner.java:921)
  at org.apache.lucene.util.TestRuleSetupTeardownChained$1.evaluate(TestRuleSetupTeardownChained.java:49)
  at org.apache.lucene.util.AbstractBeforeAfterRule$1.evaluate(AbstractBeforeAfterRule.java:45)
  at org.apache.lucene.util.TestRuleThreadAndTestName$1.evaluate(TestRuleThreadAndTestName.java:48)
  at org.apache.lucene.util.TestRuleIgnoreAfterMaxFailures$1.evaluate(TestRuleIgnoreAfterMaxFailures.java:64)
  at org.apache.lucene.util.TestRuleMarkFailure$1.evaluate(TestRuleMarkFailure.java:47)
  at com.carrotsearch.randomizedtesting.rules.StatementAdapter.evaluate(StatementAdapter.java:36)
  at com.carrotsearch.randomizedtesting.ThreadLeakControl$StatementRunner.run(ThreadLeakControl.java:367)
  at com.carrotsearch.randomizedtesting.ThreadLeakControl.forkTimeoutingTask(ThreadLeakControl.java:809)
  at com.carrotsearch.randomizedtesting.ThreadLeakControl$3.evaluate(ThreadLeakControl.java:460)
  at com.carrotsearch.randomizedtesting.RandomizedRunner.runSingleTest(RandomizedRunner.java:880)
  at com.carrotsearch.randomizedtesting.RandomizedRunner$5.evaluate(RandomizedRunner.java:781)
  at com.carrotsearch.randomizedtesting.RandomizedRunner$6.evaluate(RandomizedRunner.java:816)
  at com.carrotsearch.randomizedtesting.RandomizedRunner$7.evaluate(RandomizedRunner.java:827)
  at org.apache.lucene.util.AbstractBeforeAfterRule$1.evaluate(AbstractBeforeAfterRule.java:45)
  at com.carrotsearch.randomizedtesting.rules.StatementAdapter.evaluate(StatementAdapter.java:36)
  at org.apache.lucene.util.TestRuleStoreClassName$1.evaluate(TestRuleStoreClassName.java:41)
  at com.carrotsearch.randomizedtesting.rules.NoShadowingOrOverridesOnMethodsRule$1.evaluate(NoShadowingOrOverridesOnMethodsRule.java:40)
  at com.carrotsearch.randomizedtesting.rules.NoShadowingOrOverridesOnMethodsRule$1.evaluate(NoShadowingOrOverridesOnMethodsRule.java:40)
  at com.carrotsearch.randomizedtesting.rules.StatementAdapter.evaluate(StatementAdapter.java:36)
  at com.carrotsearch.randomizedtesting.rules.StatementAdapter.evaluate(StatementAdapter.java:36)
  at com.carrotsearch.randomizedtesting.rules.StatementAdapter.evaluate(StatementAdapter.java:36)
  at org.apache.lucene.util.TestRuleAssertionsRequired$1.evaluate(TestRuleAssertionsRequired.java:53)
  at org.apache.lucene.util.TestRuleMarkFailure$1.evaluate(TestRuleMarkFailure.java:47)
  at org.apache.lucene.util.TestRuleIgnoreAfterMaxFailures$1.evaluate(TestRuleIgnoreAfterMaxFailures.java:64)
  at org.apache.lucene.util.TestRuleIgnoreTestSuites$1.evaluate(TestRuleIgnoreTestSuites.java:54)
  at com.carrotsearch.randomizedtesting.rules.StatementAdapter.evaluate(StatementAdapter.java:36)
  at com.carrotsearch.randomizedtesting.ThreadLeakControl$StatementRunner.run(ThreadLeakControl.java:367)
  at java.lang.Thread.run(Thread.java:745)


FAILED: org.apache.lucene.search.TestBoolean2.testQueries02

Error Message:
hits1 doc nrs for hit 0 expected:<4268> but was:<6317>

Stack Trace:
junit.framework.AssertionFailedError: hits1 doc nrs for hit 0 expected:<4268> but was:[5AF949CD8CA453B1:29F84A824798772E]:0)
  at junit.framework.Assert.fail(Assert.java:50)
  at junit.framework.Assert.failNotEquals(Assert.java:287)
  at junit.framework.Assert.assertEquals(Assert.java:67)
  at junit.framework.Assert.assertEquals(Assert.java:199)
  at org.apache.lucene.search.CheckHits.checkDocIds(CheckHits.java:190)
  at org.apache.lucene.search.CheckHits.checkHitsQuery(CheckHits.java:203)
  at org.apache.lucene.search.TestBoolean2.queriesTest(TestBoolean2.java:192)
  at org.apache.lucene.search.TestBoolean2.testQueries02(TestBoolean2.java:236)
  at sun.reflect.NativeMethodAccessorImpl.invoke0(Native Method)
  at sun.reflect.NativeMethodAccessorImpl.invoke(NativeMethodAccessorImpl.java:62)
  at sun.reflect.DelegatingMethodAccessorImpl.invoke(DelegatingMethodAccessorImpl.java:43)
  at java.lang.reflect.Method.invoke(Method.java:498)
  at com.carrotsearch.randomizedtesting.RandomizedRunner.invoke(RandomizedRunner.java:1764)
  at com.carrotsearch.randomizedtesting.RandomizedRunner$8.evaluate(RandomizedRunner.java:871)
  at com.carrotsearch.randomizedtesting.RandomizedRunner$9.evaluate(RandomizedRunner.java:907)
  at com.carrotsearch.randomizedtesting.RandomizedRunner$10.evaluate(RandomizedRunner.java:921)
  at org.apache.lucene.util.TestRuleSetupTeardownChained$1.evaluate(TestRuleSetupTeardownChained.java:49)
  at org.apache.lucene.util.AbstractBeforeAfterRule$1.evaluate(AbstractBeforeAfterRule.java:45)
  at org.apache.lucene.util.TestRuleThreadAndTestName$1.evaluate(TestRuleThreadAndTestName.java:48)
  at org.apache.lucene.util.TestRuleIgnoreAfterMaxFailures$1.evaluate(TestRuleIgnoreAfterMaxFailures.java:64)
  at org.apache.lucene.util.TestRuleMarkFailure$1.evaluate(TestRuleMarkFailure.java:47)
  at com.carrotsearch.randomizedtesting.rules.StatementAdapter.evaluate(StatementAdapter.java:36)
  at com.carrotsearch.randomizedtesting.ThreadLeakControl$StatementRunner.run(ThreadLeakControl.java:367)
  at com.carrotsearch.randomizedtesting.ThreadLeakControl.forkTimeoutingTask(ThreadLeakControl.java:809)
  at com.carrotsearch.randomizedtesting.ThreadLeakControl$3.evaluate(ThreadLeakControl.java:460)
  at com.carrotsearch.randomizedtesting.RandomizedRunner.runSingleTest(RandomizedRunner.java:880)
  at com.carrotsearch.randomizedtesting.RandomizedRunner$5.evaluate(RandomizedRunner.java:781)
  at com.carrotsearch.randomizedtesting.RandomizedRunner$6.evaluate(RandomizedRunner.java:816)
  at com.carrotsearch.randomizedtesting.RandomizedRunner$7.evaluate(RandomizedRunner.java:827)
  at org.apache.lucene.util.AbstractBeforeAfterRule$1.evaluate(AbstractBeforeAfterRule.java:45)
  at com.carrotsearch.randomizedtesting.rules.StatementAdapter.evaluate(StatementAdapter.java:36)
  at org.apache.lucene.util.TestRuleStoreClassName$1.evaluate(TestRuleStoreClassName.java:41)
  at com.carrotsearch.randomizedtesting.rules.NoShadowingOrOverridesOnMethodsRule$1.evaluate(NoShadowingOrOverridesOnMethodsRule.java:40)
  at com.carrotsearch.randomizedtesting.rules.NoShadowingOrOverridesOnMethodsRule$1.evaluate(NoShadowingOrOverridesOnMethodsRule.java:40)
  at com.carrotsearch.randomizedtesting.rules.StatementAdapter.evaluate(StatementAdapter.java:36)
  at com.carrotsearch.randomizedtesting.rules.StatementAdapter.evaluate(StatementAdapter.java:36)
  at com.carrotsearch.randomizedtesting.rules.StatementAdapter.evaluate(StatementAdapter.java:36)
  at org.apache.lucene.util.TestRuleAssertionsRequired$1.evaluate(TestRuleAssertionsRequired.java:53)
  at org.apache.lucene.util.TestRuleMarkFailure$1.evaluate(TestRuleMarkFailure.java:47)
  at org.apache.lucene.util.TestRuleIgnoreAfterMaxFailures$1.evaluate(TestRuleIgnoreAfterMaxFailures.java:64)
  at org.apache.lucene.util.TestRuleIgnoreTestSuites$1.evaluate(TestRuleIgnoreTestSuites.java:54)
  at com.carrotsearch.randomizedtesting.rules.StatementAdapter.evaluate(StatementAdapter.java:36)
  at com.carrotsearch.randomizedtesting.ThreadLeakControl$StatementRunner.run(ThreadLeakControl.java:367)
  at java.lang.Thread.run(Thread.java:745)


FAILED: org.apache.lucene.search.TestBoolean2.testQueries08

Error Message:
hits1 doc nrs for hit 0 expected:<4268> but was:<6317>

Stack Trace:
junit.framework.AssertionFailedError: hits1 doc nrs for hit 0 expected:<4268> but was:[5AF949CD8CA453B1:661DB2581B4B9A98]:0)
  at junit.framework.Assert.fail(Assert.java:50)
  at junit.framework.Assert.failNotEquals(Assert.java:287)
  at junit.framework.Assert.assertEquals(Assert.java:67)
  at junit.framework.Assert.assertEquals(Assert.java:199)
  at org.apache.lucene.search.CheckHits.checkDocIds(CheckHits.java:190)
  at org.apache.lucene.search.CheckHits.checkHitsQuery(CheckHits.java:203)
  at org.apache.lucene.search.TestBoolean2.queriesTest(TestBoolean2.java:192)
  at org.apache.lucene.search.TestBoolean2.testQueries08(TestBoolean2.java:299)
  at sun.reflect.NativeMethodAccessorImpl.invoke0(Native Method)
  at sun.reflect.NativeMethodAccessorImpl.invoke(NativeMethodAccessorImpl.java:62)
  at sun.reflect.DelegatingMethodAccessorImpl.invoke(DelegatingMethodAccessorImpl.java:43)
  at java.lang.reflect.Method.invoke(Method.java:498)
  at com.carrotsearch.randomizedtesting.RandomizedRunner.invoke(RandomizedRunner.java:1764)
  at com.carrotsearch.randomizedtesting.RandomizedRunner$8.evaluate(RandomizedRunner.java:871)
  at com.carrotsearch.randomizedtesting.RandomizedRunner$9.evaluate(RandomizedRunner.java:907)
  at com.carrotsearch.randomizedtesting.RandomizedRunner$10.evaluate(RandomizedRunner.java:921)
  at org.apache.lucene.util.TestRuleSetupTeardownChained$1.evaluate(TestRuleSetupTeardownChained.java:49)
  at org.apache.lucene.util.AbstractBeforeAfterRule$1.evaluate(AbstractBeforeAfterRule.java:45)
  at org.apache.lucene.util.TestRuleThreadAndTestName$1.evaluate(TestRuleThreadAndTestName.java:48)
  at org.apache.lucene.util.TestRuleIgnoreAfterMaxFailures$1.evaluate(TestRuleIgnoreAfterMaxFailures.java:64)
  at org.apache.lucene.util.TestRuleMarkFailure$1.evaluate(TestRuleMarkFailure.java:47)
  at com.carrotsearch.randomizedtesting.rules.StatementAdapter.evaluate(StatementAdapter.java:36)
  at com.carrotsearch.randomizedtesting.ThreadLeakControl$StatementRunner.run(ThreadLeakControl.java:367)
  at com.carrotsearch.randomizedtesting.ThreadLeakControl.forkTimeoutingTask(ThreadLeakControl.java:809)
  at com.carrotsearch.randomizedtesting.ThreadLeakControl$3.evaluate(ThreadLeakControl.java:460)
  at com.carrotsearch.randomizedtesting.RandomizedRunner.runSingleTest(RandomizedRunner.java:880)
  at com.carrotsearch.randomizedtesting.RandomizedRunner$5.evaluate(RandomizedRunner.java:781)
  at com.carrotsearch.randomizedtesting.RandomizedRunner$6.evaluate(RandomizedRunner.java:816)
  at com.carrotsearch.randomizedtesting.RandomizedRunner$7.evaluate(RandomizedRunner.java:827)
  at org.apache.lucene.util.AbstractBeforeAfterRule$1.evaluate(AbstractBeforeAfterRule.java:45)
  at com.carrotsearch.randomizedtesting.rules.StatementAdapter.evaluate(StatementAdapter.java:36)
  at org.apache.lucene.util.TestRuleStoreClassName$1.evaluate(TestRuleStoreClassName.java:41)
  at com.carrotsearch.randomizedtesting.rules.NoShadowingOrOverridesOnMethodsRule$1.evaluate(NoShadowingOrOverridesOnMethodsRule.java:40)
  at com.carrotsearch.randomizedtesting.rules.NoShadowingOrOverridesOnMethodsRule$1.evaluate(NoShadowingOrOverridesOnMethodsRule.java:40)
  at com.carrotsearch.randomizedtesting.rules.StatementAdapter.evaluate(StatementAdapter.java:36)
  at com.carrotsearch.randomizedtesting.rules.StatementAdapter.evaluate(StatementAdapter.java:36)
  at com.carrotsearch.randomizedtesting.rules.StatementAdapter.evaluate(StatementAdapter.java:36)
  at org.apache.lucene.util.TestRuleAssertionsRequired$1.evaluate(TestRuleAssertionsRequired.java:53)
  at org.apache.lucene.util.TestRuleMarkFailure$1.evaluate(TestRuleMarkFailure.java:47)
  at org.apache.lucene.util.TestRuleIgnoreAfterMaxFailures$1.evaluate(TestRuleIgnoreAfterMaxFailures.java:64)
  at org.apache.lucene.util.TestRuleIgnoreTestSuites$1.evaluate(TestRuleIgnoreTestSuites.java:54)
  at com.carrotsearch.randomizedtesting.rules.StatementAdapter.evaluate(StatementAdapter.java:36)
  at com.carrotsearch.randomizedtesting.ThreadLeakControl$StatementRunner.run(ThreadLeakControl.java:367)
  at java.lang.Thread.run(Thread.java:745)




Build Log:
[...truncated 387 lines...]
    [junit4] Suite: org.apache.lucene.search.TestBoolean2
    [junit4] 2> NOTE: reproduce with: ant test -Dtestcase=TestBoolean2 -Dtests.method=testQueries01 -Dtests.seed=5AF949CD8CA453B1 -Dtests.multiplier=3 -Dtests.slow=true -Dtests.locale=ar-SA -Dtests.timezone=NZ -Dtests.asserts=true -Dtests.file.encoding=US-ASCII
    [junit4] FAILURE 0.01s J1 | TestBoolean2.testQueries01 <<<
    [junit4] > Throwable #1: junit.framework.AssertionFailedError: hits1 doc nrs for hit 0 expected:<4268> but was:<6317>
    [junit4] > at __randomizedtesting.SeedInfo.seed([5AF949CD8CA453B1:47A70FBE19D8B859]:0)
    [junit4] > at junit.framework.Assert.fail(Assert.java:50)
    [junit4] > at junit.framework.Assert.failNotEquals(Assert.java:287)
    [junit4] > at junit.framework.Assert.assertEquals(Assert.java:67)
    [junit4] > at junit.framework.Assert.assertEquals(Assert.java:199)
    [junit4] > at org.apache.lucene.search.CheckHits.checkDocIds(CheckHits.java:190)
    [junit4] > at org.apache.lucene.search.CheckHits.checkHitsQuery(CheckHits.java:203)
    [junit4] > at org.apache.lucene.search.TestBoolean2.queriesTest(TestBoolean2.java:192)
    [junit4] > at org.apache.lucene.search.TestBoolean2.testQueries01(TestBoolean2.java:226)
    [junit4] > at java.lang.Thread.run(Thread.java:745)
    [junit4] 2> NOTE: reproduce with: ant test -Dtestcase=TestBoolean2 -Dtests.method=testQueries03 -Dtests.seed=5AF949CD8CA453B1 -Dtests.multiplier=3 -Dtests.slow=true -Dtests.locale=ar-SA -Dtests.timezone=NZ -Dtests.asserts=true -Dtests.file.encoding=US-ASCII
    [junit4] FAILURE 0.01s J1 | TestBoolean2.testQueries03 <<<
    [junit4] > Throwable #1: junit.framework.AssertionFailedError: hits1 doc nrs for hit 0 expected:<4268> but was:<6317>
    [junit4] > at __randomizedtesting.SeedInfo.seed([5AF949CD8CA453B1:1F1CF7FB6C721231]:0)
    [junit4] > at junit.framework.Assert.fail(Assert.java:50)
    [junit4] > at junit.framework.Assert.failNotEquals(Assert.java:287)
    [junit4] > at junit.framework.Assert.assertEquals(Assert.java:67)
    [junit4] > at junit.framework.Assert.assertEquals(Assert.java:199)
    [junit4] > at org.apache.lucene.search.CheckHits.checkDocIds(CheckHits.java:190)
    [junit4] > at org.apache.lucene.search.CheckHits.checkHitsQuery(CheckHits.java:203)
    [junit4] > at org.apache.lucene.search.TestBoolean2.queriesTest(TestBoolean2.java:192)
    [junit4] > at org.apache.lucene.search.TestBoolean2.testQueries03(TestBoolean2.java:246)
    [junit4] > at java.lang.Thread.run(Thread.java:745)
    [junit4] 2> NOTE: reproduce with: ant test -Dtestcase=TestBoolean2 -Dtests.method=testQueries02 -Dtests.seed=5AF949CD8CA453B1 -Dtests.multiplier=3 -Dtests.slow=true -Dtests.locale=ar-SA -Dtests.timezone=NZ -Dtests.asserts=true -Dtests.file.encoding=US-ASCII
    [junit4] FAILURE 0.01s J1 | TestBoolean2.testQueries02 <<<
    [junit4] > Throwable #1: junit.framework.AssertionFailedError: hits1 doc nrs for hit 0 expected:<4268> but was:<6317>
    [junit4] > at __randomizedtesting.SeedInfo.seed([5AF949CD8CA453B1:29F84A824798772E]:0)
    [junit4] > at junit.framework.Assert.fail(Assert.java:50)
    [junit4] > at junit.framework.Assert.failNotEquals(Assert.java:287)
    [junit4] > at junit.framework.Assert.assertEquals(Assert.java:67)
    [junit4] > at junit.framework.Assert.assertEquals(Assert.java:199)
    [junit4] > at org.apache.lucene.search.CheckHits.checkDocIds(CheckHits.java:190)
    [junit4] > at org.apache.lucene.search.CheckHits.checkHitsQuery(CheckHits.java:203)
    [junit4] > at org.apache.lucene.search.TestBoolean2.queriesTest(TestBoolean2.java:192)
    [junit4] > at org.apache.lucene.search.TestBoolean2.testQueries02(TestBoolean2.java:236)
    [junit4] > at java.lang.Thread.run(Thread.java:745)
    [junit4] 2> NOTE: reproduce with: ant test -Dtestcase=TestBoolean2 -Dtests.method=testQueries08 -Dtests.seed=5AF949CD8CA453B1 -Dtests.multiplier=3 -Dtests.slow=true -Dtests.locale=ar-SA -Dtests.timezone=NZ -Dtests.asserts=true -Dtests.file.encoding=US-ASCII
    [junit4] FAILURE 0.01s J1 | TestBoolean2.testQueries08 <<<
    [junit4] > Throwable #1: junit.framework.AssertionFailedError: hits1 doc nrs for hit 0 expected:<4268> but was:<6317>
    [junit4] > at __randomizedtesting.SeedInfo.seed([5AF949CD8CA453B1:661DB2581B4B9A98]:0)
    [junit4] > at junit.framework.Assert.fail(Assert.java:50)
    [junit4] > at junit.framework.Assert.failNotEquals(Assert.java:287)
    [junit4] > at junit.framework.Assert.assertEquals(Assert.java:67)
    [junit4] > at junit.framework.Assert.assertEquals(Assert.java:199)
    [junit4] > at org.apache.lucene.search.CheckHits.checkDocIds(CheckHits.java:190)
    [junit4] > at org.apache.lucene.search.CheckHits.checkHitsQuery(CheckHits.java:203)
    [junit4] > at org.apache.lucene.search.TestBoolean2.queriesTest(TestBoolean2.java:192)
    [junit4] > at org.apache.lucene.search.TestBoolean2.testQueries08(TestBoolean2.java:299)
    [junit4] > at java.lang.Thread.run(Thread.java:745)
    [junit4] 2> NOTE: test params are: codec=Asserting(Lucene54): {field=FSTOrd50, field2=PostingsFormat(name=MockRandom)}, docValues:{}, sim=RandomSimilarity(queryNorm=true,coord=no): {field=DFR GL1, field2=DFR I(n)L1}, locale=ar-SA, timezone=NZ
    [junit4] 2> NOTE: Linux 4.4.0-24-generic i386/Oracle Corporation 1.8.0_92 (32-bit)/cpus=12,threads=1,free=46204064,total=121962496
    [junit4] 2> NOTE: All tests run in this JVM: [TestBytesRefAttImpl, TestBoolean2]
    [junit4] Completed [58/422 (1!)] on J1 in 70.90s, 11 tests, 4 failures <<< FAILURES!

[...truncated 1191 lines...]
BUILD FAILED
/home/jenkins/workspace/Lucene-Solr-5.5-Linux/build.xml:750: The following error occurred while executing this line:
/home/jenkins/workspace/Lucene-Solr-5.5-Linux/build.xml:694: The following error occurred while executing this line:
/home/jenkins/workspace/Lucene-Solr-5.5-Linux/build.xml:59: The following error occurred while executing this line:
/home/jenkins/workspace/Lucene-Solr-5.5-Linux/lucene/build.xml:50: The following error occurred while executing this line:
/home/jenkins/workspace/Lucene-Solr-5.5-Linux/lucene/common-build.xml:1477: The following error occurred while executing this line:
/home/jenkins/workspace/Lucene-Solr-5.5-Linux/lucene/common-build.xml:1033: There were test failures: 422 suites (1 ignored), 3464 tests, 4 failures, 51 ignored (47 assumptions) [seed: 5AF949CD8CA453B1]

Total time: 8 minutes 5 seconds
Build step 'Invoke Ant' marked build as failure
Archiving artifacts
[WARNINGS] Skipping publisher since build result is FAILURE
Recording test results
Email was triggered for: Failure - Any
Sending email for trigger: Failure - Any

Search Discussions

Discussion Posts

Previous

Follow ups

Related Discussions

Discussion Navigation
viewthread | post
posts ‹ prev | 2 of 4 | next ›
Discussion Overview
groupdev @
categorieslucene
postedJun 17, '16 at 3:38p
activeJun 18, '16 at 2:52a
posts4
users1
websitelucene.apache.org

1 user in discussion

Policeman Jenkins Server: 4 posts

People

Translate

site design / logo © 2017 Grokbase