Grokbase Groups Lucene dev June 2016
FAQ
Build: http://jenkins.thetaphi.de/job/Lucene-Solr-5.5-Linux/296/
Java: 64bit/jdk1.7.0_80 -XX:+UseCompressedOops -XX:+UseParallelGC

1 tests failed.
FAILED: org.apache.solr.schema.TestManagedSchemaAPI.test

Error Message:
Error from server at http://127.0.0.1:39821/solr/testschemaapi_shard1_replica2: ERROR: [doc=2] unknown field 'myNewField1'

Stack Trace:
org.apache.solr.client.solrj.impl.CloudSolrClient$RouteException: Error from server at http://127.0.0.1:39821/solr/testschemaapi_shard1_replica2: ERROR: [doc=2] unknown field 'myNewField1'
  at __randomizedtesting.SeedInfo.seed([E4BA22C4B411CE95:6CEE1D1E1AEDA36D]:0)
  at org.apache.solr.client.solrj.impl.CloudSolrClient.directUpdate(CloudSolrClient.java:632)
  at org.apache.solr.client.solrj.impl.CloudSolrClient.sendRequest(CloudSolrClient.java:981)
  at org.apache.solr.client.solrj.impl.CloudSolrClient.requestWithRetryOnStaleState(CloudSolrClient.java:870)
  at org.apache.solr.client.solrj.impl.CloudSolrClient.request(CloudSolrClient.java:806)
  at org.apache.solr.schema.TestManagedSchemaAPI.testAddFieldAndDocument(TestManagedSchemaAPI.java:101)
  at org.apache.solr.schema.TestManagedSchemaAPI.test(TestManagedSchemaAPI.java:69)
  at sun.reflect.NativeMethodAccessorImpl.invoke0(Native Method)
  at sun.reflect.NativeMethodAccessorImpl.invoke(NativeMethodAccessorImpl.java:57)
  at sun.reflect.DelegatingMethodAccessorImpl.invoke(DelegatingMethodAccessorImpl.java:43)
  at java.lang.reflect.Method.invoke(Method.java:606)
  at com.carrotsearch.randomizedtesting.RandomizedRunner.invoke(RandomizedRunner.java:1764)
  at com.carrotsearch.randomizedtesting.RandomizedRunner$8.evaluate(RandomizedRunner.java:871)
  at com.carrotsearch.randomizedtesting.RandomizedRunner$9.evaluate(RandomizedRunner.java:907)
  at com.carrotsearch.randomizedtesting.RandomizedRunner$10.evaluate(RandomizedRunner.java:921)
  at com.carrotsearch.randomizedtesting.rules.SystemPropertiesRestoreRule$1.evaluate(SystemPropertiesRestoreRule.java:57)
  at org.apache.lucene.util.TestRuleSetupTeardownChained$1.evaluate(TestRuleSetupTeardownChained.java:49)
  at org.apache.lucene.util.AbstractBeforeAfterRule$1.evaluate(AbstractBeforeAfterRule.java:45)
  at org.apache.lucene.util.TestRuleThreadAndTestName$1.evaluate(TestRuleThreadAndTestName.java:48)
  at org.apache.lucene.util.TestRuleIgnoreAfterMaxFailures$1.evaluate(TestRuleIgnoreAfterMaxFailures.java:64)
  at org.apache.lucene.util.TestRuleMarkFailure$1.evaluate(TestRuleMarkFailure.java:47)
  at com.carrotsearch.randomizedtesting.rules.StatementAdapter.evaluate(StatementAdapter.java:36)
  at com.carrotsearch.randomizedtesting.ThreadLeakControl$StatementRunner.run(ThreadLeakControl.java:367)
  at com.carrotsearch.randomizedtesting.ThreadLeakControl.forkTimeoutingTask(ThreadLeakControl.java:809)
  at com.carrotsearch.randomizedtesting.ThreadLeakControl$3.evaluate(ThreadLeakControl.java:460)
  at com.carrotsearch.randomizedtesting.RandomizedRunner.runSingleTest(RandomizedRunner.java:880)
  at com.carrotsearch.randomizedtesting.RandomizedRunner$5.evaluate(RandomizedRunner.java:781)
  at com.carrotsearch.randomizedtesting.RandomizedRunner$6.evaluate(RandomizedRunner.java:816)
  at com.carrotsearch.randomizedtesting.RandomizedRunner$7.evaluate(RandomizedRunner.java:827)
  at com.carrotsearch.randomizedtesting.rules.StatementAdapter.evaluate(StatementAdapter.java:36)
  at com.carrotsearch.randomizedtesting.rules.SystemPropertiesRestoreRule$1.evaluate(SystemPropertiesRestoreRule.java:57)
  at org.apache.lucene.util.AbstractBeforeAfterRule$1.evaluate(AbstractBeforeAfterRule.java:45)
  at com.carrotsearch.randomizedtesting.rules.StatementAdapter.evaluate(StatementAdapter.java:36)
  at org.apache.lucene.util.TestRuleStoreClassName$1.evaluate(TestRuleStoreClassName.java:41)
  at com.carrotsearch.randomizedtesting.rules.NoShadowingOrOverridesOnMethodsRule$1.evaluate(NoShadowingOrOverridesOnMethodsRule.java:40)
  at com.carrotsearch.randomizedtesting.rules.NoShadowingOrOverridesOnMethodsRule$1.evaluate(NoShadowingOrOverridesOnMethodsRule.java:40)
  at com.carrotsearch.randomizedtesting.rules.StatementAdapter.evaluate(StatementAdapter.java:36)
  at com.carrotsearch.randomizedtesting.rules.StatementAdapter.evaluate(StatementAdapter.java:36)
  at com.carrotsearch.randomizedtesting.rules.StatementAdapter.evaluate(StatementAdapter.java:36)
  at org.apache.lucene.util.TestRuleAssertionsRequired$1.evaluate(TestRuleAssertionsRequired.java:53)
  at org.apache.lucene.util.TestRuleMarkFailure$1.evaluate(TestRuleMarkFailure.java:47)
  at org.apache.lucene.util.TestRuleIgnoreAfterMaxFailures$1.evaluate(TestRuleIgnoreAfterMaxFailures.java:64)
  at org.apache.lucene.util.TestRuleIgnoreTestSuites$1.evaluate(TestRuleIgnoreTestSuites.java:54)
  at com.carrotsearch.randomizedtesting.rules.StatementAdapter.evaluate(StatementAdapter.java:36)
  at com.carrotsearch.randomizedtesting.ThreadLeakControl$StatementRunner.run(ThreadLeakControl.java:367)
  at java.lang.Thread.run(Thread.java:745)
Caused by: org.apache.solr.client.solrj.impl.HttpSolrClient$RemoteSolrException: Error from server at http://127.0.0.1:39821/solr/testschemaapi_shard1_replica2: ERROR: [doc=2] unknown field 'myNewField1'
  at org.apache.solr.client.solrj.impl.HttpSolrClient.executeMethod(HttpSolrClient.java:577)
  at org.apache.solr.client.solrj.impl.HttpSolrClient.request(HttpSolrClient.java:241)
  at org.apache.solr.client.solrj.impl.HttpSolrClient.request(HttpSolrClient.java:230)
  at org.apache.solr.client.solrj.impl.LBHttpSolrClient.doRequest(LBHttpSolrClient.java:372)
  at org.apache.solr.client.solrj.impl.LBHttpSolrClient.request(LBHttpSolrClient.java:325)
  at org.apache.solr.client.solrj.impl.CloudSolrClient$2.call(CloudSolrClient.java:607)
  at org.apache.solr.client.solrj.impl.CloudSolrClient$2.call(CloudSolrClient.java:604)
  at java.util.concurrent.FutureTask.run(FutureTask.java:262)
  at org.apache.solr.common.util.ExecutorUtil$MDCAwareThreadPoolExecutor$1.run(ExecutorUtil.java:231)
  at java.util.concurrent.ThreadPoolExecutor.runWorker(ThreadPoolExecutor.java:1145)
  at java.util.concurrent.ThreadPoolExecutor$Worker.run(ThreadPoolExecutor.java:615)
  ... 1 more




Build Log:
[...truncated 12220 lines...]
    [junit4] Suite: org.apache.solr.schema.TestManagedSchemaAPI
    [junit4] 2> Creating dataDir: /home/jenkins/workspace/Lucene-Solr-5.5-Linux/solr/build/solr-core/test/J2/temp/solr.schema.TestManagedSchemaAPI_E4BA22C4B411CE95-001/init-core-data-001
    [junit4] 2> 2022191 INFO (SUITE-TestManagedSchemaAPI-seed#[E4BA22C4B411CE95]-worker) [ ] o.a.s.SolrTestCaseJ4 Randomized ssl (false) and clientAuth (false)
    [junit4] 2> 2022193 INFO (TEST-TestManagedSchemaAPI.test-seed#[E4BA22C4B411CE95]) [ ] o.a.s.SolrTestCaseJ4 ###Starting test
    [junit4] 2> 2022193 INFO (TEST-TestManagedSchemaAPI.test-seed#[E4BA22C4B411CE95]) [ ] o.a.s.c.ZkTestServer STARTING ZK TEST SERVER
    [junit4] 2> 2022193 INFO (Thread-4999) [ ] o.a.s.c.ZkTestServer client port:0.0.0.0/0.0.0.0:0
    [junit4] 2> 2022193 INFO (Thread-4999) [ ] o.a.s.c.ZkTestServer Starting server
    [junit4] 2> 2022293 INFO (TEST-TestManagedSchemaAPI.test-seed#[E4BA22C4B411CE95]) [ ] o.a.s.c.ZkTestServer start zk server on port:35298
    [junit4] 2> 2022294 INFO (TEST-TestManagedSchemaAPI.test-seed#[E4BA22C4B411CE95]) [ ] o.a.s.c.c.SolrZkClient Using default ZkCredentialsProvider
    [junit4] 2> 2022294 INFO (TEST-TestManagedSchemaAPI.test-seed#[E4BA22C4B411CE95]) [ ] o.a.s.c.c.ConnectionManager Waiting for client to connect to ZooKeeper
    [junit4] 2> 2022296 INFO (zkCallback-24043-thread-1) [ ] o.a.s.c.c.ConnectionManager Watcher org.apache.solr.common.cloud.ConnectionManager@71f6e15c name:ZooKeeperConnection Watcher:127.0.0.1:35298 got event WatchedEvent state:SyncConnected type:None path:null path:null type:None
    [junit4] 2> 2022296 INFO (TEST-TestManagedSchemaAPI.test-seed#[E4BA22C4B411CE95]) [ ] o.a.s.c.c.ConnectionManager Client is connected to ZooKeeper
    [junit4] 2> 2022296 INFO (TEST-TestManagedSchemaAPI.test-seed#[E4BA22C4B411CE95]) [ ] o.a.s.c.c.SolrZkClient Using default ZkACLProvider
    [junit4] 2> 2022296 INFO (TEST-TestManagedSchemaAPI.test-seed#[E4BA22C4B411CE95]) [ ] o.a.s.c.c.SolrZkClient makePath: /solr/solr.xml
    [junit4] 2> 2022299 INFO (jetty-launcher-24042-thread-2) [ ] o.e.j.s.Server jetty-9.2.13.v20150730
    [junit4] 2> 2022299 INFO (jetty-launcher-24042-thread-1) [ ] o.e.j.s.Server jetty-9.2.13.v20150730
    [junit4] 2> 2022300 INFO (jetty-launcher-24042-thread-1) [ ] o.e.j.s.h.ContextHandler Started o.e.j.s.ServletContextHandler@29ee13ba{/solr,null,AVAILABLE}
    [junit4] 2> 2022300 INFO (jetty-launcher-24042-thread-2) [ ] o.e.j.s.h.ContextHandler Started o.e.j.s.ServletContextHandler@29ee13ba{/solr,null,AVAILABLE}
    [junit4] 2> 2022301 INFO (jetty-launcher-24042-thread-2) [ ] o.e.j.s.ServerConnector Started ServerConnector@c98a5e9{HTTP/1.1}{127.0.0.1:43463}
    [junit4] 2> 2022302 INFO (jetty-launcher-24042-thread-2) [ ] o.e.j.s.Server Started @2023887ms
    [junit4] 2> 2022302 INFO (jetty-launcher-24042-thread-1) [ ] o.e.j.s.ServerConnector Started ServerConnector@79b46a74{HTTP/1.1}{127.0.0.1:39821}
    [junit4] 2> 2022302 INFO (jetty-launcher-24042-thread-2) [ ] o.a.s.c.s.e.JettySolrRunner Jetty properties: {hostPort=43463, hostContext=/solr}
    [junit4] 2> 2022302 INFO (jetty-launcher-24042-thread-1) [ ] o.e.j.s.Server Started @2023887ms
    [junit4] 2> 2022302 INFO (jetty-launcher-24042-thread-1) [ ] o.a.s.c.s.e.JettySolrRunner Jetty properties: {hostContext=/solr, hostPort=39821}
    [junit4] 2> 2022302 INFO (jetty-launcher-24042-thread-2) [ ] o.a.s.s.SolrDispatchFilter SolrDispatchFilter.init(): sun.misc.Launcher$AppClassLoader@373ee92
    [junit4] 2> 2022302 INFO (jetty-launcher-24042-thread-2) [ ] o.a.s.c.SolrResourceLoader new SolrResourceLoader for directory: '/home/jenkins/workspace/Lucene-Solr-5.5-Linux/solr/build/solr-core/test/J2/temp/solr.schema.TestManagedSchemaAPI_E4BA22C4B411CE95-001/tempDir-001/node2'
    [junit4] 2> 2022302 INFO (jetty-launcher-24042-thread-1) [ ] o.a.s.s.SolrDispatchFilter SolrDispatchFilter.init(): sun.misc.Launcher$AppClassLoader@373ee92
    [junit4] 2> 2022302 INFO (jetty-launcher-24042-thread-2) [ ] o.a.s.c.SolrResourceLoader JNDI not configured for solr (NoInitialContextEx)
    [junit4] 2> 2022302 INFO (jetty-launcher-24042-thread-1) [ ] o.a.s.c.SolrResourceLoader new SolrResourceLoader for directory: '/home/jenkins/workspace/Lucene-Solr-5.5-Linux/solr/build/solr-core/test/J2/temp/solr.schema.TestManagedSchemaAPI_E4BA22C4B411CE95-001/tempDir-001/node1'
    [junit4] 2> 2022302 INFO (jetty-launcher-24042-thread-2) [ ] o.a.s.c.SolrResourceLoader solr home defaulted to 'solr/' (could not find system property or JNDI)
    [junit4] 2> 2022302 INFO (jetty-launcher-24042-thread-1) [ ] o.a.s.c.SolrResourceLoader JNDI not configured for solr (NoInitialContextEx)
    [junit4] 2> 2022302 INFO (jetty-launcher-24042-thread-1) [ ] o.a.s.c.SolrResourceLoader solr home defaulted to 'solr/' (could not find system property or JNDI)
    [junit4] 2> 2022303 INFO (jetty-launcher-24042-thread-2) [ ] o.a.s.c.c.SolrZkClient Using default ZkCredentialsProvider
    [junit4] 2> 2022303 INFO (jetty-launcher-24042-thread-1) [ ] o.a.s.c.c.SolrZkClient Using default ZkCredentialsProvider
    [junit4] 2> 2022303 INFO (jetty-launcher-24042-thread-2) [ ] o.a.s.c.c.ConnectionManager Waiting for client to connect to ZooKeeper
    [junit4] 2> 2022303 INFO (jetty-launcher-24042-thread-1) [ ] o.a.s.c.c.ConnectionManager Waiting for client to connect to ZooKeeper
    [junit4] 2> 2022303 INFO (zkCallback-24044-thread-1) [ ] o.a.s.c.c.ConnectionManager Watcher org.apache.solr.common.cloud.ConnectionManager@23a8b193 name:ZooKeeperConnection Watcher:127.0.0.1:35298/solr got event WatchedEvent state:SyncConnected type:None path:null path:null type:None
    [junit4] 2> 2022304 INFO (jetty-launcher-24042-thread-2) [ ] o.a.s.c.c.ConnectionManager Client is connected to ZooKeeper
    [junit4] 2> 2022304 INFO (zkCallback-24045-thread-1) [ ] o.a.s.c.c.ConnectionManager Watcher org.apache.solr.common.cloud.ConnectionManager@3c53fa1e name:ZooKeeperConnection Watcher:127.0.0.1:35298/solr got event WatchedEvent state:SyncConnected type:None path:null path:null type:None
    [junit4] 2> 2022304 INFO (jetty-launcher-24042-thread-1) [ ] o.a.s.c.c.ConnectionManager Client is connected to ZooKeeper
    [junit4] 2> 2022304 INFO (jetty-launcher-24042-thread-2) [ ] o.a.s.c.c.SolrZkClient Using default ZkACLProvider
    [junit4] 2> 2022304 INFO (jetty-launcher-24042-thread-1) [ ] o.a.s.c.c.SolrZkClient Using default ZkACLProvider
    [junit4] 2> 2022304 INFO (jetty-launcher-24042-thread-2) [ ] o.a.s.s.SolrDispatchFilter solr.xml found in ZooKeeper. Loading...
    [junit4] 2> 2022304 INFO (jetty-launcher-24042-thread-1) [ ] o.a.s.s.SolrDispatchFilter solr.xml found in ZooKeeper. Loading...
    [junit4] 2> 2022312 INFO (jetty-launcher-24042-thread-2) [ ] o.a.s.c.CorePropertiesLocator Config-defined core root directory: /home/jenkins/workspace/Lucene-Solr-5.5-Linux/solr/build/solr-core/test/J2/temp/solr.schema.TestManagedSchemaAPI_E4BA22C4B411CE95-001/tempDir-001/node2/.
    [junit4] 2> 2022312 WARN (NIOServerCxn.Factory:0.0.0.0/0.0.0.0:0) [ ] o.a.z.s.NIOServerCnxn caught end of stream exception
    [junit4] 2> EndOfStreamException: Unable to read additional data from client sessionid 0x1555da53d6e0002, likely client has closed socket
    [junit4] 2> at org.apache.zookeeper.server.NIOServerCnxn.doIO(NIOServerCnxn.java:228)
    [junit4] 2> at org.apache.zookeeper.server.NIOServerCnxnFactory.run(NIOServerCnxnFactory.java:208)
    [junit4] 2> at java.lang.Thread.run(Thread.java:745)
    [junit4] 2> 2022312 INFO (jetty-launcher-24042-thread-2) [ ] o.a.s.c.CoreContainer New CoreContainer 1667485794
    [junit4] 2> 2022312 INFO (jetty-launcher-24042-thread-1) [ ] o.a.s.c.CorePropertiesLocator Config-defined core root directory: /home/jenkins/workspace/Lucene-Solr-5.5-Linux/solr/build/solr-core/test/J2/temp/solr.schema.TestManagedSchemaAPI_E4BA22C4B411CE95-001/tempDir-001/node1/.
    [junit4] 2> 2022313 INFO (jetty-launcher-24042-thread-2) [ ] o.a.s.c.CoreContainer Loading cores into CoreContainer [instanceDir=/home/jenkins/workspace/Lucene-Solr-5.5-Linux/solr/build/solr-core/test/J2/temp/solr.schema.TestManagedSchemaAPI_E4BA22C4B411CE95-001/tempDir-001/node2]
    [junit4] 2> 2022313 INFO (jetty-launcher-24042-thread-1) [ ] o.a.s.c.CoreContainer New CoreContainer 221000435
    [junit4] 2> 2022313 INFO (jetty-launcher-24042-thread-1) [ ] o.a.s.c.CoreContainer Loading cores into CoreContainer [instanceDir=/home/jenkins/workspace/Lucene-Solr-5.5-Linux/solr/build/solr-core/test/J2/temp/solr.schema.TestManagedSchemaAPI_E4BA22C4B411CE95-001/tempDir-001/node1]
    [junit4] 2> 2022313 WARN (jetty-launcher-24042-thread-2) [ ] o.a.s.c.CoreContainer Couldn't add files from /home/jenkins/workspace/Lucene-Solr-5.5-Linux/solr/build/solr-core/test/J2/temp/solr.schema.TestManagedSchemaAPI_E4BA22C4B411CE95-001/tempDir-001/node2/lib to classpath: /home/jenkins/workspace/Lucene-Solr-5.5-Linux/solr/build/solr-core/test/J2/temp/solr.schema.TestManagedSchemaAPI_E4BA22C4B411CE95-001/tempDir-001/node2/lib
    [junit4] 2> 2022313 WARN (jetty-launcher-24042-thread-1) [ ] o.a.s.c.CoreContainer Couldn't add files from /home/jenkins/workspace/Lucene-Solr-5.5-Linux/solr/build/solr-core/test/J2/temp/solr.schema.TestManagedSchemaAPI_E4BA22C4B411CE95-001/tempDir-001/node1/lib to classpath: /home/jenkins/workspace/Lucene-Solr-5.5-Linux/solr/build/solr-core/test/J2/temp/solr.schema.TestManagedSchemaAPI_E4BA22C4B411CE95-001/tempDir-001/node1/lib
    [junit4] 2> 2022313 INFO (jetty-launcher-24042-thread-2) [ ] o.a.s.h.c.HttpShardHandlerFactory created with socketTimeout : 90000,urlScheme : ,connTimeout : 15000,maxConnectionsPerHost : 20,maxConnections : 10000,corePoolSize : 0,maximumPoolSize : 2147483647,maxThreadIdleTime : 5,sizeOfQueue : -1,fairnessPolicy : false,useRetries : false,
    [junit4] 2> 2022313 INFO (jetty-launcher-24042-thread-1) [ ] o.a.s.h.c.HttpShardHandlerFactory created with socketTimeout : 90000,urlScheme : ,connTimeout : 15000,maxConnectionsPerHost : 20,maxConnections : 10000,corePoolSize : 0,maximumPoolSize : 2147483647,maxThreadIdleTime : 5,sizeOfQueue : -1,fairnessPolicy : false,useRetries : false,
    [junit4] 2> 2022314 INFO (jetty-launcher-24042-thread-2) [ ] o.a.s.u.UpdateShardHandler Creating UpdateShardHandler HTTP client with params: socketTimeout=340000&connTimeout=45000&retry=true
    [junit4] 2> 2022314 INFO (jetty-launcher-24042-thread-1) [ ] o.a.s.u.UpdateShardHandler Creating UpdateShardHandler HTTP client with params: socketTimeout=340000&connTimeout=45000&retry=true
    [junit4] 2> 2022314 INFO (jetty-launcher-24042-thread-2) [ ] o.a.s.l.LogWatcher SLF4J impl is org.slf4j.impl.Log4jLoggerFactory
    [junit4] 2> 2022314 INFO (jetty-launcher-24042-thread-2) [ ] o.a.s.l.LogWatcher Registering Log Listener [Log4j (org.slf4j.impl.Log4jLoggerFactory)]
    [junit4] 2> 2022314 INFO (jetty-launcher-24042-thread-2) [ ] o.a.s.c.ZkContainer Zookeeper client=127.0.0.1:35298/solr
    [junit4] 2> 2022314 INFO (jetty-launcher-24042-thread-2) [ ] o.a.s.c.ZkController zkHost includes chroot
    [junit4] 2> 2022314 INFO (jetty-launcher-24042-thread-1) [ ] o.a.s.l.LogWatcher SLF4J impl is org.slf4j.impl.Log4jLoggerFactory
    [junit4] 2> 2022314 INFO (jetty-launcher-24042-thread-2) [ ] o.a.s.c.c.SolrZkClient Using default ZkCredentialsProvider
    [junit4] 2> 2022315 INFO (jetty-launcher-24042-thread-1) [ ] o.a.s.l.LogWatcher Registering Log Listener [Log4j (org.slf4j.impl.Log4jLoggerFactory)]
    [junit4] 2> 2022315 INFO (jetty-launcher-24042-thread-1) [ ] o.a.s.c.ZkContainer Zookeeper client=127.0.0.1:35298/solr
    [junit4] 2> 2022315 INFO (jetty-launcher-24042-thread-1) [ ] o.a.s.c.ZkController zkHost includes chroot
    [junit4] 2> 2022315 INFO (jetty-launcher-24042-thread-1) [ ] o.a.s.c.c.SolrZkClient Using default ZkCredentialsProvider
    [junit4] 2> 2022315 INFO (jetty-launcher-24042-thread-2) [ ] o.a.s.c.c.ConnectionManager Waiting for client to connect to ZooKeeper
    [junit4] 2> 2022316 INFO (jetty-launcher-24042-thread-1) [ ] o.a.s.c.c.ConnectionManager Waiting for client to connect to ZooKeeper
    [junit4] 2> 2022317 INFO (zkCallback-24050-thread-1) [ ] o.a.s.c.c.ConnectionManager Watcher org.apache.solr.common.cloud.ConnectionManager@60d94ab5 name:ZooKeeperConnection Watcher:127.0.0.1:35298 got event WatchedEvent state:SyncConnected type:None path:null path:null type:None
    [junit4] 2> 2022317 INFO (jetty-launcher-24042-thread-2) [ ] o.a.s.c.c.ConnectionManager Client is connected to ZooKeeper
    [junit4] 2> 2022317 INFO (zkCallback-24051-thread-1) [ ] o.a.s.c.c.ConnectionManager Watcher org.apache.solr.common.cloud.ConnectionManager@26f2e0e6 name:ZooKeeperConnection Watcher:127.0.0.1:35298 got event WatchedEvent state:SyncConnected type:None path:null path:null type:None
    [junit4] 2> 2022317 INFO (jetty-launcher-24042-thread-1) [ ] o.a.s.c.c.ConnectionManager Client is connected to ZooKeeper
    [junit4] 2> 2022317 INFO (jetty-launcher-24042-thread-2) [ ] o.a.s.c.c.SolrZkClient Using default ZkACLProvider
    [junit4] 2> 2022317 INFO (jetty-launcher-24042-thread-1) [ ] o.a.s.c.c.SolrZkClient Using default ZkACLProvider
    [junit4] 2> 2022317 INFO (jetty-launcher-24042-thread-2) [n:127.0.0.1:43463_solr ] o.a.s.c.ZkController Added new OnReconnect listener org.apache.solr.cloud.ZkController$6@1ee0c717
    [junit4] 2> 2022317 WARN (NIOServerCxn.Factory:0.0.0.0/0.0.0.0:0) [ ] o.a.z.s.NIOServerCnxn caught end of stream exception
    [junit4] 2> EndOfStreamException: Unable to read additional data from client sessionid 0x1555da53d6e0004, likely client has closed socket
    [junit4] 2> at org.apache.zookeeper.server.NIOServerCnxn.doIO(NIOServerCnxn.java:228)
    [junit4] 2> at org.apache.zookeeper.server.NIOServerCnxnFactory.run(NIOServerCnxnFactory.java:208)
    [junit4] 2> at java.lang.Thread.run(Thread.java:745)
    [junit4] 2> 2022317 INFO (jetty-launcher-24042-thread-1) [n:127.0.0.1:39821_solr ] o.a.s.c.ZkController Added new OnReconnect listener org.apache.solr.cloud.ZkController$6@372ec6d7
    [junit4] 2> 2022317 INFO (jetty-launcher-24042-thread-2) [n:127.0.0.1:43463_solr ] o.a.s.c.c.ConnectionManager Waiting for client to connect to ZooKeeper
    [junit4] 2> 2022318 INFO (jetty-launcher-24042-thread-1) [n:127.0.0.1:39821_solr ] o.a.s.c.c.ConnectionManager Waiting for client to connect to ZooKeeper
    [junit4] 2> 2022318 INFO (zkCallback-24052-thread-1-processing-n:127.0.0.1:43463_solr) [n:127.0.0.1:43463_solr ] o.a.s.c.c.ConnectionManager Watcher org.apache.solr.common.cloud.ConnectionManager@78fed17a name:ZooKeeperConnection Watcher:127.0.0.1:35298/solr got event WatchedEvent state:SyncConnected type:None path:null path:null type:None
    [junit4] 2> 2022318 INFO (jetty-launcher-24042-thread-2) [n:127.0.0.1:43463_solr ] o.a.s.c.c.ConnectionManager Client is connected to ZooKeeper
    [junit4] 2> 2022318 INFO (zkCallback-24053-thread-1-processing-n:127.0.0.1:39821_solr) [n:127.0.0.1:39821_solr ] o.a.s.c.c.ConnectionManager Watcher org.apache.solr.common.cloud.ConnectionManager@59f4f440 name:ZooKeeperConnection Watcher:127.0.0.1:35298/solr got event WatchedEvent state:SyncConnected type:None path:null path:null type:None
    [junit4] 2> 2022318 INFO (jetty-launcher-24042-thread-1) [n:127.0.0.1:39821_solr ] o.a.s.c.c.ConnectionManager Client is connected to ZooKeeper
    [junit4] 2> 2022319 INFO (jetty-launcher-24042-thread-2) [n:127.0.0.1:43463_solr ] o.a.s.c.c.SolrZkClient makePath: /overseer/queue
    [junit4] 2> 2022319 INFO (jetty-launcher-24042-thread-1) [n:127.0.0.1:39821_solr ] o.a.s.c.c.SolrZkClient makePath: /overseer/queue
    [junit4] 2> 2022319 INFO (jetty-launcher-24042-thread-2) [n:127.0.0.1:43463_solr ] o.a.s.c.c.SolrZkClient makePath: /overseer/collection-queue-work
    [junit4] 2> 2022319 INFO (jetty-launcher-24042-thread-1) [n:127.0.0.1:39821_solr ] o.a.s.c.c.SolrZkClient makePath: /overseer/collection-queue-work
    [junit4] 2> 2022322 INFO (jetty-launcher-24042-thread-1) [n:127.0.0.1:39821_solr ] o.a.s.c.c.SolrZkClient makePath: /overseer/collection-map-running
    [junit4] 2> 2022322 INFO (jetty-launcher-24042-thread-2) [n:127.0.0.1:43463_solr ] o.a.s.c.c.SolrZkClient makePath: /overseer/collection-map-running
    [junit4] 2> 2022322 INFO (jetty-launcher-24042-thread-1) [n:127.0.0.1:39821_solr ] o.a.s.c.c.SolrZkClient makePath: /overseer/collection-map-completed
    [junit4] 2> 2022322 INFO (jetty-launcher-24042-thread-2) [n:127.0.0.1:43463_solr ] o.a.s.c.c.SolrZkClient makePath: /overseer/collection-map-completed
    [junit4] 2> 2022323 INFO (jetty-launcher-24042-thread-2) [n:127.0.0.1:43463_solr ] o.a.s.c.c.SolrZkClient makePath: /overseer/collection-map-failure
    [junit4] 2> 2022323 INFO (jetty-launcher-24042-thread-1) [n:127.0.0.1:39821_solr ] o.a.s.c.c.SolrZkClient makePath: /overseer/collection-map-failure
    [junit4] 2> 2022324 INFO (jetty-launcher-24042-thread-2) [n:127.0.0.1:43463_solr ] o.a.s.c.c.SolrZkClient makePath: /live_nodes
    [junit4] 2> 2022324 INFO (jetty-launcher-24042-thread-1) [n:127.0.0.1:39821_solr ] o.a.s.c.c.SolrZkClient makePath: /live_nodes
    [junit4] 2> 2022324 INFO (jetty-launcher-24042-thread-1) [n:127.0.0.1:39821_solr ] o.a.s.c.c.SolrZkClient makePath: /collections
    [junit4] 2> 2022324 INFO (jetty-launcher-24042-thread-2) [n:127.0.0.1:43463_solr ] o.a.s.c.c.SolrZkClient makePath: /collections
    [junit4] 2> 2022325 INFO (jetty-launcher-24042-thread-2) [n:127.0.0.1:43463_solr ] o.a.s.c.c.SolrZkClient makePath: /aliases.json
    [junit4] 2> 2022325 INFO (jetty-launcher-24042-thread-1) [n:127.0.0.1:39821_solr ] o.a.s.c.c.SolrZkClient makePath: /aliases.json
    [junit4] 2> 2022325 INFO (jetty-launcher-24042-thread-1) [n:127.0.0.1:39821_solr ] o.a.s.c.c.SolrZkClient makePath: /clusterstate.json
    [junit4] 2> 2022325 INFO (jetty-launcher-24042-thread-2) [n:127.0.0.1:43463_solr ] o.a.s.c.c.SolrZkClient makePath: /clusterstate.json
    [junit4] 2> 2022326 INFO (jetty-launcher-24042-thread-2) [n:127.0.0.1:43463_solr ] o.a.s.c.c.SolrZkClient makePath: /security.json
    [junit4] 2> 2022326 INFO (jetty-launcher-24042-thread-1) [n:127.0.0.1:39821_solr ] o.a.s.c.c.SolrZkClient makePath: /security.json
    [junit4] 2> 2022326 INFO (jetty-launcher-24042-thread-1) [n:127.0.0.1:39821_solr ] o.a.s.c.ZkController Register node as live in ZooKeeper:/live_nodes/127.0.0.1:39821_solr
    [junit4] 2> 2022326 INFO (jetty-launcher-24042-thread-2) [n:127.0.0.1:43463_solr ] o.a.s.c.ZkController Register node as live in ZooKeeper:/live_nodes/127.0.0.1:43463_solr
    [junit4] 2> 2022326 INFO (jetty-launcher-24042-thread-1) [n:127.0.0.1:39821_solr ] o.a.s.c.c.SolrZkClient makePath: /live_nodes/127.0.0.1:39821_solr
    [junit4] 2> 2022326 INFO (jetty-launcher-24042-thread-2) [n:127.0.0.1:43463_solr ] o.a.s.c.c.SolrZkClient makePath: /live_nodes/127.0.0.1:43463_solr
    [junit4] 2> 2022327 INFO (jetty-launcher-24042-thread-1) [n:127.0.0.1:39821_solr ] o.a.s.c.c.SolrZkClient makePath: /overseer_elect
    [junit4] 2> 2022327 INFO (jetty-launcher-24042-thread-2) [n:127.0.0.1:43463_solr ] o.a.s.c.c.SolrZkClient makePath: /overseer_elect
    [junit4] 2> 2022327 INFO (jetty-launcher-24042-thread-1) [n:127.0.0.1:39821_solr ] o.a.s.c.c.SolrZkClient makePath: /overseer_elect/election
    [junit4] 2> 2022327 INFO (jetty-launcher-24042-thread-2) [n:127.0.0.1:43463_solr ] o.a.s.c.c.SolrZkClient makePath: /overseer_elect/election
    [junit4] 2> 2022328 INFO (jetty-launcher-24042-thread-2) [n:127.0.0.1:43463_solr ] o.a.s.c.Overseer Overseer (id=null) closing
    [junit4] 2> 2022328 INFO (jetty-launcher-24042-thread-1) [n:127.0.0.1:39821_solr ] o.a.s.c.Overseer Overseer (id=null) closing
    [junit4] 2> 2022328 INFO (jetty-launcher-24042-thread-2) [n:127.0.0.1:43463_solr ] o.a.s.c.LeaderElector Joined leadership election with path: /overseer_elect/election/96085931339939845-127.0.0.1:43463_solr-n_0000000000
    [junit4] 2> 2022328 INFO (jetty-launcher-24042-thread-1) [n:127.0.0.1:39821_solr ] o.a.s.c.LeaderElector Joined leadership election with path: /overseer_elect/election/96085931339939846-127.0.0.1:39821_solr-n_0000000001
    [junit4] 2> 2022328 INFO (jetty-launcher-24042-thread-2) [n:127.0.0.1:43463_solr ] o.a.s.c.OverseerElectionContext I am going to be the leader 127.0.0.1:43463_solr
    [junit4] 2> 2022328 INFO (jetty-launcher-24042-thread-2) [n:127.0.0.1:43463_solr ] o.a.s.c.c.SolrZkClient makePath: /overseer_elect/leader
    [junit4] 2> 2022328 INFO (jetty-launcher-24042-thread-1) [n:127.0.0.1:39821_solr ] o.a.s.c.LeaderElector Watching path /overseer_elect/election/96085931339939845-127.0.0.1:43463_solr-n_0000000000 to know if I could be the leader
    [junit4] 2> 2022328 INFO (jetty-launcher-24042-thread-1) [n:127.0.0.1:39821_solr ] o.a.s.c.c.ZkStateReader Updating cluster state from ZooKeeper...
    [junit4] 2> 2022329 INFO (jetty-launcher-24042-thread-2) [n:127.0.0.1:43463_solr ] o.a.s.c.Overseer Overseer (id=96085931339939845-127.0.0.1:43463_solr-n_0000000000) starting
    [junit4] 2> 2022330 INFO (jetty-launcher-24042-thread-2) [n:127.0.0.1:43463_solr ] o.a.s.c.c.SolrZkClient makePath: /overseer/queue-work
    [junit4] 2> 2022333 INFO (jetty-launcher-24042-thread-2) [n:127.0.0.1:43463_solr ] o.a.s.c.OverseerAutoReplicaFailoverThread Starting OverseerAutoReplicaFailoverThread autoReplicaFailoverWorkLoopDelay=10000 autoReplicaFailoverWaitAfterExpiration=30000 autoReplicaFailoverBadNodeExpiration=60000
    [junit4] 2> 2022333 INFO (OverseerCollectionConfigSetProcessor-96085931339939845-127.0.0.1:43463_solr-n_0000000000) [n:127.0.0.1:43463_solr ] o.a.s.c.OverseerTaskProcessor Process current queue of overseer operations
    [junit4] 2> 2022333 INFO (jetty-launcher-24042-thread-2) [n:127.0.0.1:43463_solr ] o.a.s.c.c.ZkStateReader Updating cluster state from ZooKeeper...
    [junit4] 2> 2022333 INFO (OverseerStateUpdate-96085931339939845-127.0.0.1:43463_solr-n_0000000000) [n:127.0.0.1:43463_solr ] o.a.s.c.Overseer Starting to work on the main queue
    [junit4] 2> 2022343 INFO (jetty-launcher-24042-thread-2) [n:127.0.0.1:43463_solr ] o.a.s.c.CoreContainer Security conf doesn't exist. Skipping setup for authorization module.
    [junit4] 2> 2022343 INFO (jetty-launcher-24042-thread-2) [n:127.0.0.1:43463_solr ] o.a.s.c.CoreContainer No authentication plugin used.
    [junit4] 2> 2022343 INFO (jetty-launcher-24042-thread-2) [n:127.0.0.1:43463_solr ] o.a.s.c.CorePropertiesLocator Looking for core definitions underneath /home/jenkins/workspace/Lucene-Solr-5.5-Linux/solr/build/solr-core/test/J2/temp/solr.schema.TestManagedSchemaAPI_E4BA22C4B411CE95-001/tempDir-001/node2/.
    [junit4] 2> 2022343 INFO (jetty-launcher-24042-thread-2) [n:127.0.0.1:43463_solr ] o.a.s.c.CorePropertiesLocator Found 0 core definitions
    [junit4] 2> 2022344 INFO (jetty-launcher-24042-thread-2) [n:127.0.0.1:43463_solr ] o.a.s.s.SolrDispatchFilter user.dir=/home/jenkins/workspace/Lucene-Solr-5.5-Linux/solr/build/solr-core/test/J2
    [junit4] 2> 2022345 INFO (jetty-launcher-24042-thread-2) [n:127.0.0.1:43463_solr ] o.a.s.s.SolrDispatchFilter SolrDispatchFilter.init() done
    [junit4] 2> 2022349 INFO (jetty-launcher-24042-thread-1) [n:127.0.0.1:39821_solr ] o.a.s.c.CoreContainer Security conf doesn't exist. Skipping setup for authorization module.
    [junit4] 2> 2022349 INFO (jetty-launcher-24042-thread-1) [n:127.0.0.1:39821_solr ] o.a.s.c.CoreContainer No authentication plugin used.
    [junit4] 2> 2022349 INFO (jetty-launcher-24042-thread-1) [n:127.0.0.1:39821_solr ] o.a.s.c.CorePropertiesLocator Looking for core definitions underneath /home/jenkins/workspace/Lucene-Solr-5.5-Linux/solr/build/solr-core/test/J2/temp/solr.schema.TestManagedSchemaAPI_E4BA22C4B411CE95-001/tempDir-001/node1/.
    [junit4] 2> 2022349 INFO (jetty-launcher-24042-thread-1) [n:127.0.0.1:39821_solr ] o.a.s.c.CorePropertiesLocator Found 0 core definitions
    [junit4] 2> 2022350 INFO (jetty-launcher-24042-thread-1) [n:127.0.0.1:39821_solr ] o.a.s.s.SolrDispatchFilter user.dir=/home/jenkins/workspace/Lucene-Solr-5.5-Linux/solr/build/solr-core/test/J2
    [junit4] 2> 2022350 INFO (jetty-launcher-24042-thread-1) [n:127.0.0.1:39821_solr ] o.a.s.s.SolrDispatchFilter SolrDispatchFilter.init() done
    [junit4] 2> 2022350 INFO (TEST-TestManagedSchemaAPI.test-seed#[E4BA22C4B411CE95]) [ ] o.a.s.c.c.SolrZkClient Using default ZkCredentialsProvider
    [junit4] 2> 2022350 INFO (TEST-TestManagedSchemaAPI.test-seed#[E4BA22C4B411CE95]) [ ] o.a.s.c.c.ConnectionManager Waiting for client to connect to ZooKeeper
    [junit4] 2> 2022351 INFO (zkCallback-24054-thread-1) [ ] o.a.s.c.c.ConnectionManager Watcher org.apache.solr.common.cloud.ConnectionManager@6eade853 name:ZooKeeperConnection Watcher:127.0.0.1:35298 got event WatchedEvent state:SyncConnected type:None path:null path:null type:None
    [junit4] 2> 2022351 INFO (TEST-TestManagedSchemaAPI.test-seed#[E4BA22C4B411CE95]) [ ] o.a.s.c.c.ConnectionManager Client is connected to ZooKeeper
    [junit4] 2> 2022351 INFO (TEST-TestManagedSchemaAPI.test-seed#[E4BA22C4B411CE95]) [ ] o.a.s.c.c.SolrZkClient Using default ZkACLProvider
    [junit4] 2> 2022352 INFO (TEST-TestManagedSchemaAPI.test-seed#[E4BA22C4B411CE95]) [ ] o.a.s.c.c.SolrZkClient Using default ZkCredentialsProvider
    [junit4] 2> 2022352 INFO (TEST-TestManagedSchemaAPI.test-seed#[E4BA22C4B411CE95]) [ ] o.a.s.c.c.ConnectionManager Waiting for client to connect to ZooKeeper
    [junit4] 2> 2022353 INFO (zkCallback-24056-thread-1) [ ] o.a.s.c.c.ConnectionManager Watcher org.apache.solr.common.cloud.ConnectionManager@6190622d name:ZooKeeperConnection Watcher:127.0.0.1:35298/solr got event WatchedEvent state:SyncConnected type:None path:null path:null type:None
    [junit4] 2> 2022353 INFO (TEST-TestManagedSchemaAPI.test-seed#[E4BA22C4B411CE95]) [ ] o.a.s.c.c.ConnectionManager Client is connected to ZooKeeper
    [junit4] 2> 2022353 INFO (TEST-TestManagedSchemaAPI.test-seed#[E4BA22C4B411CE95]) [ ] o.a.s.c.c.SolrZkClient Using default ZkACLProvider
    [junit4] 2> 2022353 INFO (TEST-TestManagedSchemaAPI.test-seed#[E4BA22C4B411CE95]) [ ] o.a.s.c.c.SolrZkClient makePath: /configs/conf1/solrconfig.xml
    [junit4] 2> 2022354 INFO (TEST-TestManagedSchemaAPI.test-seed#[E4BA22C4B411CE95]) [ ] o.a.s.c.c.SolrZkClient makePath: /configs/conf1/managed-schema
    [junit4] 2> 2022355 INFO (TEST-TestManagedSchemaAPI.test-seed#[E4BA22C4B411CE95]) [ ] o.a.s.c.c.SolrZkClient Using default ZkCredentialsProvider
    [junit4] 2> 2022355 INFO (TEST-TestManagedSchemaAPI.test-seed#[E4BA22C4B411CE95]) [ ] o.a.s.c.c.ConnectionManager Waiting for client to connect to ZooKeeper
    [junit4] 2> 2022357 INFO (zkCallback-24057-thread-1) [ ] o.a.s.c.c.ConnectionManager Watcher org.apache.solr.common.cloud.ConnectionManager@1f485cf4 name:ZooKeeperConnection Watcher:127.0.0.1:35298/solr got event WatchedEvent state:SyncConnected type:None path:null path:null type:None
    [junit4] 2> 2022357 INFO (TEST-TestManagedSchemaAPI.test-seed#[E4BA22C4B411CE95]) [ ] o.a.s.c.c.ConnectionManager Client is connected to ZooKeeper
    [junit4] 2> 2022357 INFO (TEST-TestManagedSchemaAPI.test-seed#[E4BA22C4B411CE95]) [ ] o.a.s.c.c.SolrZkClient Using default ZkACLProvider
    [junit4] 2> 2022357 INFO (TEST-TestManagedSchemaAPI.test-seed#[E4BA22C4B411CE95]) [ ] o.a.s.c.c.ZkStateReader Updating cluster state from ZooKeeper...
    [junit4] 2> 2022361 INFO (qtp809289301-93688) [n:127.0.0.1:39821_solr ] o.a.s.h.a.CollectionsHandler Invoked Collection Action :create with params wt=javabin&version=2&replicationFactor=2&numShards=1&collection.configName=conf1&name=testschemaapi&action=CREATE and sendToOCPQueue=true
    [junit4] 2> 2022361 INFO (OverseerCollectionConfigSetProcessor-96085931339939845-127.0.0.1:43463_solr-n_0000000000) [n:127.0.0.1:43463_solr ] o.a.s.c.OverseerTaskProcessor Overseer Collection Message Handler: Get the message id:/overseer/collection-queue-work/qn-0000000000 message:{
    [junit4] 2> "name":"testschemaapi",
    [junit4] 2> "fromApi":"true",
    [junit4] 2> "replicationFactor":"2",
    [junit4] 2> "collection.configName":"conf1",
    [junit4] 2> "numShards":"1",
    [junit4] 2> "stateFormat":"2",
    [junit4] 2> "operation":"create"}
    [junit4] 2> 2022362 INFO (OverseerThreadFactory-9942-thread-1-processing-n:127.0.0.1:43463_solr) [n:127.0.0.1:43463_solr ] o.a.s.c.OverseerCollectionMessageHandler OverseerCollectionMessageHandler.processMessage : create , {
    [junit4] 2> "name":"testschemaapi",
    [junit4] 2> "fromApi":"true",
    [junit4] 2> "replicationFactor":"2",
    [junit4] 2> "collection.configName":"conf1",
    [junit4] 2> "numShards":"1",
    [junit4] 2> "stateFormat":"2",
    [junit4] 2> "operation":"create"}
    [junit4] 2> 2022362 INFO (OverseerThreadFactory-9942-thread-1-processing-n:127.0.0.1:43463_solr) [n:127.0.0.1:43463_solr ] o.a.s.c.OverseerCollectionMessageHandler Create collection testschemaapi
    [junit4] 2> 2022362 INFO (OverseerThreadFactory-9942-thread-1-processing-n:127.0.0.1:43463_solr) [n:127.0.0.1:43463_solr ] o.a.s.c.OverseerCollectionMessageHandler creating collections conf node /collections/testschemaapi
    [junit4] 2> 2022362 INFO (OverseerThreadFactory-9942-thread-1-processing-n:127.0.0.1:43463_solr) [n:127.0.0.1:43463_solr ] o.a.s.c.c.SolrZkClient makePath: /collections/testschemaapi
    [junit4] 2> 2022363 INFO (zkCallback-24052-thread-1-processing-n:127.0.0.1:43463_solr) [n:127.0.0.1:43463_solr ] o.a.s.c.c.ZkStateReader A collections change: [WatchedEvent state:SyncConnected type:NodeChildrenChanged path:/collections], has occurred - updating...
    [junit4] 2> 2022363 INFO (zkCallback-24057-thread-1) [ ] o.a.s.c.c.ZkStateReader A collections change: [WatchedEvent state:SyncConnected type:NodeChildrenChanged path:/collections], has occurred - updating...
    [junit4] 2> 2022363 INFO (zkCallback-24053-thread-1-processing-n:127.0.0.1:39821_solr) [n:127.0.0.1:39821_solr ] o.a.s.c.c.ZkStateReader A collections change: [WatchedEvent state:SyncConnected type:NodeChildrenChanged path:/collections], has occurred - updating...
    [junit4] 2> 2022364 INFO (OverseerStateUpdate-96085931339939845-127.0.0.1:43463_solr-n_0000000000) [n:127.0.0.1:43463_solr ] o.a.s.c.Overseer processMessage: queueSize: 1, message = {
    [junit4] 2> "name":"testschemaapi",
    [junit4] 2> "fromApi":"true",
    [junit4] 2> "replicationFactor":"2",
    [junit4] 2> "collection.configName":"conf1",
    [junit4] 2> "numShards":"1",
    [junit4] 2> "stateFormat":"2",
    [junit4] 2> "operation":"create"} current state version: 0
    [junit4] 2> 2022364 INFO (OverseerStateUpdate-96085931339939845-127.0.0.1:43463_solr-n_0000000000) [n:127.0.0.1:43463_solr ] o.a.s.c.o.ClusterStateMutator building a new cName: testschemaapi
    [junit4] 2> 2022364 INFO (OverseerStateUpdate-96085931339939845-127.0.0.1:43463_solr-n_0000000000) [n:127.0.0.1:43463_solr ] o.a.s.c.o.ZkStateWriter going to create_collection /collections/testschemaapi/state.json
    [junit4] 2> 2022464 INFO (OverseerThreadFactory-9942-thread-1-processing-n:127.0.0.1:43463_solr) [n:127.0.0.1:43463_solr ] o.a.s.c.OverseerCollectionMessageHandler Creating SolrCores for new collection testschemaapi, shardNames [shard1] , replicationFactor : 2
    [junit4] 2> 2022465 INFO (OverseerThreadFactory-9942-thread-1-processing-n:127.0.0.1:43463_solr) [n:127.0.0.1:43463_solr ] o.a.s.c.OverseerCollectionMessageHandler Creating core testschemaapi_shard1_replica1 as part of shard shard1 of collection testschemaapi on 127.0.0.1:43463_solr
    [junit4] 2> 2022465 INFO (OverseerThreadFactory-9942-thread-1-processing-n:127.0.0.1:43463_solr) [n:127.0.0.1:43463_solr ] o.a.s.c.OverseerCollectionMessageHandler Creating core testschemaapi_shard1_replica2 as part of shard shard1 of collection testschemaapi on 127.0.0.1:39821_solr
    [junit4] 2> 2022467 INFO (qtp1711345456-93687) [n:127.0.0.1:43463_solr ] o.a.s.h.a.CoreAdminOperation core create command qt=/admin/cores&wt=javabin&version=2&numShards=1&collection.configName=conf1&collection=testschemaapi&shard=shard1&action=CREATE&name=testschemaapi_shard1_replica1
    [junit4] 2> 2022467 INFO (qtp809289301-93690) [n:127.0.0.1:39821_solr ] o.a.s.h.a.CoreAdminOperation core create command qt=/admin/cores&wt=javabin&version=2&numShards=1&collection.configName=conf1&collection=testschemaapi&shard=shard1&action=CREATE&name=testschemaapi_shard1_replica2
    [junit4] 2> 2022468 INFO (qtp1711345456-93687) [n:127.0.0.1:43463_solr ] o.a.s.c.CoreDescriptor Created CoreDescriptor: {collection.configName=conf1, config=solrconfig.xml, loadOnStartup=true, shard=shard1, name=testschemaapi_shard1_replica1, schema=schema.xml, dataDir=data/, collection=testschemaapi, numShards=1, transient=false, configSetProperties=configsetprops.json}
    [junit4] 2> 2022468 INFO (qtp809289301-93690) [n:127.0.0.1:39821_solr ] o.a.s.c.CoreDescriptor Created CoreDescriptor: {dataDir=data/, loadOnStartup=true, collection.configName=conf1, shard=shard1, configSetProperties=configsetprops.json, name=testschemaapi_shard1_replica2, transient=false, config=solrconfig.xml, numShards=1, schema=schema.xml, collection=testschemaapi}
    [junit4] 2> 2022469 INFO (qtp809289301-93690) [n:127.0.0.1:39821_solr c:testschemaapi s:shard1 x:testschemaapi_shard1_replica2] o.a.s.c.ZkController publishing state=down
    [junit4] 2> 2022469 INFO (qtp1711345456-93687) [n:127.0.0.1:43463_solr c:testschemaapi s:shard1 x:testschemaapi_shard1_replica1] o.a.s.c.ZkController publishing state=down
    [junit4] 2> 2022469 INFO (qtp809289301-93690) [n:127.0.0.1:39821_solr c:testschemaapi s:shard1 x:testschemaapi_shard1_replica2] o.a.s.c.ZkController Registering watch for collection testschemaapi
    [junit4] 2> 2022469 INFO (qtp809289301-93690) [n:127.0.0.1:39821_solr c:testschemaapi s:shard1 x:testschemaapi_shard1_replica2] o.a.s.c.c.ZkStateReader addZkWatch [testschemaapi]
    [junit4] 2> 2022469 INFO (qtp1711345456-93687) [n:127.0.0.1:43463_solr c:testschemaapi s:shard1 x:testschemaapi_shard1_replica1] o.a.s.c.ZkController Registering watch for collection testschemaapi
    [junit4] 2> 2022470 INFO (qtp1711345456-93687) [n:127.0.0.1:43463_solr c:testschemaapi s:shard1 x:testschemaapi_shard1_replica1] o.a.s.c.c.ZkStateReader addZkWatch [testschemaapi]
    [junit4] 2> 2022470 INFO (OverseerStateUpdate-96085931339939845-127.0.0.1:43463_solr-n_0000000000) [n:127.0.0.1:43463_solr ] o.a.s.c.Overseer processMessage: queueSize: 2, message = {
    [junit4] 2> "node_name":"127.0.0.1:39821_solr",
    [junit4] 2> "numShards":"1",
    [junit4] 2> "core":"testschemaapi_shard1_replica2",
    [junit4] 2> "operation":"state",
    [junit4] 2> "state":"down",
    [junit4] 2> "collection":"testschemaapi",
    [junit4] 2> "shard":"shard1",
    [junit4] 2> "roles":null,
    [junit4] 2> "base_url":"http://127.0.0.1:39821/solr"} current state version: 0
    [junit4] 2> 2022470 INFO (qtp809289301-93690) [n:127.0.0.1:39821_solr c:testschemaapi s:shard1 x:testschemaapi_shard1_replica2] o.a.s.c.c.ZkStateReader Add data for [testschemaapi] ver [0]
    [junit4] 2> 2022470 INFO (qtp1711345456-93687) [n:127.0.0.1:43463_solr c:testschemaapi s:shard1 x:testschemaapi_shard1_replica1] o.a.s.c.c.ZkStateReader Add data for [testschemaapi] ver [0]
    [junit4] 2> 2022470 INFO (qtp809289301-93690) [n:127.0.0.1:39821_solr c:testschemaapi s:shard1 x:testschemaapi_shard1_replica2] o.a.s.c.ZkController look for our core node name
    [junit4] 2> 2022470 INFO (qtp1711345456-93687) [n:127.0.0.1:43463_solr c:testschemaapi s:shard1 x:testschemaapi_shard1_replica1] o.a.s.c.ZkController look for our core node name
    [junit4] 2> 2022470 INFO (OverseerStateUpdate-96085931339939845-127.0.0.1:43463_solr-n_0000000000) [n:127.0.0.1:43463_solr ] o.a.s.c.o.ReplicaMutator Update state numShards=1 message={
    [junit4] 2> "node_name":"127.0.0.1:39821_solr",
    [junit4] 2> "numShards":"1",
    [junit4] 2> "core":"testschemaapi_shard1_replica2",
    [junit4] 2> "operation":"state",
    [junit4] 2> "state":"down",
    [junit4] 2> "collection":"testschemaapi",
    [junit4] 2> "shard":"shard1",
    [junit4] 2> "roles":null,
    [junit4] 2> "base_url":"http://127.0.0.1:39821/solr"}
    [junit4] 2> 2022471 INFO (OverseerStateUpdate-96085931339939845-127.0.0.1:43463_solr-n_0000000000) [n:127.0.0.1:43463_solr ] o.a.s.c.Overseer processMessage: queueSize: 1, message = {
    [junit4] 2> "node_name":"127.0.0.1:43463_solr",
    [junit4] 2> "numShards":"1",
    [junit4] 2> "core":"testschemaapi_shard1_replica1",
    [junit4] 2> "operation":"state",
    [junit4] 2> "state":"down",
    [junit4] 2> "collection":"testschemaapi",
    [junit4] 2> "shard":"shard1",
    [junit4] 2> "roles":null,
    [junit4] 2> "base_url":"http://127.0.0.1:43463/solr"} current state version: 0
    [junit4] 2> 2022471 INFO (OverseerStateUpdate-96085931339939845-127.0.0.1:43463_solr-n_0000000000) [n:127.0.0.1:43463_solr ] o.a.s.c.o.ReplicaMutator Update state numShards=1 message={
    [junit4] 2> "node_name":"127.0.0.1:43463_solr",
    [junit4] 2> "numShards":"1",
    [junit4] 2> "core":"testschemaapi_shard1_replica1",
    [junit4] 2> "operation":"state",
    [junit4] 2> "state":"down",
    [junit4] 2> "collection":"testschemaapi",
    [junit4] 2> "shard":"shard1",
    [junit4] 2> "roles":null,
    [junit4] 2> "base_url":"http://127.0.0.1:43463/solr"}
    [junit4] 2> 2022572 INFO (OverseerStateUpdate-96085931339939845-127.0.0.1:43463_solr-n_0000000000) [n:127.0.0.1:43463_solr ] o.a.s.c.o.ZkStateWriter going to update_collection /collections/testschemaapi/state.json version: 0
    [junit4] 2> 2022573 INFO (zkCallback-24053-thread-1-processing-n:127.0.0.1:39821_solr) [n:127.0.0.1:39821_solr ] o.a.s.c.c.ZkStateReader A cluster state change: [WatchedEvent state:SyncConnected type:NodeDataChanged path:/collections/testschemaapi/state.json] for collection [testschemaapi] has occurred - updating... (live nodes size: [2])
    [junit4] 2> 2022573 INFO (zkCallback-24052-thread-1-processing-n:127.0.0.1:43463_solr) [n:127.0.0.1:43463_solr ] o.a.s.c.c.ZkStateReader A cluster state change: [WatchedEvent state:SyncConnected type:NodeDataChanged path:/collections/testschemaapi/state.json] for collection [testschemaapi] has occurred - updating... (live nodes size: [2])
    [junit4] 2> 2022573 INFO (zkCallback-24053-thread-1-processing-n:127.0.0.1:39821_solr) [n:127.0.0.1:39821_solr ] o.a.s.c.c.ZkStateReader Updating data for [testschemaapi] from [0] to [1]
    [junit4] 2> 2022573 INFO (zkCallback-24052-thread-1-processing-n:127.0.0.1:43463_solr) [n:127.0.0.1:43463_solr ] o.a.s.c.c.ZkStateReader Updating data for [testschemaapi] from [0] to [1]
    [junit4] 2> 2023470 INFO (qtp809289301-93690) [n:127.0.0.1:39821_solr c:testschemaapi s:shard1 x:testschemaapi_shard1_replica2] o.a.s.c.ZkController waiting to find shard id in clusterstate for testschemaapi_shard1_replica2
    [junit4] 2> 2023470 INFO (qtp1711345456-93687) [n:127.0.0.1:43463_solr c:testschemaapi s:shard1 x:testschemaapi_shard1_replica1] o.a.s.c.ZkController waiting to find shard id in clusterstate for testschemaapi_shard1_replica1
    [junit4] 2> 2023470 INFO (qtp809289301-93690) [n:127.0.0.1:39821_solr c:testschemaapi s:shard1 x:testschemaapi_shard1_replica2] o.a.s.c.ZkController Check for collection zkNode:testschemaapi
    [junit4] 2> 2023470 INFO (qtp1711345456-93687) [n:127.0.0.1:43463_solr c:testschemaapi s:shard1 x:testschemaapi_shard1_replica1] o.a.s.c.ZkController Check for collection zkNode:testschemaapi
    [junit4] 2> 2023470 INFO (qtp1711345456-93687) [n:127.0.0.1:43463_solr c:testschemaapi s:shard1 x:testschemaapi_shard1_replica1] o.a.s.c.ZkController Collection zkNode exists
    [junit4] 2> 2023470 INFO (qtp809289301-93690) [n:127.0.0.1:39821_solr c:testschemaapi s:shard1 x:testschemaapi_shard1_replica2] o.a.s.c.ZkController Collection zkNode exists
    [junit4] 2> 2023470 INFO (qtp1711345456-93687) [n:127.0.0.1:43463_solr c:testschemaapi s:shard1 x:testschemaapi_shard1_replica1] o.a.s.c.c.ZkStateReader Load collection config from: [/collections/testschemaapi]
    [junit4] 2> 2023471 INFO (qtp809289301-93690) [n:127.0.0.1:39821_solr c:testschemaapi s:shard1 x:testschemaapi_shard1_replica2] o.a.s.c.c.ZkStateReader Load collection config from: [/collections/testschemaapi]
    [junit4] 2> 2023471 INFO (qtp1711345456-93687) [n:127.0.0.1:43463_solr c:testschemaapi s:shard1 x:testschemaapi_shard1_replica1] o.a.s.c.c.ZkStateReader path=[/collections/testschemaapi] [configName]=[conf1] specified config exists in ZooKeeper
    [junit4] 2> 2023471 INFO (qtp809289301-93690) [n:127.0.0.1:39821_solr c:testschemaapi s:shard1 x:testschemaapi_shard1_replica2] o.a.s.c.c.ZkStateReader path=[/collections/testschemaapi] [configName]=[conf1] specified config exists in ZooKeeper
    [junit4] 2> 2023471 INFO (qtp1711345456-93687) [n:127.0.0.1:43463_solr c:testschemaapi s:shard1 x:testschemaapi_shard1_replica1] o.a.s.c.SolrResourceLoader new SolrResourceLoader for directory: '/home/jenkins/workspace/Lucene-Solr-5.5-Linux/solr/build/solr-core/test/J2/temp/solr.schema.TestManagedSchemaAPI_E4BA22C4B411CE95-001/tempDir-001/node2/testschemaapi_shard1_replica1'
    [junit4] 2> 2023471 INFO (qtp809289301-93690) [n:127.0.0.1:39821_solr c:testschemaapi s:shard1 x:testschemaapi_shard1_replica2] o.a.s.c.SolrResourceLoader new SolrResourceLoader for directory: '/home/jenkins/workspace/Lucene-Solr-5.5-Linux/solr/build/solr-core/test/J2/temp/solr.schema.TestManagedSchemaAPI_E4BA22C4B411CE95-001/tempDir-001/node1/testschemaapi_shard1_replica2'
    [junit4] 2> 2023471 INFO (qtp1711345456-93687) [n:127.0.0.1:43463_solr c:testschemaapi s:shard1 x:testschemaapi_shard1_replica1] o.a.s.c.SolrResourceLoader JNDI not configured for solr (NoInitialContextEx)
    [junit4] 2> 2023471 INFO (qtp809289301-93690) [n:127.0.0.1:39821_solr c:testschemaapi s:shard1 x:testschemaapi_shard1_replica2] o.a.s.c.SolrResourceLoader JNDI not configured for solr (NoInitialContextEx)
    [junit4] 2> 2023471 INFO (qtp1711345456-93687) [n:127.0.0.1:43463_solr c:testschemaapi s:shard1 x:testschemaapi_shard1_replica1] o.a.s.c.SolrResourceLoader solr home defaulted to 'solr/' (could not find system property or JNDI)
    [junit4] 2> 2023471 INFO (qtp809289301-93690) [n:127.0.0.1:39821_solr c:testschemaapi s:shard1 x:testschemaapi_shard1_replica2] o.a.s.c.SolrResourceLoader solr home defaulted to 'solr/' (could not find system property or JNDI)
    [junit4] 2> 2023473 INFO (qtp809289301-93690) [n:127.0.0.1:39821_solr c:testschemaapi s:shard1 x:testschemaapi_shard1_replica2] o.a.s.c.Config loaded config solrconfig.xml with version 0
    [junit4] 2> 2023473 INFO (qtp1711345456-93687) [n:127.0.0.1:43463_solr c:testschemaapi s:shard1 x:testschemaapi_shard1_replica1] o.a.s.c.Config loaded config solrconfig.xml with version 0
    [junit4] 2> 2023477 INFO (qtp809289301-93690) [n:127.0.0.1:39821_solr c:testschemaapi s:shard1 x:testschemaapi_shard1_replica2] o.a.s.c.SolrConfig current version of requestparams : -1
    [junit4] 2> 2023477 INFO (qtp1711345456-93687) [n:127.0.0.1:43463_solr c:testschemaapi s:shard1 x:testschemaapi_shard1_replica1] o.a.s.c.SolrConfig current version of requestparams : -1
    [junit4] 2> 2023483 INFO (qtp809289301-93690) [n:127.0.0.1:39821_solr c:testschemaapi s:shard1 x:testschemaapi_shard1_replica2] o.a.s.c.SolrConfig Using Lucene MatchVersion: 5.5.2
    [junit4] 2> 2023483 INFO (qtp1711345456-93687) [n:127.0.0.1:43463_solr c:testschemaapi s:shard1 x:testschemaapi_shard1_replica1] o.a.s.c.SolrConfig Using Lucene MatchVersion: 5.5.2
    [junit4] 2> 2023497 INFO (qtp809289301-93690) [n:127.0.0.1:39821_solr c:testschemaapi s:shard1 x:testschemaapi_shard1_replica2] o.a.s.c.SolrConfig Loaded SolrConfig: solrconfig.xml
    [junit4] 2> 2023497 INFO (qtp1711345456-93687) [n:127.0.0.1:43463_solr c:testschemaapi s:shard1 x:testschemaapi_shard1_replica1] o.a.s.c.SolrConfig Loaded SolrConfig: solrconfig.xml
    [junit4] 2> 2023500 INFO (qtp809289301-93690) [n:127.0.0.1:39821_solr c:testschemaapi s:shard1 x:testschemaapi_shard1_replica2] o.a.s.s.IndexSchema [testschemaapi_shard1_replica2] Schema name=minimal
    [junit4] 2> 2023500 INFO (qtp1711345456-93687) [n:127.0.0.1:43463_solr c:testschemaapi s:shard1 x:testschemaapi_shard1_replica1] o.a.s.s.IndexSchema [testschemaapi_shard1_replica1] Schema name=minimal
    [junit4] 2> 2023505 INFO (qtp809289301-93690) [n:127.0.0.1:39821_solr c:testschemaapi s:shard1 x:testschemaapi_shard1_replica2] o.a.s.s.IndexSchema unique key field: id
    [junit4] 2> 2023505 INFO (qtp1711345456-93687) [n:127.0.0.1:43463_solr c:testschemaapi s:shard1 x:testschemaapi_shard1_replica1] o.a.s.s.IndexSchema unique key field: id
    [junit4] 2> 2023523 INFO (qtp809289301-93690) [n:127.0.0.1:39821_solr c:testschemaapi s:shard1 x:testschemaapi_shard1_replica2] o.a.s.c.ConfigSetProperties Did not find ConfigSet properties, assuming default properties: Can't find resource 'configsetprops.json' in classpath or '/configs/conf1', cwd=/home/jenkins/workspace/Lucene-Solr-5.5-Linux/solr/build/solr-core/test/J2
    [junit4] 2> 2023523 INFO (qtp1711345456-93687) [n:127.0.0.1:43463_solr c:testschemaapi s:shard1 x:testschemaapi_shard1_replica1] o.a.s.c.ConfigSetProperties Did not find ConfigSet properties, assuming default properties: Can't find resource 'configsetprops.json' in classpath or '/configs/conf1', cwd=/home/jenkins/workspace/Lucene-Solr-5.5-Linux/solr/build/solr-core/test/J2
    [junit4] 2> 2023524 INFO (qtp809289301-93690) [n:127.0.0.1:39821_solr c:testschemaapi s:shard1 x:testschemaapi_shard1_replica2] o.a.s.c.CoreContainer Creating SolrCore 'testschemaapi_shard1_replica2' using configuration from collection testschemaapi
    [junit4] 2> 2023524 INFO (qtp1711345456-93687) [n:127.0.0.1:43463_solr c:testschemaapi s:shard1 x:testschemaapi_shard1_replica1] o.a.s.c.CoreContainer Creating SolrCore 'testschemaapi_shard1_replica1' using configuration from collection testschemaapi
    [junit4] 2> 2023524 INFO (qtp809289301-93690) [n:127.0.0.1:39821_solr c:testschemaapi s:shard1 r:core_node1 x:testschemaapi_shard1_replica2] o.a.s.c.SolrCore org.apache.solr.core.MockDirectoryFactory
    [junit4] 2> 2023524 INFO (qtp1711345456-93687) [n:127.0.0.1:43463_solr c:testschemaapi s:shard1 r:core_node2 x:testschemaapi_shard1_replica1] o.a.s.c.SolrCore org.apache.solr.core.MockDirectoryFactory
    [junit4] 2> 2023524 INFO (qtp809289301-93690) [n:127.0.0.1:39821_solr c:testschemaapi s:shard1 r:core_node1 x:testschemaapi_shard1_replica2] o.a.s.c.SolrCore [[testschemaapi_shard1_replica2] ] Opening new SolrCore at [/home/jenkins/workspace/Lucene-Solr-5.5-Linux/solr/build/solr-core/test/J2/temp/solr.schema.TestManagedSchemaAPI_E4BA22C4B411CE95-001/tempDir-001/node1/testschemaapi_shard1_replica2], dataDir=[/home/jenkins/workspace/Lucene-Solr-5.5-Linux/solr/build/solr-core/test/J2/temp/solr.schema.TestManagedSchemaAPI_E4BA22C4B411CE95-001/tempDir-001/node1/./testschemaapi_shard1_replica2/data/]
    [junit4] 2> 2023524 INFO (qtp1711345456-93687) [n:127.0.0.1:43463_solr c:testschemaapi s:shard1 r:core_node2 x:testschemaapi_shard1_replica1] o.a.s.c.SolrCore [[testschemaapi_shard1_replica1] ] Opening new SolrCore at [/home/jenkins/workspace/Lucene-Solr-5.5-Linux/solr/build/solr-core/test/J2/temp/solr.schema.TestManagedSchemaAPI_E4BA22C4B411CE95-001/tempDir-001/node2/testschemaapi_shard1_replica1], dataDir=[/home/jenkins/workspace/Lucene-Solr-5.5-Linux/solr/build/solr-core/test/J2/temp/solr.schema.TestManagedSchemaAPI_E4BA22C4B411CE95-001/tempDir-001/node2/./testschemaapi_shard1_replica1/data/]
    [junit4] 2> 2023524 INFO (qtp809289301-93690) [n:127.0.0.1:39821_solr c:testschemaapi s:shard1 r:core_node1 x:testschemaapi_shard1_replica2] o.a.s.c.SolrCore JMX monitoring not detected for core: testschemaapi_shard1_replica2
    [junit4] 2> 2023524 INFO (qtp1711345456-93687) [n:127.0.0.1:43463_solr c:testschemaapi s:shard1 r:core_node2 x:testschemaapi_shard1_replica1] o.a.s.c.SolrCore JMX monitoring not detected for core: testschemaapi_shard1_replica1
    [junit4] 2> 2023525 INFO (qtp809289301-93690) [n:127.0.0.1:39821_solr c:testschemaapi s:shard1 r:core_node1 x:testschemaapi_shard1_replica2] o.a.s.c.CachingDirectoryFactory return new directory for /home/jenkins/workspace/Lucene-Solr-5.5-Linux/solr/build/solr-core/test/J2/temp/solr.schema.TestManagedSchemaAPI_E4BA22C4B411CE95-001/tempDir-001/node1/./testschemaapi_shard1_replica2/data
    [junit4] 2> 2023525 INFO (qtp1711345456-93687) [n:127.0.0.1:43463_solr c:testschemaapi s:shard1 r:core_node2 x:testschemaapi_shard1_replica1] o.a.s.c.CachingDirectoryFactory return new directory for /home/jenkins/workspace/Lucene-Solr-5.5-Linux/solr/build/solr-core/test/J2/temp/solr.schema.TestManagedSchemaAPI_E4BA22C4B411CE95-001/tempDir-001/node2/./testschemaapi_shard1_replica1/data
    [junit4] 2> 2023525 INFO (qtp809289301-93690) [n:127.0.0.1:39821_solr c:testschemaapi s:shard1 r:core_node1 x:testschemaapi_shard1_replica2] o.a.s.c.SolrCore New index directory detected: old=null new=/home/jenkins/workspace/Lucene-Solr-5.5-Linux/solr/build/solr-core/test/J2/temp/solr.schema.TestManagedSchemaAPI_E4BA22C4B411CE95-001/tempDir-001/node1/./testschemaapi_shard1_replica2/data/index/
    [junit4] 2> 2023525 INFO (qtp1711345456-93687) [n:127.0.0.1:43463_solr c:testschemaapi s:shard1 r:core_node2 x:testschemaapi_shard1_replica1] o.a.s.c.SolrCore New index directory detected: old=null new=/home/jenkins/workspace/Lucene-Solr-5.5-Linux/solr/build/solr-core/test/J2/temp/solr.schema.TestManagedSchemaAPI_E4BA22C4B411CE95-001/tempDir-001/node2/./testschemaapi_shard1_replica1/data/index/
    [junit4] 2> 2023525 WARN (qtp809289301-93690) [n:127.0.0.1:39821_solr c:testschemaapi s:shard1 r:core_node1 x:testschemaapi_shard1_replica2] o.a.s.c.SolrCore [testschemaapi_shard1_replica2] Solr index directory '/home/jenkins/workspace/Lucene-Solr-5.5-Linux/solr/build/solr-core/test/J2/temp/solr.schema.TestManagedSchemaAPI_E4BA22C4B411CE95-001/tempDir-001/node1/./testschemaapi_shard1_replica2/data/index' doesn't exist. Creating new index...
    [junit4] 2> 2023525 WARN (qtp1711345456-93687) [n:127.0.0.1:43463_solr c:testschemaapi s:shard1 r:core_node2 x:testschemaapi_shard1_replica1] o.a.s.c.SolrCore [testschemaapi_shard1_replica1] Solr index directory '/home/jenkins/workspace/Lucene-Solr-5.5-Linux/solr/build/solr-core/test/J2/temp/solr.schema.TestManagedSchemaAPI_E4BA22C4B411CE95-001/tempDir-001/node2/./testschemaapi_shard1_replica1/data/index' doesn't exist. Creating new index...
    [junit4] 2> 2023526 INFO (qtp809289301-93690) [n:127.0.0.1:39821_solr c:testschemaapi s:shard1 r:core_node1 x:testschemaapi_shard1_replica2] o.a.s.c.CachingDirectoryFactory return new directory for /home/jenkins/workspace/Lucene-Solr-5.5-Linux/solr/build/solr-core/test/J2/temp/solr.schema.TestManagedSchemaAPI_E4BA22C4B411CE95-001/tempDir-001/node1/./testschemaapi_shard1_replica2/data/index
    [junit4] 2> 2023526 INFO (qtp1711345456-93687) [n:127.0.0.1:43463_solr c:testschemaapi s:shard1 r:core_node2 x:testschemaapi_shard1_replica1] o.a.s.c.CachingDirectoryFactory return new directory for /home/jenkins/workspace/Lucene-Solr-5.5-Linux/solr/build/solr-core/test/J2/temp/solr.schema.TestManagedSchemaAPI_E4BA22C4B411CE95-001/tempDir-001/node2/./testschemaapi_shard1_replica1/data/index
    [junit4] 2> 2023526 INFO (qtp809289301-93690) [n:127.0.0.1:39821_solr c:testschemaapi s:shard1 r:core_node1 x:testschemaapi_shard1_replica2] o.a.s.c.SolrDeletionPolicy SolrDeletionPolicy.onCommit: commits: num=1
    [junit4] 2> commit{dir=MockDirectoryWrapper(RAMDirectory@73d426d7 lockFactory=org.apache.lucene.store.SingleInstanceLockFactory@6d4228a9),segFN=segments_1,generation=1}
    [junit4] 2> 2023526 INFO (qtp1711345456-93687) [n:127.0.0.1:43463_solr c:testschemaapi s:shard1 r:core_node2 x:testschemaapi_shard1_replica1] o.a.s.c.SolrDeletionPolicy SolrDeletionPolicy.onCommit: commits: num=1
    [junit4] 2> commit{dir=MockDirectoryWrapper(RAMDirectory@127ba749 lockFactory=org.apache.lucene.store.SingleInstanceLockFactory@7423b319),segFN=segments_1,generation=1}
    [junit4] 2> 2023526 INFO (qtp809289301-93690) [n:127.0.0.1:39821_solr c:testschemaapi s:shard1 r:core_node1 x:testschemaapi_shard1_replica2] o.a.s.c.SolrDeletionPolicy newest commit generation = 1
    [junit4] 2> 2023526 INFO (qtp1711345456-93687) [n:127.0.0.1:43463_solr c:testschemaapi s:shard1 r:core_node2 x:testschemaapi_shard1_replica1] o.a.s.c.SolrDeletionPolicy newest commit generation = 1
    [junit4] 2> 2023526 INFO (OldIndexDirectoryCleanupThreadForCore-testschemaapi_shard1_replica2) [n:127.0.0.1:39821_solr c:testschemaapi s:shard1 r:core_node1 x:testschemaapi_shard1_replica2] o.a.s.c.SolrCore Looking for old index directories to cleanup for core testschemaapi_shard1_replica2 in /home/jenkins/workspace/Lucene-Solr-5.5-Linux/solr/build/solr-core/test/J2/temp/solr.schema.TestManagedSchemaAPI_E4BA22C4B411CE95-001/tempDir-001/node1/./testschemaapi_shard1_replica2/data/
    [junit4] 2> 2023527 INFO (OldIndexDirectoryCleanupThreadForCore-testschemaapi_shard1_replica1) [n:127.0.0.1:43463_solr c:testschemaapi s:shard1 r:core_node2 x:testschemaapi_shard1_replica1] o.a.s.c.SolrCore Looking for old index directories to cleanup for core testschemaapi_shard1_replica1 in /home/jenkins/workspace/Lucene-Solr-5.5-Linux/solr/build/solr-core/test/J2/temp/solr.schema.TestManagedSchemaAPI_E4BA22C4B411CE95-001/tempDir-001/node2/./testschemaapi_shard1_replica1/data/
    [junit4] 2> 2023527 WARN (OldIndexDirectoryCleanupThreadForCore-testschemaapi_shard1_replica2) [n:127.0.0.1:39821_solr c:testschemaapi s:shard1 r:core_node1 x:testschemaapi_shard1_replica2] o.a.s.c.DirectoryFactory /home/jenkins/workspace/Lucene-Solr-5.5-Linux/solr/build/solr-core/test/J2/temp/solr.schema.TestManagedSchemaAPI_E4BA22C4B411CE95-001/tempDir-001/node1/./testschemaapi_shard1_replica2/data/ does not point to a valid data directory; skipping clean-up of old index directories.
    [junit4] 2> 2023527 WARN (OldIndexDirectoryCleanupThreadForCore-testschemaapi_shard1_replica1) [n:127.0.0.1:43463_solr c:testschemaapi s:shard1 r:core_node2 x:testschemaapi_shard1_replica1] o.a.s.c.DirectoryFactory /home/jenkins/workspace/Lucene-Solr-5.5-Linux/solr/build/solr-core/test/J2/temp/solr.schema.TestManagedSchemaAPI_E4BA22C4B411CE95-001/tempDir-001/node2/./testschemaapi_shard1_replica1/data/ does not point to a valid data directory; skipping clean-up of old index directories.
    [junit4] 2> 2023527 INFO (qtp809289301-93690) [n:127.0.0.1:39821_solr c:testschemaapi s:shard1 r:core_node1 x:testschemaapi_shard1_replica2] o.a.s.c.SolrCore no updateRequestProcessorChain defined as default, creating implicit default
    [junit4] 2> 2023527 INFO (qtp1711345456-93687) [n:127.0.0.1:43463_solr c:testschemaapi s:shard1 r:core_node2 x:testschemaapi_shard1_replica1] o.a.s.c.SolrCore no updateRequestProcessorChain defined as default, creating implicit default
    [junit4] 2> 2023528 INFO (qtp1711345456-93687) [n:127.0.0.1:43463_solr c:testschemaapi s:shard1 r:core_node2 x:testschemaapi_shard1_replica1] o.a.s.h.l.XMLLoader xsltCacheLifetimeSeconds=60
    [junit4] 2> 2023528 INFO (qtp809289301-93690) [n:127.0.0.1:39821_solr c:testschemaapi s:shard1 r:core_node1 x:testschemaapi_shard1_replica2] o.a.s.h.l.XMLLoader xsltCacheLifetimeSeconds=60
    [junit4] 2> 2023529 INFO (qtp1711345456-93687) [n:127.0.0.1:43463_solr c:testschemaapi s:shard1 r:core_node2 x:testschemaapi_shard1_replica1] o.a.s.h.l.XMLLoader xsltCacheLifetimeSeconds=60
    [junit4] 2> 2023529 INFO (qtp809289301-93690) [n:127.0.0.1:39821_solr c:testschemaapi s:shard1 r:core_node1 x:testschemaapi_shard1_replica2] o.a.s.h.l.XMLLoader xsltCacheLifetimeSeconds=60
    [junit4] 2> 2023530 INFO (qtp1711345456-93687) [n:127.0.0.1:43463_solr c:testschemaapi s:shard1 r:core_node2 x:testschemaapi_shard1_replica1] o.a.s.h.l.XMLLoader xsltCacheLifetimeSeconds=60
    [junit4] 2> 2023530 INFO (qtp809289301-93690) [n:127.0.0.1:39821_solr c:testschemaapi s:shard1 r:core_node1 x:testschemaapi_shard1_replica2] o.a.s.h.l.XMLLoader xsltCacheLifetimeSeconds=60
    [junit4] 2> 2023530 INFO (qtp1711345456-93687) [n:127.0.0.1:43463_solr c:testschemaapi s:shard1 r:core_node2 x:testschemaapi_shard1_replica1] o.a.s.h.l.XMLLoader xsltCacheLifetimeSeconds=60
    [junit4] 2> 2023530 INFO (qtp809289301-93690) [n:127.0.0.1:39821_solr c:testschemaapi s:shard1 r:core_node1 x:testschemaapi_shard1_replica2] o.a.s.h.l.XMLLoader xsltCacheLifetimeSeconds=60
    [junit4] 2> 2023531 INFO (qtp1711345456-93687) [n:127.0.0.1:43463_solr c:testschemaapi s:shard1 r:core_node2 x:testschemaapi_shard1_replica1] o.a.s.c.RequestHandlers Registered paths: /admin/ping,/get,/admin/luke,/admin/threads,/update/json,/admin/system,/admin/properties,/update,/admin/plugins,/select,/admin/segments,/admin/logging,/config,/update/csv,/admin/file,/update/json/docs,/replication,/schema,/admin/mbeans
    [junit4] 2> 2023531 INFO (qtp809289301-93690) [n:127.0.0.1:39821_solr c:testschemaapi s:shard1 r:core_node1 x:testschemaapi_shard1_replica2] o.a.s.c.RequestHandlers Registered paths: /admin/ping,/get,/admin/luke,/admin/threads,/update/json,/admin/system,/admin/properties,/update,/admin/plugins,/select,/admin/segments,/admin/logging,/config,/update/csv,/admin/file,/update/json/docs,/replication,/schema,/admin/mbeans
    [junit4] 2> 2023533 INFO (qtp1711345456-93687) [n:127.0.0.1:43463_solr c:testschemaapi s:shard1 r:core_node2 x:testschemaapi_shard1_replica1] o.a.s.c.SolrCore Using default statsCache cache: org.apache.solr.search.stats.LocalStatsCache
    [junit4] 2> 2023533 INFO (qtp809289301-93690) [n:127.0.0.1:39821_solr c:testschemaapi s:shard1 r:core_node1 x:testschemaapi_shard1_replica2] o.a.s.c.SolrCore Using default statsCache cache: org.apache.solr.search.stats.LocalStatsCache
    [junit4] 2> 2023533 INFO (qtp1711345456-93687) [n:127.0.0.1:43463_solr c:testschemaapi s:shard1 r:core_node2 x:testschemaapi_shard1_replica1] o.a.s.u.UpdateHandler Using UpdateLog implementation: org.apache.solr.update.UpdateLog
    [junit4] 2> 2023533 INFO (qtp1711345456-93687) [n:127.0.0.1:43463_solr c:testschemaapi s:shard1 r:core_node2 x:testschemaapi_shard1_replica1] o.a.s.u.UpdateLog Initializing UpdateLog: dataDir=null defaultSyncLevel=FLUSH numRecordsToKeep=100 maxNumLogsToKeep=10 numVersionBuckets=65536
    [junit4] 2> 2023533 INFO (qtp809289301-93690) [n:127.0.0.1:39821_solr c:testschemaapi s:shard1 r:core_node1 x:testschemaapi_shard1_replica2] o.a.s.u.UpdateHandler Using UpdateLog implementation: org.apache.solr.update.UpdateLog
    [junit4] 2> 2023533 INFO (qtp809289301-93690) [n:127.0.0.1:39821_solr c:testschemaapi s:shard1 r:core_node1 x:testschemaapi_shard1_replica2] o.a.s.u.UpdateLog Initializing UpdateLog: dataDir=null defaultSyncLevel=FLUSH numRecordsToKeep=100 maxNumLogsToKeep=10 numVersionBuckets=65536
    [junit4] 2> 2023534 INFO (qtp1711345456-93687) [n:127.0.0.1:43463_solr c:testschemaapi s:shard1 r:core_node2 x:testschemaapi_shard1_replica1] o.a.s.u.CommitTracker Hard AutoCommit: disabled
    [junit4] 2> 2023534 INFO (qtp809289301-93690) [n:127.0.0.1:39821_solr c:testschemaapi s:shard1 r:core_node1 x:testschemaapi_shard1_replica2] o.a.s.u.CommitTracker Hard AutoCommit: disabled
    [junit4] 2> 2023534 INFO (qtp1711345456-93687) [n:127.0.0.1:43463_solr c:testschemaapi s:shard1 r:core_node2 x:testschemaapi_shard1_replica1] o.a.s.u.CommitTracker Soft AutoCommit: disabled
    [junit4] 2> 2023534 INFO (qtp809289301-93690) [n:127.0.0.1:39821_solr c:testschemaapi s:shard1 r:core_node1 x:testschemaapi_shard1_replica2] o.a.s.u.CommitTracker Soft AutoCommit: disabled
    [junit4] 2> 2023534 INFO (qtp1711345456-93687) [n:127.0.0.1:43463_solr c:testschemaapi s:shard1 r:core_node2 x:testschemaapi_shard1_replica1] o.a.s.c.SolrDeletionPolicy SolrDeletionPolicy.onInit: commits: num=1
    [junit4] 2> commit{dir=MockDirectoryWrapper(RAMDirectory@127ba749 lockFactory=org.apache.lucene.store.SingleInstanceLockFactory@7423b319),segFN=segments_1,generation=1}
    [junit4] 2> 2023534 INFO (qtp809289301-93690) [n:127.0.0.1:39821_solr c:testschemaapi s:shard1 r:core_node1 x:testschemaapi_shard1_replica2] o.a.s.c.SolrDeletionPolicy SolrDeletionPolicy.onInit: commits: num=1
    [junit4] 2> commit{dir=MockDirectoryWrapper(RAMDirectory@73d426d7 lockFactory=org.apache.lucene.store.SingleInstanceLockFactory@6d4228a9),segFN=segments_1,generation=1}
    [junit4] 2> 2023534 INFO (qtp1711345456-93687) [n:127.0.0.1:43463_solr c:testschemaapi s:shard1 r:core_node2 x:testschemaapi_shard1_replica1] o.a.s.c.SolrDeletionPolicy newest commit generation = 1
    [junit4] 2> 2023534 INFO (qtp809289301-93690) [n:127.0.0.1:39821_solr c:testschemaapi s:shard1 r:core_node1 x:testschemaapi_shard1_replica2] o.a.s.c.SolrDeletionPolicy newest commit generation = 1
    [junit4] 2> 2023534 INFO (qtp1711345456-93687) [n:127.0.0.1:43463_solr c:testschemaapi s:shard1 r:core_node2 x:testschemaapi_shard1_replica1] o.a.s.s.SolrIndexSearcher Opening Searcher@1fa9edd2[testschemaapi_shard1_replica1] main
    [junit4] 2> 2023534 INFO (qtp809289301-93690) [n:127.0.0.1:39821_solr c:testschemaapi s:shard1 r:core_node1 x:testschemaapi_shard1_replica2] o.a.s.s.SolrIndexSearcher Opening Searcher@4090b31a[testschemaapi_shard1_replica2] main
    [junit4] 2> 2023535 INFO (qtp1711345456-93687) [n:127.0.0.1:43463_solr c:testschemaapi s:shard1 r:core_node2 x:testschemaapi_shard1_replica1] o.a.s.c.c.ZkStateReader Load collection config from: [/collections/testschemaapi]
    [junit4] 2> 2023535 INFO (qtp809289301-93690) [n:127.0.0.1:39821_solr c:testschemaapi s:shard1 r:core_node1 x:testschemaapi_shard1_replica2] o.a.s.c.c.ZkStateReader Load collection config from: [/collections/testschemaapi]
    [junit4] 2> 2023535 INFO (qtp809289301-93690) [n:127.0.0.1:39821_solr c:testschemaapi s:shard1 r:core_node1 x:testschemaapi_shard1_replica2] o.a.s.c.c.ZkStateReader path=[/collections/testschemaapi] [configName]=[conf1] specified config exists in ZooKeeper
    [junit4] 2> 2023535 INFO (qtp1711345456-93687) [n:127.0.0.1:43463_solr c:testschemaapi s:shard1 r:core_node2 x:testschemaapi_shard1_replica1] o.a.s.c.c.ZkStateReader path=[/collections/testschemaapi] [configName]=[conf1] specified config exists in ZooKeeper
    [junit4] 2> 2023535 INFO (qtp809289301-93690) [n:127.0.0.1:39821_solr c:testschemaapi s:shard1 r:core_node1 x:testschemaapi_shard1_replica2] o.a.s.r.ManagedResourceStorage Setting up ZooKeeper-based storage for the RestManager with znodeBase: /configs/conf1
    [junit4] 2> 2023535 INFO (qtp1711345456-93687) [n:127.0.0.1:43463_solr c:testschemaapi s:shard1 r:core_node2 x:testschemaapi_shard1_replica1] o.a.s.r.ManagedResourceStorage Setting up ZooKeeper-based storage for the RestManager with znodeBase: /configs/conf1
    [junit4] 2> 2023535 INFO (qtp809289301-93690) [n:127.0.0.1:39821_solr c:testschemaapi s:shard1 r:core_node1 x:testschemaapi_shard1_replica2] o.a.s.r.ManagedResourceStorage Configured ZooKeeperStorageIO with znodeBase: /configs/conf1
    [junit4] 2> 2023535 INFO (qtp809289301-93690) [n:127.0.0.1:39821_solr c:testschemaapi s:shard1 r:core_node1 x:testschemaapi_shard1_replica2] o.a.s.r.RestManager Initializing RestManager with initArgs: {}
    [junit4] 2> 2023535 INFO (qtp1711345456-93687) [n:127.0.0.1:43463_solr c:testschemaapi s:shard1 r:core_node2 x:testschemaapi_shard1_replica1] o.a.s.r.ManagedResourceStorage Configured ZooKeeperStorageIO with znodeBase: /configs/conf1
    [junit4] 2> 2023535 INFO (qtp809289301-93690) [n:127.0.0.1:39821_solr c:testschemaapi s:shard1 r:core_node1 x:testschemaapi_shard1_replica2] o.a.s.r.ManagedResourceStorage Reading _rest_managed.json using ZooKeeperStorageIO:path=/configs/conf1
    [junit4] 2> 2023535 INFO (qtp1711345456-93687) [n:127.0.0.1:43463_solr c:testschemaapi s:shard1 r:core_node2 x:testschemaapi_shard1_replica1] o.a.s.r.RestManager Initializing RestManager with initArgs: {}
    [junit4] 2> 2023536 INFO (qtp1711345456-93687) [n:127.0.0.1:43463_solr c:testschemaapi s:shard1 r:core_node2 x:testschemaapi_shard1_replica1] o.a.s.r.ManagedResourceStorage Reading _rest_managed.json using ZooKeeperStorageIO:path=/configs/conf1
    [junit4] 2> 2023536 INFO (qtp809289301-93690) [n:127.0.0.1:39821_solr c:testschemaapi s:shard1 r:core_node1 x:testschemaapi_shard1_replica2] o.a.s.r.ManagedResourceStorage No data found for znode /configs/conf1/_rest_managed.json
    [junit4] 2> 2023536 INFO (qtp809289301-93690) [n:127.0.0.1:39821_solr c:testschemaapi s:shard1 r:core_node1 x:testschemaapi_shard1_replica2] o.a.s.r.ManagedResourceStorage Loaded null at path _rest_managed.json using ZooKeeperStorageIO:path=/configs/conf1
    [junit4] 2> 2023536 INFO (qtp1711345456-93687) [n:127.0.0.1:43463_solr c:testschemaapi s:shard1 r:core_node2 x:testschemaapi_shard1_replica1] o.a.s.r.ManagedResourceStorage No data found for znode /configs/conf1/_rest_managed.json
    [junit4] 2> 2023536 INFO (qtp809289301-93690) [n:127.0.0.1:39821_solr c:testschemaapi s:shard1 r:core_node1 x:testschemaapi_shard1_replica2] o.a.s.r.RestManager Initializing 0 registered ManagedResources
    [junit4] 2> 2023536 INFO (qtp1711345456-93687) [n:127.0.0.1:43463_solr c:testschemaapi s:shard1 r:core_node2 x:testschemaapi_shard1_replica1] o.a.s.r.ManagedResourceStorage Loaded null at path _rest_managed.json using ZooKeeperStorageIO:path=/configs/conf1
    [junit4] 2> 2023536 INFO (qtp809289301-93690) [n:127.0.0.1:39821_solr c:testschemaapi s:shard1 r:core_node1 x:testschemaapi_shard1_replica2] o.a.s.s.ZkIndexSchemaReader Creating ZooKeeper watch for the managed schema at /configs/conf1/managed-schema
    [junit4] 2> 2023536 INFO (qtp1711345456-93687) [n:127.0.0.1:43463_solr c:testschemaapi s:shard1 r:core_node2 x:testschemaapi_shard1_replica1] o.a.s.r.RestManager Initializing 0 registered ManagedResources
    [junit4] 2> 2023536 INFO (qtp1711345456-93687) [n:127.0.0.1:43463_solr c:testschemaapi s:shard1 r:core_node2 x:testschemaapi_shard1_replica1] o.a.s.s.ZkIndexSchemaReader Creating ZooKeeper watch for the managed schema at /configs/conf1/managed-schema
    [junit4] 2> 2023536 INFO (qtp809289301-93690) [n:127.0.0.1:39821_solr c:testschemaapi s:shard1 r:core_node1 x:testschemaapi_shard1_replica2] o.a.s.c.ZkController Added new OnReconnect listener ZkIndexSchemaReader: /configs/conf1/managed-schema, uniqueCoreId: testschemaapi_shard1_replica2:386701308180887
    [junit4] 2> 2023536 INFO (qtp1711345456-93687) [n:127.0.0.1:43463_solr c:testschemaapi s:shard1 r:core_node2 x:testschemaapi_shard1_replica1] o.a.s.c.ZkController Added new OnReconnect listener ZkIndexSchemaReader: /configs/conf1/managed-schema, uniqueCoreId: testschemaapi_shard1_replica1:386701308237377
    [junit4] 2> 2023536 INFO (qtp809289301-93690) [n:127.0.0.1:39821_solr c:testschemaapi s:shard1 r:core_node1 x:testschemaapi_shard1_replica2] o.a.s.h.ReplicationHandler Commits will be reserved for 10000
    [junit4] 2> 2023536 INFO (qtp1711345456-93687) [n:127.0.0.1:43463_solr c:testschemaapi s:shard1 r:core_node2 x:testschemaapi_shard1_replica1] o.a.s.h.ReplicationHandler Commits will be reserved for 10000
    [junit4] 2> 2023536 INFO (searcherExecutor-9947-thread-1-processing-n:127.0.0.1:39821_solr r:core_node1 x:testschemaapi_shard1_replica2 c:testschemaapi s:shard1) [n:127.0.0.1:39821_solr c:testschemaapi s:shard1 r:core_node1 x:testschemaapi_shard1_replica2] o.a.s.c.SolrCore [testschemaapi_shard1_replica2] Registered new searcher Searcher@4090b31a[testschemaapi_shard1_replica2] main{ExitableDirectoryReader(UninvertingDirectoryReader())}
    [junit4] 2> 2023537 INFO (searcherExecutor-9948-thread-1-processing-n:127.0.0.1:43463_solr r:core_node2 x:testschemaapi_shard1_replica1 c:testschemaapi s:shard1) [n:127.0.0.1:43463_solr c:testschemaapi s:shard1 r:core_node2 x:testschemaapi_shard1_replica1] o.a.s.c.SolrCore [testschemaapi_shard1_replica1] Registered new searcher Searcher@1fa9edd2[testschemaapi_shard1_replica1] main{ExitableDirectoryReader(UninvertingDirectoryReader())}
    [junit4] 2> 2023537 INFO (qtp809289301-93690) [n:127.0.0.1:39821_solr c:testschemaapi s:shard1 r:core_node1 x:testschemaapi_shard1_replica2] o.a.s.u.UpdateLog Looking up max value of version field to seed version buckets
    [junit4] 2> 2023537 INFO (qtp1711345456-93687) [n:127.0.0.1:43463_solr c:testschemaapi s:shard1 r:core_node2 x:testschemaapi_shard1_replica1] o.a.s.u.UpdateLog Looking up max value of version field to seed version buckets
    [junit4] 2> 2023537 INFO (qtp809289301-93690) [n:127.0.0.1:39821_solr c:testschemaapi s:shard1 r:core_node1 x:testschemaapi_shard1_replica2] o.a.s.u.VersionInfo Refreshing highest value of _version_ for 65536 version buckets from index
    [junit4] 2> 2023537 INFO (qtp1711345456-93687) [n:127.0.0.1:43463_solr c:testschemaapi s:shard1 r:core_node2 x:testschemaapi_shard1_replica1] o.a.s.u.VersionInfo Refreshing highest value of _version_ for 65536 version buckets from index
    [junit4] 2> 2023537 INFO (qtp809289301-93690) [n:127.0.0.1:39821_solr c:testschemaapi s:shard1 r:core_node1 x:testschemaapi_shard1_replica2] o.a.s.u.VersionInfo No terms found for _version_, cannot seed version bucket highest value from index
    [junit4] 2> 2023537 INFO (qtp1711345456-93687) [n:127.0.0.1:43463_solr c:testschemaapi s:shard1 r:core_node2 x:testschemaapi_shard1_replica1] o.a.s.u.VersionInfo No terms found for _version_, cannot seed version bucket highest value from index
    [junit4] 2> 2023537 INFO (qtp809289301-93690) [n:127.0.0.1:39821_solr c:testschemaapi s:shard1 r:core_node1 x:testschemaapi_shard1_replica2] o.a.s.u.UpdateLog Could not find max version in index or recent updates, using new clock 1537374902847275008
    [junit4] 2> 2023537 INFO (qtp1711345456-93687) [n:127.0.0.1:43463_solr c:testschemaapi s:shard1 r:core_node2 x:testschemaapi_shard1_replica1] o.a.s.u.UpdateLog Could not find max version in index or recent updates, using new clock 1537374902847275008
    [junit4] 2> 2023539 INFO (qtp809289301-93690) [n:127.0.0.1:39821_solr c:testschemaapi s:shard1 r:core_node1 x:testschemaapi_shard1_replica2] o.a.s.u.UpdateLog Took 2.0ms to seed version buckets with highest version 1537374902847275008
    [junit4] 2> 2023539 INFO (qtp1711345456-93687) [n:127.0.0.1:43463_solr c:testschemaapi s:shard1 r:core_node2 x:testschemaapi_shard1_replica1] o.a.s.u.UpdateLog Took 2.0ms to seed version buckets with highest version 1537374902847275008
    [junit4] 2> 2023539 INFO (qtp809289301-93690) [n:127.0.0.1:39821_solr c:testschemaapi s:shard1 r:core_node1 x:testschemaapi_shard1_replica2] o.a.s.c.ZkController watch zkdir /configs/conf1
    [junit4] 2> 2023539 INFO (qtp1711345456-93687) [n:127.0.0.1:43463_solr c:testschemaapi s:shard1 r:core_node2 x:testschemaapi_shard1_replica1] o.a.s.c.ZkController watch zkdir /configs/conf1
    [junit4] 2> 2023540 INFO (qtp1711345456-93687) [n:127.0.0.1:43463_solr c:testschemaapi s:shard1 r:core_node2 x:testschemaapi_shard1_replica1] o.a.s.c.CoreContainer registering core: testschemaapi_shard1_replica1
    [junit4] 2> 2023540 INFO (qtp809289301-93690) [n:127.0.0.1:39821_solr c:testschemaapi s:shard1 r:core_node1 x:testschemaapi_shard1_replica2] o.a.s.c.CoreContainer registering core: testschemaapi_shard1_replica2
    [junit4] 2> 2023540 INFO (qtp1711345456-93687) [n:127.0.0.1:43463_solr c:testschemaapi s:shard1 r:core_node2 x:testschemaapi_shard1_replica1] o.a.s.c.ZkController Register replica - core:testschemaapi_shard1_replica1 address:http://127.0.0.1:43463/solr collection:testschemaapi shard:shard1
    [junit4] 2> 2023540 INFO (qtp809289301-93690) [n:127.0.0.1:39821_solr c:testschemaapi s:shard1 r:core_node1 x:testschemaapi_shard1_replica2] o.a.s.c.ZkController Register replica - core:testschemaapi_shard1_replica2 address:http://127.0.0.1:39821/solr collection:testschemaapi shard:shard1
    [junit4] 2> 2023540 INFO (qtp1711345456-93687) [n:127.0.0.1:43463_solr c:testschemaapi s:shard1 r:core_node2 x:testschemaapi_shard1_replica1] o.a.s.c.c.SolrZkClient makePath: /collections/testschemaapi/leader_elect/shard1/election
    [junit4] 2> 2023540 INFO (qtp809289301-93690) [n:127.0.0.1:39821_solr c:testschemaapi s:shard1 r:core_node1 x:testschemaapi_shard1_replica2] o.a.s.c.c.SolrZkClient makePath: /collections/testschemaapi/leader_elect/shard1/election
    [junit4] 2> 2023541 INFO (qtp809289301-93690) [n:127.0.0.1:39821_solr c:testschemaapi s:shard1 r:core_node1 x:testschemaapi_shard1_replica2] o.a.s.c.LeaderElector Joined leadership election with path: /collections/testschemaapi/leader_elect/shard1/election/96085931339939846-core_node1-n_0000000000
    [junit4] 2> 2023541 INFO (qtp1711345456-93687) [n:127.0.0.1:43463_solr c:testschemaapi s:shard1 r:core_node2 x:testschemaapi_shard1_replica1] o.a.s.c.LeaderElector Joined leadership election with path: /collections/testschemaapi/leader_elect/shard1/election/96085931339939845-core_node2-n_0000000001
    [junit4] 2> 2023542 INFO (qtp809289301-93690) [n:127.0.0.1:39821_solr c:testschemaapi s:shard1 r:core_node1 x:testschemaapi_shard1_replica2] o.a.s.c.ShardLeaderElectionContext Running the leader process for shard=shard1 and weAreReplacement=false and leaderVoteWait=10000
    [junit4] 2> 2023542 INFO (qtp1711345456-93687) [n:127.0.0.1:43463_solr c:testschemaapi s:shard1 r:core_node2 x:testschemaapi_shard1_replica1] o.a.s.c.LeaderElector Watching path /collections/testschemaapi/leader_elect/shard1/election/96085931339939846-core_node1-n_0000000000 to know if I could be the leader
    [junit4] 2> 2023542 INFO (qtp809289301-93690) [n:127.0.0.1:39821_solr c:testschemaapi s:shard1 r:core_node1 x:testschemaapi_shard1_replica2] o.a.s.c.ShardLeaderElectionContext Enough replicas found to continue.
    [junit4] 2> 2023542 INFO (qtp809289301-93690) [n:127.0.0.1:39821_solr c:testschemaapi s:shard1 r:core_node1 x:testschemaapi_shard1_replica2] o.a.s.c.ShardLeaderElectionContext I may be the new leader - try and sync
    [junit4] 2> 2023542 INFO (qtp809289301-93690) [n:127.0.0.1:39821_solr c:testschemaapi s:shard1 r:core_node1 x:testschemaapi_shard1_replica2] o.a.s.c.SyncStrategy Sync replicas to http://127.0.0.1:39821/solr/testschemaapi_shard1_replica2/
    [junit4] 2> 2023542 INFO (OverseerStateUpdate-96085931339939845-127.0.0.1:43463_solr-n_0000000000) [n:127.0.0.1:43463_solr ] o.a.s.c.Overseer processMessage: queueSize: 1, message = {
    [junit4] 2> "operation":"leader",
    [junit4] 2> "shard":"shard1",
    [junit4] 2> "collection":"testschemaapi"} current state version: 0
    [junit4] 2> 2023542 INFO (qtp809289301-93690) [n:127.0.0.1:39821_solr c:testschemaapi s:shard1 r:core_node1 x:testschemaapi_shard1_replica2] o.a.s.u.PeerSync PeerSync: core=testschemaapi_shard1_replica2 url=http://127.0.0.1:39821/solr START replicas=[http://127.0.0.1:43463/solr/testschemaapi_shard1_replica1/] nUpdates=100
    [junit4] 2> 2023543 INFO (qtp809289301-93690) [n:127.0.0.1:39821_solr c:testschemaapi s:shard1 r:core_node1 x:testschemaapi_shard1_replica2] o.a.s.u.PeerSync PeerSync: core=testschemaapi_shard1_replica2 url=http://127.0.0.1:39821/solr DONE. We have no versions. sync failed.
    [junit4] 2> 2023543 INFO (qtp809289301-93690) [n:127.0.0.1:39821_solr c:testschemaapi s:shard1 r:core_node1 x:testschemaapi_shard1_replica2] o.a.s.c.SyncStrategy Leader's attempt to sync with shard failed, moving to the next candidate
    [junit4] 2> 2023543 INFO (qtp809289301-93690) [n:127.0.0.1:39821_solr c:testschemaapi s:shard1 r:core_node1 x:testschemaapi_shard1_replica2] o.a.s.c.ShardLeaderElectionContext We failed sync, but we have no versions - we can't sync in that case - we were active before, so become leader anyway
    [junit4] 2> 2023545 INFO (qtp809289301-93690) [n:127.0.0.1:39821_solr c:testschemaapi s:shard1 r:core_node1 x:testschemaapi_shard1_replica2] o.a.s.c.c.SolrZkClient makePath: /collections/testschemaapi/leaders/shard1
    [junit4] 2> 2023545 INFO (qtp1711345456-93689) [n:127.0.0.1:43463_solr c:testschemaapi s:shard1 r:core_node2 x:testschemaapi_shard1_replica1] o.a.s.c.S.Request [testschemaapi_shard1_replica1] webapp=/solr path=/get params={wt=javabin&qt=/get&version=2&distrib=false&getVersions=100&fingerprint=false} status=0 QTime=0
    [junit4] 2> 2023545 INFO (qtp809289301-93690) [n:127.0.0.1:39821_solr c:testschemaapi s:shard1 r:core_node1 x:testschemaapi_shard1_replica2] o.a.s.c.ShardLeaderElectionContextBase Creating leader registration node /collections/testschemaapi/leaders/shard1/leader after winning as /collections/testschemaapi/leader_elect/shard1/election/96085931339939846-core_node1-n_0000000000
    [junit4] 2> 2023546 INFO (qtp809289301-93690) [n:127.0.0.1:39821_solr c:testschemaapi s:shard1 r:core_node1 x:testschemaapi_shard1_replica2] o.a.s.c.ShardLeaderElectionContext I am the new leader: http://127.0.0.1:39821/solr/testschemaapi_shard1_replica2/ shard1
    [junit4] 2> 2023546 INFO (OverseerStateUpdate-96085931339939845-127.0.0.1:43463_solr-n_0000000000) [n:127.0.0.1:43463_solr ] o.a.s.c.Overseer processMessage: queueSize: 1, message = {
    [junit4] 2> "operation":"leader",
    [junit4] 2> "shard":"shard1",
    [junit4] 2> "collection":"testschemaapi",
    [junit4] 2> "base_url":"http://127.0.0.1:39821/solr",
    [junit4] 2> "core":"testschemaapi_shard1_replica2",
    [junit4] 2> "state":"active"} current state version: 0
    [junit4] 2> 2023647 INFO (OverseerStateUpdate-96085931339939845-127.0.0.1:43463_solr-n_0000000000) [n:127.0.0.1:43463_solr ] o.a.s.c.o.ZkStateWriter going to update_collection /collections/testschemaapi/state.json version: 1
    [junit4] 2> 2023648 INFO (zkCallback-24052-thread-1-processing-n:127.0.0.1:43463_solr) [n:127.0.0.1:43463_solr ] o.a.s.c.c.ZkStateReader A cluster state change: [WatchedEvent state:SyncConnected type:NodeDataChanged path:/collections/testschemaapi/state.json] for collection [testschemaapi] has occurred - updating... (live nodes size: [2])
    [junit4] 2> 2023648 INFO (zkCallback-24053-thread-1-processing-n:127.0.0.1:39821_solr) [n:127.0.0.1:39821_solr ] o.a.s.c.c.ZkStateReader A cluster state change: [WatchedEvent state:SyncConnected type:NodeDataChanged path:/collections/testschemaapi/state.json] for collection [testschemaapi] has occurred - updating... (live nodes size: [2])
    [junit4] 2> 2023648 INFO (zkCallback-24052-thread-1-processing-n:127.0.0.1:43463_solr) [n:127.0.0.1:43463_solr ] o.a.s.c.c.ZkStateReader Updating data for [testschemaapi] from [1] to [2]
    [junit4] 2> 2023648 INFO (zkCallback-24053-thread-1-processing-n:127.0.0.1:39821_solr) [n:127.0.0.1:39821_solr ] o.a.s.c.c.ZkStateReader Updating data for [testschemaapi] from [1] to [2]
    [junit4] 2> 2023697 INFO (qtp809289301-93690) [n:127.0.0.1:39821_solr c:testschemaapi s:shard1 r:core_node1 x:testschemaapi_shard1_replica2] o.a.s.c.ZkController We are http://127.0.0.1:39821/solr/testschemaapi_shard1_replica2/ and leader is http://127.0.0.1:39821/solr/testschemaapi_shard1_replica2/
    [junit4] 2> 2023697 INFO (qtp809289301-93690) [n:127.0.0.1:39821_solr c:testschemaapi s:shard1 r:core_node1 x:testschemaapi_shard1_replica2] o.a.s.c.ZkController No LogReplay needed for core=testschemaapi_shard1_replica2 baseURL=http://127.0.0.1:39821/solr
    [junit4] 2> 2023697 INFO (qtp809289301-93690) [n:127.0.0.1:39821_solr c:testschemaapi s:shard1 r:core_node1 x:testschemaapi_shard1_replica2] o.a.s.c.ZkController I am the leader, no recovery necessary
    [junit4] 2> 2023697 INFO (qtp809289301-93690) [n:127.0.0.1:39821_solr c:testschemaapi s:shard1 r:core_node1 x:testschemaapi_shard1_replica2] o.a.s.c.ZkController publishing state=active
    [junit4] 2> 2023698 INFO (OverseerStateUpdate-96085931339939845-127.0.0.1:43463_solr-n_0000000000) [n:127.0.0.1:43463_solr ] o.a.s.c.Overseer processMessage: queueSize: 1, message = {
    [junit4] 2> "node_name":"127.0.0.1:39821_solr",
    [junit4] 2> "numShards":"1",
    [junit4] 2> "core":"testschemaapi_shard1_replica2",
    [junit4] 2> "operation":"state",
    [junit4] 2> "state":"active",
    [junit4] 2> "collection":"testschemaapi",
    [junit4] 2> "shard":"shard1",
    [junit4] 2> "roles":null,
    [junit4] 2> "core_node_name":"core_node1",
    [junit4] 2> "base_url":"http://127.0.0.1:39821/solr"} current state version: 0
    [junit4] 2> 2023698 INFO (OverseerStateUpdate-96085931339939845-127.0.0.1:43463_solr-n_0000000000) [n:127.0.0.1:43463_solr ] o.a.s.c.o.ReplicaMutator Update state numShards=1 message={
    [junit4] 2> "node_name":"127.0.0.1:39821_solr",
    [junit4] 2> "numShards":"1",
    [junit4] 2> "core":"testschemaapi_shard1_replica2",
    [junit4] 2> "operation":"state",
    [junit4] 2> "state":"active",
    [junit4] 2> "collection":"testschemaapi",
    [junit4] 2> "shard":"shard1",
    [junit4] 2> "roles":null,
    [junit4] 2> "core_node_name":"core_node1",
    [junit4] 2> "base_url":"http://127.0.0.1:39821/solr"}
    [junit4] 2> 2023699 INFO (qtp809289301-93690) [n:127.0.0.1:39821_solr c:testschemaapi s:shard1 r:core_node1 x:testschemaapi_shard1_replica2] o.a.s.s.HttpSolrCall [admin] webapp=null path=/admin/cores params={wt=javabin&qt=/admin/cores&version=2&numShards=1&collection.configName=conf1&shard=shard1&collection=testschemaapi&name=testschemaapi_shard1_replica2&action=CREATE} status=0 QTime=1231
    [junit4] 2> 2023800 INFO (OverseerStateUpdate-96085931339939845-127.0.0.1:43463_solr-n_0000000000) [n:127.0.0.1:43463_solr ] o.a.s.c.o.ZkStateWriter going to update_collection /collections/testschemaapi/state.json version: 2
    [junit4] 2> 2023800 INFO (zkCallback-24053-thread-1-processing-n:127.0.0.1:39821_solr) [n:127.0.0.1:39821_solr ] o.a.s.c.c.ZkStateReader A cluster state change: [WatchedEvent state:SyncConnected type:NodeDataChanged path:/collections/testschemaapi/state.json] for collection [testschemaapi] has occurred - updating... (live nodes size: [2])
    [junit4] 2> 2023800 INFO (zkCallback-24052-thread-1-processing-n:127.0.0.1:43463_solr) [n:127.0.0.1:43463_solr ] o.a.s.c.c.ZkStateReader A cluster state change: [WatchedEvent state:SyncConnected type:NodeDataChanged path:/collections/testschemaapi/state.json] for collection [testschemaapi] has occurred - updating... (live nodes size: [2])
    [junit4] 2> 2023800 INFO (zkCallback-24053-thread-1-processing-n:127.0.0.1:39821_solr) [n:127.0.0.1:3982

[...truncated too long message...]

hema
    [junit4] 2> at org.apache.solr.core.ConfigSetService.getConfig(ConfigSetService.java:84)
    [junit4] 2> at org.apache.solr.core.CoreContainer.reload(CoreContainer.java:915)
    [junit4] 2> ... 2 more
    [junit4] 2> Caused by: org.apache.solr.common.SolrException: Error attempting to access /configs/conf1/managed-schema
    [junit4] 2> at org.apache.solr.schema.ManagedIndexSchemaFactory.create(ManagedIndexSchemaFactory.java:143)
    [junit4] 2> at org.apache.solr.schema.ManagedIndexSchemaFactory.create(ManagedIndexSchemaFactory.java:47)
    [junit4] 2> at org.apache.solr.schema.IndexSchemaFactory.buildIndexSchema(IndexSchemaFactory.java:70)
    [junit4] 2> at org.apache.solr.core.ConfigSetService.createIndexSchema(ConfigSetService.java:108)
    [junit4] 2> at org.apache.solr.core.ConfigSetService.getConfig(ConfigSetService.java:79)
    [junit4] 2> ... 3 more
    [junit4] 2> Caused by: org.apache.zookeeper.KeeperException$SessionExpiredException: KeeperErrorCode = Session expired for /configs/conf1/managed-schema
    [junit4] 2> at org.apache.zookeeper.KeeperException.create(KeeperException.java:127)
    [junit4] 2> at org.apache.zookeeper.KeeperException.create(KeeperException.java:51)
    [junit4] 2> at org.apache.zookeeper.ZooKeeper.getData(ZooKeeper.java:1155)
    [junit4] 2> at org.apache.solr.common.cloud.SolrZkClient$7.execute(SolrZkClient.java:345)
    [junit4] 2> at org.apache.solr.common.cloud.SolrZkClient$7.execute(SolrZkClient.java:342)
    [junit4] 2> at org.apache.solr.common.cloud.ZkCmdExecutor.retryOperation(ZkCmdExecutor.java:60)
    [junit4] 2> at org.apache.solr.common.cloud.SolrZkClient.getData(SolrZkClient.java:342)
    [junit4] 2> at org.apache.solr.schema.ManagedIndexSchemaFactory.create(ManagedIndexSchemaFactory.java:128)
    [junit4] 2> ... 7 more
    [junit4] 2> 2043788 WARN (Thread-5037) [n:127.0.0.1:43463_solr ] o.a.s.c.ZkController listener throws error
    [junit4] 2> org.apache.solr.common.SolrException: Unable to reload core [testschemaapi_shard1_replica1]
    [junit4] 2> at org.apache.solr.core.CoreContainer.reload(CoreContainer.java:922)
    [junit4] 2> at org.apache.solr.core.SolrCore$11.run(SolrCore.java:2603)
    [junit4] 2> at org.apache.solr.cloud.ZkController$5.run(ZkController.java:2479)
    [junit4] 2> Caused by: org.apache.solr.common.SolrException: Could not load conf for core testschemaapi_shard1_replica1: Unable to load reader for ConfigSet properties: configsetprops.json
    [junit4] 2> at org.apache.solr.core.ConfigSetService.getConfig(ConfigSetService.java:84)
    [junit4] 2> at org.apache.solr.core.CoreContainer.reload(CoreContainer.java:915)
    [junit4] 2> ... 2 more
    [junit4] 2> Caused by: org.apache.solr.common.SolrException: Unable to load reader for ConfigSet properties: configsetprops.json
    [junit4] 2> at org.apache.solr.core.ConfigSetProperties.readFromResourceLoader(ConfigSetProperties.java:57)
    [junit4] 2> at org.apache.solr.core.ConfigSetService.createConfigSetProperties(ConfigSetService.java:118)
    [junit4] 2> at org.apache.solr.core.ConfigSetService.getConfig(ConfigSetService.java:80)
    [junit4] 2> ... 3 more
    [junit4] 2> Caused by: java.io.IOException: We re-tried 10 times but was still unable to fetch resource=configsetprops.json from ZK
    [junit4] 2> at org.apache.solr.cloud.ZkSolrResourceLoader.openResource(ZkSolrResourceLoader.java:116)
    [junit4] 2> at org.apache.solr.core.ConfigSetProperties.readFromResourceLoader(ConfigSetProperties.java:52)
    [junit4] 2> ... 5 more
    [junit4] 2> Caused by: org.apache.zookeeper.KeeperException$SessionExpiredException: KeeperErrorCode = Session expired for /configs/conf1/configsetprops.json
    [junit4] 2> at org.apache.zookeeper.KeeperException.create(KeeperException.java:127)
    [junit4] 2> at org.apache.zookeeper.KeeperException.create(KeeperException.java:51)
    [junit4] 2> at org.apache.zookeeper.ZooKeeper.exists(ZooKeeper.java:1045)
    [junit4] 2> at org.apache.solr.common.cloud.SolrZkClient$5.execute(SolrZkClient.java:311)
    [junit4] 2> at org.apache.solr.common.cloud.SolrZkClient$5.execute(SolrZkClient.java:308)
    [junit4] 2> at org.apache.solr.common.cloud.ZkCmdExecutor.retryOperation(ZkCmdExecutor.java:60)
    [junit4] 2> at org.apache.solr.common.cloud.SolrZkClient.exists(SolrZkClient.java:308)
    [junit4] 2> at org.apache.solr.cloud.ZkController.pathExists(ZkController.java:839)
    [junit4] 2> at org.apache.solr.cloud.ZkSolrResourceLoader.openResource(ZkSolrResourceLoader.java:89)
    [junit4] 2> ... 6 more
    [junit4] 2> NOTE: test params are: codec=CheapBastard, sim=DefaultSimilarity, locale=cs-CZ, timezone=Libya
    [junit4] 2> NOTE: Linux 4.4.0-24-generic amd64/Oracle Corporation 1.7.0_80 (64-bit)/cpus=12,threads=1,free=292101600,total=526909440
    [junit4] 2> NOTE: All tests run in this JVM: [TestLRUStatsCache, TestSerializedLuceneMatchVersion, TestSha256AuthenticationProvider, WrapperMergePolicyFactoryTest, TestIndexSearcher, DirectUpdateHandlerTest, LukeRequestHandlerTest, LeaderElectionTest, ExitableDirectoryReaderTest, BadIndexSchemaTest, HttpPartitionTest, TestZkChroot, TestAuthorizationFramework, TestSolrJ, TestUseDocValuesAsStored2, HdfsBasicDistributedZk2Test, DirectUpdateHandlerOptimizeTest, TestNamedUpdateProcessors, TestCoreDiscovery, TestDefaultSearchFieldResource, TestSolrConfigHandlerConcurrent, TestReloadAndDeleteDocs, TestCollapseQParserPlugin, BadCopyFieldTest, TestStressReorder, TestManagedSchemaFieldTypeResource, TestSearcherReuse, FieldMutatingUpdateProcessorTest, DistributedFacetPivotLargeTest, TestConfigSetsAPI, TestRequestStatusCollectionAPI, OverseerTest, QueryParsingTest, DocValuesMultiTest, TestOverriddenPrefixQueryForCustomFieldType, PluginInfoTest, HdfsChaosMonkeySafeLeaderTest, UnloadDistributedZkTest, TestJsonRequest, ZkStateReaderTest, DistributedQueueTest, SliceStateTest, SearchHandlerTest, BasicDistributedZk2Test, TestRecovery, TestExtendedDismaxParser, TestSearchPerf, TestFreeTextSuggestions, SharedFSAutoReplicaFailoverUtilsTest, TestExclusionRuleCollectionAccess, TestCollationField, TestGroupingSearch, DebugComponentTest, TestBlobHandler, CustomCollectionTest, TestStressLiveNodes, RequestHandlersTest, TestCryptoKeys, RestartWhileUpdatingTest, TestJmxMonitoredMap, TestSuggestSpellingConverter, TestFuzzyAnalyzedSuggestions, TestFieldSortValues, TestStressRecovery, CollectionReloadTest, HdfsWriteToMultipleCollectionsTest, TestSolrDeletionPolicy1, TermVectorComponentDistributedTest, TestWriterPerf, TestSolr4Spatial2, TestObjectReleaseTracker, CoreMergeIndexesAdminHandlerTest, BlockDirectoryTest, BadComponentTest, TestClassicSimilarityFactory, TestChildDocTransformer, AtomicUpdatesTest, TestTrieFacet, TestInfoStreamLogging, CollectionsAPIAsyncDistributedZkTest, TestCloudSchemaless, TestFastWriter, TestCSVResponseWriter, SmileWriterTest, ClusterStateTest, CurrencyFieldXmlFileTest, SolrTestCaseJ4Test, IgnoreCommitOptimizeUpdateProcessorFactoryTest, SolrCoreCheckLockOnStartupTest, TestReqParamsAPI, RecoveryZkTest, TestCloudInspectUtil, TestSolrIndexConfig, TestRandomFaceting, ZkCLITest, DirectSolrSpellCheckerTest, PrimitiveFieldTypeTest, TermVectorComponentTest, RequiredFieldsTest, TestArbitraryIndexDir, RegexBoostProcessorTest, ReturnFieldsTest, BinaryUpdateRequestHandlerTest, TestComponentsName, SOLR749Test, AlternateDirectoryTest, TestDocSet, TestBinaryField, DirectSolrConnectionTest, TestCodecSupport, TestFastOutputStream, DateMathParserTest, PrimUtilsTest, TestLRUCache, TestUtils, SystemInfoHandlerTest, UUIDFieldTest, CircularListTest, DistributedMLTComponentTest, TestDistributedMissingSort, TestTolerantSearch, TestJettySolrRunner, AssignTest, AsyncCallRequestStatusResponseTest, CleanupOldIndexTest, CollectionTooManyReplicasTest, DeleteLastCustomShardedReplicaTest, DeleteReplicaTest, MultiThreadedOCPTest, RemoteQueryErrorTest, TestAuthenticationFramework, TestRequestForwarding, HdfsBasicDistributedZkTest, HdfsCollectionsAPIDistributedZkTest, HdfsNNFailoverTest, HdfsRecoverLeaseTest, HdfsRestartWhileUpdatingTest, HdfsSyncSliceTest, TestClusterStateMutator, ZkStateWriterTest, TestInitParams, TestNRTOpen, TestSolrConfigHandler, TestSolrDynamicMBean, TestConfigReload, TestRestoreCore, CoreAdminRequestStatusTest, InfoHandlerTest, SecurityConfHandlerTest, SegmentsInfoRequestHandlerTest, DistributedExpandComponentTest, DistributedFacetPivotLongTailTest, DistributedQueryComponentCustomSortTest, DistributedQueryComponentOptimizationTest, TestDistributedStatsComponentCardinality, TestCollationFieldDocValues, TestManagedSchemaAPI]
    [junit4] Completed [516/572 (1!)] on J2 in 21.68s, 1 test, 1 error <<< FAILURES!

[...truncated 192 lines...]
BUILD FAILED
/home/jenkins/workspace/Lucene-Solr-5.5-Linux/build.xml:750: The following error occurred while executing this line:
/home/jenkins/workspace/Lucene-Solr-5.5-Linux/build.xml:694: The following error occurred while executing this line:
/home/jenkins/workspace/Lucene-Solr-5.5-Linux/build.xml:59: The following error occurred while executing this line:
/home/jenkins/workspace/Lucene-Solr-5.5-Linux/solr/build.xml:233: The following error occurred while executing this line:
/home/jenkins/workspace/Lucene-Solr-5.5-Linux/solr/common-build.xml:534: The following error occurred while executing this line:
/home/jenkins/workspace/Lucene-Solr-5.5-Linux/lucene/common-build.xml:1477: The following error occurred while executing this line:
/home/jenkins/workspace/Lucene-Solr-5.5-Linux/lucene/common-build.xml:1033: There were test failures: 572 suites (7 ignored), 2303 tests, 1 error, 84 ignored (39 assumptions) [seed: E4BA22C4B411CE95]

Total time: 57 minutes 15 seconds
Build step 'Invoke Ant' marked build as failure
Archiving artifacts
[WARNINGS] Skipping publisher since build result is FAILURE
Recording test results
Email was triggered for: Failure - Any
Sending email for trigger: Failure - Any

Search Discussions

Discussion Posts

Previous

Related Discussions

Discussion Navigation
viewthread | post
posts ‹ prev | 3 of 3 | next ›
Discussion Overview
groupdev @
categorieslucene
postedJun 17, '16 at 3:25a
activeJun 17, '16 at 9:18a
posts3
users1
websitelucene.apache.org

1 user in discussion

Policeman Jenkins Server: 3 posts

People

Translate

site design / logo © 2017 Grokbase