Grokbase Groups Lucene dev June 2016
FAQ
Build: http://jenkins.thetaphi.de/job/Lucene-Solr-5.5-Linux/300/
Java: 32bit/jdk1.7.0_80 -client -XX:+UseSerialGC

1 tests failed.
FAILED: org.apache.solr.schema.TestManagedSchemaAPI.test

Error Message:
Error from server at http://127.0.0.1:37446/solr/testschemaapi_shard1_replica2: ERROR: [doc=2] unknown field 'myNewField1'

Stack Trace:
org.apache.solr.client.solrj.impl.CloudSolrClient$RouteException: Error from server at http://127.0.0.1:37446/solr/testschemaapi_shard1_replica2: ERROR: [doc=2] unknown field 'myNewField1'
  at __randomizedtesting.SeedInfo.seed([9B1CA7132C043EF0:134898C982F85308]:0)
  at org.apache.solr.client.solrj.impl.CloudSolrClient.directUpdate(CloudSolrClient.java:632)
  at org.apache.solr.client.solrj.impl.CloudSolrClient.sendRequest(CloudSolrClient.java:981)
  at org.apache.solr.client.solrj.impl.CloudSolrClient.requestWithRetryOnStaleState(CloudSolrClient.java:870)
  at org.apache.solr.client.solrj.impl.CloudSolrClient.request(CloudSolrClient.java:806)
  at org.apache.solr.schema.TestManagedSchemaAPI.testAddFieldAndDocument(TestManagedSchemaAPI.java:101)
  at org.apache.solr.schema.TestManagedSchemaAPI.test(TestManagedSchemaAPI.java:69)
  at sun.reflect.NativeMethodAccessorImpl.invoke0(Native Method)
  at sun.reflect.NativeMethodAccessorImpl.invoke(NativeMethodAccessorImpl.java:57)
  at sun.reflect.DelegatingMethodAccessorImpl.invoke(DelegatingMethodAccessorImpl.java:43)
  at java.lang.reflect.Method.invoke(Method.java:606)
  at com.carrotsearch.randomizedtesting.RandomizedRunner.invoke(RandomizedRunner.java:1764)
  at com.carrotsearch.randomizedtesting.RandomizedRunner$8.evaluate(RandomizedRunner.java:871)
  at com.carrotsearch.randomizedtesting.RandomizedRunner$9.evaluate(RandomizedRunner.java:907)
  at com.carrotsearch.randomizedtesting.RandomizedRunner$10.evaluate(RandomizedRunner.java:921)
  at com.carrotsearch.randomizedtesting.rules.SystemPropertiesRestoreRule$1.evaluate(SystemPropertiesRestoreRule.java:57)
  at org.apache.lucene.util.TestRuleSetupTeardownChained$1.evaluate(TestRuleSetupTeardownChained.java:49)
  at org.apache.lucene.util.AbstractBeforeAfterRule$1.evaluate(AbstractBeforeAfterRule.java:45)
  at org.apache.lucene.util.TestRuleThreadAndTestName$1.evaluate(TestRuleThreadAndTestName.java:48)
  at org.apache.lucene.util.TestRuleIgnoreAfterMaxFailures$1.evaluate(TestRuleIgnoreAfterMaxFailures.java:64)
  at org.apache.lucene.util.TestRuleMarkFailure$1.evaluate(TestRuleMarkFailure.java:47)
  at com.carrotsearch.randomizedtesting.rules.StatementAdapter.evaluate(StatementAdapter.java:36)
  at com.carrotsearch.randomizedtesting.ThreadLeakControl$StatementRunner.run(ThreadLeakControl.java:367)
  at com.carrotsearch.randomizedtesting.ThreadLeakControl.forkTimeoutingTask(ThreadLeakControl.java:809)
  at com.carrotsearch.randomizedtesting.ThreadLeakControl$3.evaluate(ThreadLeakControl.java:460)
  at com.carrotsearch.randomizedtesting.RandomizedRunner.runSingleTest(RandomizedRunner.java:880)
  at com.carrotsearch.randomizedtesting.RandomizedRunner$5.evaluate(RandomizedRunner.java:781)
  at com.carrotsearch.randomizedtesting.RandomizedRunner$6.evaluate(RandomizedRunner.java:816)
  at com.carrotsearch.randomizedtesting.RandomizedRunner$7.evaluate(RandomizedRunner.java:827)
  at com.carrotsearch.randomizedtesting.rules.StatementAdapter.evaluate(StatementAdapter.java:36)
  at com.carrotsearch.randomizedtesting.rules.SystemPropertiesRestoreRule$1.evaluate(SystemPropertiesRestoreRule.java:57)
  at org.apache.lucene.util.AbstractBeforeAfterRule$1.evaluate(AbstractBeforeAfterRule.java:45)
  at com.carrotsearch.randomizedtesting.rules.StatementAdapter.evaluate(StatementAdapter.java:36)
  at org.apache.lucene.util.TestRuleStoreClassName$1.evaluate(TestRuleStoreClassName.java:41)
  at com.carrotsearch.randomizedtesting.rules.NoShadowingOrOverridesOnMethodsRule$1.evaluate(NoShadowingOrOverridesOnMethodsRule.java:40)
  at com.carrotsearch.randomizedtesting.rules.NoShadowingOrOverridesOnMethodsRule$1.evaluate(NoShadowingOrOverridesOnMethodsRule.java:40)
  at com.carrotsearch.randomizedtesting.rules.StatementAdapter.evaluate(StatementAdapter.java:36)
  at com.carrotsearch.randomizedtesting.rules.StatementAdapter.evaluate(StatementAdapter.java:36)
  at com.carrotsearch.randomizedtesting.rules.StatementAdapter.evaluate(StatementAdapter.java:36)
  at org.apache.lucene.util.TestRuleAssertionsRequired$1.evaluate(TestRuleAssertionsRequired.java:53)
  at org.apache.lucene.util.TestRuleMarkFailure$1.evaluate(TestRuleMarkFailure.java:47)
  at org.apache.lucene.util.TestRuleIgnoreAfterMaxFailures$1.evaluate(TestRuleIgnoreAfterMaxFailures.java:64)
  at org.apache.lucene.util.TestRuleIgnoreTestSuites$1.evaluate(TestRuleIgnoreTestSuites.java:54)
  at com.carrotsearch.randomizedtesting.rules.StatementAdapter.evaluate(StatementAdapter.java:36)
  at com.carrotsearch.randomizedtesting.ThreadLeakControl$StatementRunner.run(ThreadLeakControl.java:367)
  at java.lang.Thread.run(Thread.java:745)
Caused by: org.apache.solr.client.solrj.impl.HttpSolrClient$RemoteSolrException: Error from server at http://127.0.0.1:37446/solr/testschemaapi_shard1_replica2: ERROR: [doc=2] unknown field 'myNewField1'
  at org.apache.solr.client.solrj.impl.HttpSolrClient.executeMethod(HttpSolrClient.java:577)
  at org.apache.solr.client.solrj.impl.HttpSolrClient.request(HttpSolrClient.java:241)
  at org.apache.solr.client.solrj.impl.HttpSolrClient.request(HttpSolrClient.java:230)
  at org.apache.solr.client.solrj.impl.LBHttpSolrClient.doRequest(LBHttpSolrClient.java:372)
  at org.apache.solr.client.solrj.impl.LBHttpSolrClient.request(LBHttpSolrClient.java:325)
  at org.apache.solr.client.solrj.impl.CloudSolrClient$2.call(CloudSolrClient.java:607)
  at org.apache.solr.client.solrj.impl.CloudSolrClient$2.call(CloudSolrClient.java:604)
  at java.util.concurrent.FutureTask.run(FutureTask.java:262)
  at org.apache.solr.common.util.ExecutorUtil$MDCAwareThreadPoolExecutor$1.run(ExecutorUtil.java:231)
  at java.util.concurrent.ThreadPoolExecutor.runWorker(ThreadPoolExecutor.java:1145)
  at java.util.concurrent.ThreadPoolExecutor$Worker.run(ThreadPoolExecutor.java:615)
  ... 1 more




Build Log:
[...truncated 11383 lines...]
    [junit4] Suite: org.apache.solr.schema.TestManagedSchemaAPI
    [junit4] 2> Creating dataDir: /home/jenkins/workspace/Lucene-Solr-5.5-Linux/solr/build/solr-core/test/J2/temp/solr.schema.TestManagedSchemaAPI_9B1CA7132C043EF0-001/init-core-data-001
    [junit4] 2> 1030412 INFO (SUITE-TestManagedSchemaAPI-seed#[9B1CA7132C043EF0]-worker) [ ] o.a.s.SolrTestCaseJ4 Randomized ssl (false) and clientAuth (false)
    [junit4] 2> 1030414 INFO (TEST-TestManagedSchemaAPI.test-seed#[9B1CA7132C043EF0]) [ ] o.a.s.SolrTestCaseJ4 ###Starting test
    [junit4] 2> 1030414 INFO (TEST-TestManagedSchemaAPI.test-seed#[9B1CA7132C043EF0]) [ ] o.a.s.c.ZkTestServer STARTING ZK TEST SERVER
    [junit4] 2> 1030414 INFO (Thread-2405) [ ] o.a.s.c.ZkTestServer client port:0.0.0.0/0.0.0.0:0
    [junit4] 2> 1030414 INFO (Thread-2405) [ ] o.a.s.c.ZkTestServer Starting server
    [junit4] 2> 1030514 INFO (TEST-TestManagedSchemaAPI.test-seed#[9B1CA7132C043EF0]) [ ] o.a.s.c.ZkTestServer start zk server on port:41918
    [junit4] 2> 1030514 INFO (TEST-TestManagedSchemaAPI.test-seed#[9B1CA7132C043EF0]) [ ] o.a.s.c.c.SolrZkClient Using default ZkCredentialsProvider
    [junit4] 2> 1030515 INFO (TEST-TestManagedSchemaAPI.test-seed#[9B1CA7132C043EF0]) [ ] o.a.s.c.c.ConnectionManager Waiting for client to connect to ZooKeeper
    [junit4] 2> 1030516 INFO (zkCallback-20994-thread-1) [ ] o.a.s.c.c.ConnectionManager Watcher org.apache.solr.common.cloud.ConnectionManager@12f70be name:ZooKeeperConnection Watcher:127.0.0.1:41918 got event WatchedEvent state:SyncConnected type:None path:null path:null type:None
    [junit4] 2> 1030516 INFO (TEST-TestManagedSchemaAPI.test-seed#[9B1CA7132C043EF0]) [ ] o.a.s.c.c.ConnectionManager Client is connected to ZooKeeper
    [junit4] 2> 1030516 INFO (TEST-TestManagedSchemaAPI.test-seed#[9B1CA7132C043EF0]) [ ] o.a.s.c.c.SolrZkClient Using default ZkACLProvider
    [junit4] 2> 1030516 INFO (TEST-TestManagedSchemaAPI.test-seed#[9B1CA7132C043EF0]) [ ] o.a.s.c.c.SolrZkClient makePath: /solr/solr.xml
    [junit4] 2> 1030518 INFO (jetty-launcher-20993-thread-1) [ ] o.e.j.s.Server jetty-9.2.13.v20150730
    [junit4] 2> 1030518 INFO (jetty-launcher-20993-thread-2) [ ] o.e.j.s.Server jetty-9.2.13.v20150730
    [junit4] 2> 1030519 INFO (jetty-launcher-20993-thread-1) [ ] o.e.j.s.h.ContextHandler Started o.e.j.s.ServletContextHandler@9bba58{/solr,null,AVAILABLE}
    [junit4] 2> 1030519 INFO (jetty-launcher-20993-thread-2) [ ] o.e.j.s.h.ContextHandler Started o.e.j.s.ServletContextHandler@1a65259{/solr,null,AVAILABLE}
    [junit4] 2> 1030519 INFO (jetty-launcher-20993-thread-1) [ ] o.e.j.s.ServerConnector Started ServerConnector@688011{HTTP/1.1}{127.0.0.1:37446}
    [junit4] 2> 1030519 INFO (jetty-launcher-20993-thread-1) [ ] o.e.j.s.Server Started @1031765ms
    [junit4] 2> 1030519 INFO (jetty-launcher-20993-thread-1) [ ] o.a.s.c.s.e.JettySolrRunner Jetty properties: {hostPort=37446, hostContext=/solr}
    [junit4] 2> 1030519 INFO (jetty-launcher-20993-thread-2) [ ] o.e.j.s.ServerConnector Started ServerConnector@1badd0{HTTP/1.1}{127.0.0.1:40002}
    [junit4] 2> 1030519 INFO (jetty-launcher-20993-thread-2) [ ] o.e.j.s.Server Started @1031765ms
    [junit4] 2> 1030519 INFO (jetty-launcher-20993-thread-2) [ ] o.a.s.c.s.e.JettySolrRunner Jetty properties: {hostContext=/solr, hostPort=40002}
    [junit4] 2> 1030519 INFO (jetty-launcher-20993-thread-1) [ ] o.a.s.s.SolrDispatchFilter SolrDispatchFilter.init(): sun.misc.Launcher$AppClassLoader@192e317
    [junit4] 2> 1030520 INFO (jetty-launcher-20993-thread-2) [ ] o.a.s.s.SolrDispatchFilter SolrDispatchFilter.init(): sun.misc.Launcher$AppClassLoader@192e317
    [junit4] 2> 1030520 INFO (jetty-launcher-20993-thread-1) [ ] o.a.s.c.SolrResourceLoader new SolrResourceLoader for directory: '/home/jenkins/workspace/Lucene-Solr-5.5-Linux/solr/build/solr-core/test/J2/temp/solr.schema.TestManagedSchemaAPI_9B1CA7132C043EF0-001/tempDir-001/node1'
    [junit4] 2> 1030520 INFO (jetty-launcher-20993-thread-2) [ ] o.a.s.c.SolrResourceLoader new SolrResourceLoader for directory: '/home/jenkins/workspace/Lucene-Solr-5.5-Linux/solr/build/solr-core/test/J2/temp/solr.schema.TestManagedSchemaAPI_9B1CA7132C043EF0-001/tempDir-001/node2'
    [junit4] 2> 1030520 INFO (jetty-launcher-20993-thread-1) [ ] o.a.s.c.SolrResourceLoader JNDI not configured for solr (NoInitialContextEx)
    [junit4] 2> 1030520 INFO (jetty-launcher-20993-thread-2) [ ] o.a.s.c.SolrResourceLoader JNDI not configured for solr (NoInitialContextEx)
    [junit4] 2> 1030520 INFO (jetty-launcher-20993-thread-1) [ ] o.a.s.c.SolrResourceLoader solr home defaulted to 'solr/' (could not find system property or JNDI)
    [junit4] 2> 1030520 INFO (jetty-launcher-20993-thread-2) [ ] o.a.s.c.SolrResourceLoader solr home defaulted to 'solr/' (could not find system property or JNDI)
    [junit4] 2> 1030520 INFO (jetty-launcher-20993-thread-1) [ ] o.a.s.c.c.SolrZkClient Using default ZkCredentialsProvider
    [junit4] 2> 1030520 INFO (jetty-launcher-20993-thread-2) [ ] o.a.s.c.c.SolrZkClient Using default ZkCredentialsProvider
    [junit4] 2> 1030520 INFO (jetty-launcher-20993-thread-1) [ ] o.a.s.c.c.ConnectionManager Waiting for client to connect to ZooKeeper
    [junit4] 2> 1030520 INFO (jetty-launcher-20993-thread-2) [ ] o.a.s.c.c.ConnectionManager Waiting for client to connect to ZooKeeper
    [junit4] 2> 1030521 INFO (zkCallback-20995-thread-1) [ ] o.a.s.c.c.ConnectionManager Watcher org.apache.solr.common.cloud.ConnectionManager@b2e066 name:ZooKeeperConnection Watcher:127.0.0.1:41918/solr got event WatchedEvent state:SyncConnected type:None path:null path:null type:None
    [junit4] 2> 1030522 INFO (jetty-launcher-20993-thread-1) [ ] o.a.s.c.c.ConnectionManager Client is connected to ZooKeeper
    [junit4] 2> 1030522 INFO (zkCallback-20996-thread-1) [ ] o.a.s.c.c.ConnectionManager Watcher org.apache.solr.common.cloud.ConnectionManager@3d38ab name:ZooKeeperConnection Watcher:127.0.0.1:41918/solr got event WatchedEvent state:SyncConnected type:None path:null path:null type:None
    [junit4] 2> 1030522 INFO (jetty-launcher-20993-thread-2) [ ] o.a.s.c.c.ConnectionManager Client is connected to ZooKeeper
    [junit4] 2> 1030522 INFO (jetty-launcher-20993-thread-1) [ ] o.a.s.c.c.SolrZkClient Using default ZkACLProvider
    [junit4] 2> 1030522 INFO (jetty-launcher-20993-thread-2) [ ] o.a.s.c.c.SolrZkClient Using default ZkACLProvider
    [junit4] 2> 1030522 INFO (jetty-launcher-20993-thread-1) [ ] o.a.s.s.SolrDispatchFilter solr.xml found in ZooKeeper. Loading...
    [junit4] 2> 1030522 INFO (jetty-launcher-20993-thread-2) [ ] o.a.s.s.SolrDispatchFilter solr.xml found in ZooKeeper. Loading...
    [junit4] 2> 1030535 INFO (jetty-launcher-20993-thread-1) [ ] o.a.s.c.CorePropertiesLocator Config-defined core root directory: /home/jenkins/workspace/Lucene-Solr-5.5-Linux/solr/build/solr-core/test/J2/temp/solr.schema.TestManagedSchemaAPI_9B1CA7132C043EF0-001/tempDir-001/node1/.
    [junit4] 2> 1030535 INFO (jetty-launcher-20993-thread-2) [ ] o.a.s.c.CorePropertiesLocator Config-defined core root directory: /home/jenkins/workspace/Lucene-Solr-5.5-Linux/solr/build/solr-core/test/J2/temp/solr.schema.TestManagedSchemaAPI_9B1CA7132C043EF0-001/tempDir-001/node2/.
    [junit4] 2> 1030535 INFO (jetty-launcher-20993-thread-1) [ ] o.a.s.c.CoreContainer New CoreContainer 5505245
    [junit4] 2> 1030535 INFO (jetty-launcher-20993-thread-2) [ ] o.a.s.c.CoreContainer New CoreContainer 17087673
    [junit4] 2> 1030535 INFO (jetty-launcher-20993-thread-1) [ ] o.a.s.c.CoreContainer Loading cores into CoreContainer [instanceDir=/home/jenkins/workspace/Lucene-Solr-5.5-Linux/solr/build/solr-core/test/J2/temp/solr.schema.TestManagedSchemaAPI_9B1CA7132C043EF0-001/tempDir-001/node1]
    [junit4] 2> 1030535 INFO (jetty-launcher-20993-thread-2) [ ] o.a.s.c.CoreContainer Loading cores into CoreContainer [instanceDir=/home/jenkins/workspace/Lucene-Solr-5.5-Linux/solr/build/solr-core/test/J2/temp/solr.schema.TestManagedSchemaAPI_9B1CA7132C043EF0-001/tempDir-001/node2]
    [junit4] 2> 1030535 WARN (NIOServerCxn.Factory:0.0.0.0/0.0.0.0:0) [ ] o.a.z.s.NIOServerCnxn caught end of stream exception
    [junit4] 2> EndOfStreamException: Unable to read additional data from client sessionid 0x155604395aa0002, likely client has closed socket
    [junit4] 2> at org.apache.zookeeper.server.NIOServerCnxn.doIO(NIOServerCnxn.java:228)
    [junit4] 2> at org.apache.zookeeper.server.NIOServerCnxnFactory.run(NIOServerCnxnFactory.java:208)
    [junit4] 2> at java.lang.Thread.run(Thread.java:745)
    [junit4] 2> 1030535 WARN (jetty-launcher-20993-thread-2) [ ] o.a.s.c.CoreContainer Couldn't add files from /home/jenkins/workspace/Lucene-Solr-5.5-Linux/solr/build/solr-core/test/J2/temp/solr.schema.TestManagedSchemaAPI_9B1CA7132C043EF0-001/tempDir-001/node2/lib to classpath: /home/jenkins/workspace/Lucene-Solr-5.5-Linux/solr/build/solr-core/test/J2/temp/solr.schema.TestManagedSchemaAPI_9B1CA7132C043EF0-001/tempDir-001/node2/lib
    [junit4] 2> 1030535 WARN (jetty-launcher-20993-thread-1) [ ] o.a.s.c.CoreContainer Couldn't add files from /home/jenkins/workspace/Lucene-Solr-5.5-Linux/solr/build/solr-core/test/J2/temp/solr.schema.TestManagedSchemaAPI_9B1CA7132C043EF0-001/tempDir-001/node1/lib to classpath: /home/jenkins/workspace/Lucene-Solr-5.5-Linux/solr/build/solr-core/test/J2/temp/solr.schema.TestManagedSchemaAPI_9B1CA7132C043EF0-001/tempDir-001/node1/lib
    [junit4] 2> 1030535 INFO (jetty-launcher-20993-thread-2) [ ] o.a.s.h.c.HttpShardHandlerFactory created with socketTimeout : 90000,urlScheme : ,connTimeout : 15000,maxConnectionsPerHost : 20,maxConnections : 10000,corePoolSize : 0,maximumPoolSize : 2147483647,maxThreadIdleTime : 5,sizeOfQueue : -1,fairnessPolicy : false,useRetries : false,
    [junit4] 2> 1030535 INFO (jetty-launcher-20993-thread-1) [ ] o.a.s.h.c.HttpShardHandlerFactory created with socketTimeout : 90000,urlScheme : ,connTimeout : 15000,maxConnectionsPerHost : 20,maxConnections : 10000,corePoolSize : 0,maximumPoolSize : 2147483647,maxThreadIdleTime : 5,sizeOfQueue : -1,fairnessPolicy : false,useRetries : false,
    [junit4] 2> 1030536 INFO (jetty-launcher-20993-thread-1) [ ] o.a.s.u.UpdateShardHandler Creating UpdateShardHandler HTTP client with params: socketTimeout=340000&connTimeout=45000&retry=true
    [junit4] 2> 1030536 INFO (jetty-launcher-20993-thread-2) [ ] o.a.s.u.UpdateShardHandler Creating UpdateShardHandler HTTP client with params: socketTimeout=340000&connTimeout=45000&retry=true
    [junit4] 2> 1030537 INFO (jetty-launcher-20993-thread-1) [ ] o.a.s.l.LogWatcher SLF4J impl is org.slf4j.impl.Log4jLoggerFactory
    [junit4] 2> 1030537 INFO (jetty-launcher-20993-thread-1) [ ] o.a.s.l.LogWatcher Registering Log Listener [Log4j (org.slf4j.impl.Log4jLoggerFactory)]
    [junit4] 2> 1030537 INFO (jetty-launcher-20993-thread-2) [ ] o.a.s.l.LogWatcher SLF4J impl is org.slf4j.impl.Log4jLoggerFactory
    [junit4] 2> 1030537 INFO (jetty-launcher-20993-thread-2) [ ] o.a.s.l.LogWatcher Registering Log Listener [Log4j (org.slf4j.impl.Log4jLoggerFactory)]
    [junit4] 2> 1030537 INFO (jetty-launcher-20993-thread-1) [ ] o.a.s.c.ZkContainer Zookeeper client=127.0.0.1:41918/solr
    [junit4] 2> 1030537 INFO (jetty-launcher-20993-thread-1) [ ] o.a.s.c.ZkController zkHost includes chroot
    [junit4] 2> 1030537 INFO (jetty-launcher-20993-thread-2) [ ] o.a.s.c.ZkContainer Zookeeper client=127.0.0.1:41918/solr
    [junit4] 2> 1030537 INFO (jetty-launcher-20993-thread-1) [ ] o.a.s.c.c.SolrZkClient Using default ZkCredentialsProvider
    [junit4] 2> 1030537 INFO (jetty-launcher-20993-thread-2) [ ] o.a.s.c.ZkController zkHost includes chroot
    [junit4] 2> 1030537 INFO (jetty-launcher-20993-thread-2) [ ] o.a.s.c.c.SolrZkClient Using default ZkCredentialsProvider
    [junit4] 2> 1030538 INFO (jetty-launcher-20993-thread-1) [ ] o.a.s.c.c.ConnectionManager Waiting for client to connect to ZooKeeper
    [junit4] 2> 1030538 INFO (jetty-launcher-20993-thread-2) [ ] o.a.s.c.c.ConnectionManager Waiting for client to connect to ZooKeeper
    [junit4] 2> 1030538 INFO (zkCallback-21001-thread-1) [ ] o.a.s.c.c.ConnectionManager Watcher org.apache.solr.common.cloud.ConnectionManager@1dae0c0 name:ZooKeeperConnection Watcher:127.0.0.1:41918 got event WatchedEvent state:SyncConnected type:None path:null path:null type:None
    [junit4] 2> 1030538 INFO (jetty-launcher-20993-thread-1) [ ] o.a.s.c.c.ConnectionManager Client is connected to ZooKeeper
    [junit4] 2> 1030538 INFO (zkCallback-21002-thread-1) [ ] o.a.s.c.c.ConnectionManager Watcher org.apache.solr.common.cloud.ConnectionManager@8bc441 name:ZooKeeperConnection Watcher:127.0.0.1:41918 got event WatchedEvent state:SyncConnected type:None path:null path:null type:None
    [junit4] 2> 1030538 INFO (jetty-launcher-20993-thread-2) [ ] o.a.s.c.c.ConnectionManager Client is connected to ZooKeeper
    [junit4] 2> 1030538 INFO (jetty-launcher-20993-thread-1) [ ] o.a.s.c.c.SolrZkClient Using default ZkACLProvider
    [junit4] 2> 1030539 INFO (jetty-launcher-20993-thread-2) [ ] o.a.s.c.c.SolrZkClient Using default ZkACLProvider
    [junit4] 2> 1030539 INFO (jetty-launcher-20993-thread-1) [n:127.0.0.1:37446_solr ] o.a.s.c.ZkController Added new OnReconnect listener org.apache.solr.cloud.ZkController$6@1ee7083
    [junit4] 2> 1030539 INFO (jetty-launcher-20993-thread-2) [n:127.0.0.1:40002_solr ] o.a.s.c.ZkController Added new OnReconnect listener org.apache.solr.cloud.ZkController$6@1aeb20e
    [junit4] 2> 1030539 INFO (jetty-launcher-20993-thread-1) [n:127.0.0.1:37446_solr ] o.a.s.c.c.ConnectionManager Waiting for client to connect to ZooKeeper
    [junit4] 2> 1030539 INFO (jetty-launcher-20993-thread-2) [n:127.0.0.1:40002_solr ] o.a.s.c.c.ConnectionManager Waiting for client to connect to ZooKeeper
    [junit4] 2> 1030540 INFO (zkCallback-21003-thread-1-processing-n:127.0.0.1:37446_solr) [n:127.0.0.1:37446_solr ] o.a.s.c.c.ConnectionManager Watcher org.apache.solr.common.cloud.ConnectionManager@e09ba8 name:ZooKeeperConnection Watcher:127.0.0.1:41918/solr got event WatchedEvent state:SyncConnected type:None path:null path:null type:None
    [junit4] 2> 1030540 INFO (jetty-launcher-20993-thread-1) [n:127.0.0.1:37446_solr ] o.a.s.c.c.ConnectionManager Client is connected to ZooKeeper
    [junit4] 2> 1030540 INFO (zkCallback-21004-thread-1-processing-n:127.0.0.1:40002_solr) [n:127.0.0.1:40002_solr ] o.a.s.c.c.ConnectionManager Watcher org.apache.solr.common.cloud.ConnectionManager@1d879d8 name:ZooKeeperConnection Watcher:127.0.0.1:41918/solr got event WatchedEvent state:SyncConnected type:None path:null path:null type:None
    [junit4] 2> 1030540 INFO (jetty-launcher-20993-thread-2) [n:127.0.0.1:40002_solr ] o.a.s.c.c.ConnectionManager Client is connected to ZooKeeper
    [junit4] 2> 1030540 INFO (jetty-launcher-20993-thread-1) [n:127.0.0.1:37446_solr ] o.a.s.c.c.SolrZkClient makePath: /overseer/queue
    [junit4] 2> 1030540 INFO (jetty-launcher-20993-thread-2) [n:127.0.0.1:40002_solr ] o.a.s.c.c.SolrZkClient makePath: /overseer/queue
    [junit4] 2> 1030541 INFO (jetty-launcher-20993-thread-1) [n:127.0.0.1:37446_solr ] o.a.s.c.c.SolrZkClient makePath: /overseer/collection-queue-work
    [junit4] 2> 1030541 INFO (jetty-launcher-20993-thread-2) [n:127.0.0.1:40002_solr ] o.a.s.c.c.SolrZkClient makePath: /overseer/collection-queue-work
    [junit4] 2> 1030542 INFO (jetty-launcher-20993-thread-1) [n:127.0.0.1:37446_solr ] o.a.s.c.c.SolrZkClient makePath: /overseer/collection-map-running
    [junit4] 2> 1030542 INFO (jetty-launcher-20993-thread-2) [n:127.0.0.1:40002_solr ] o.a.s.c.c.SolrZkClient makePath: /overseer/collection-map-running
    [junit4] 2> 1030543 INFO (jetty-launcher-20993-thread-2) [n:127.0.0.1:40002_solr ] o.a.s.c.c.SolrZkClient makePath: /overseer/collection-map-completed
    [junit4] 2> 1030543 INFO (jetty-launcher-20993-thread-1) [n:127.0.0.1:37446_solr ] o.a.s.c.c.SolrZkClient makePath: /overseer/collection-map-completed
    [junit4] 2> 1030543 INFO (jetty-launcher-20993-thread-1) [n:127.0.0.1:37446_solr ] o.a.s.c.c.SolrZkClient makePath: /overseer/collection-map-failure
    [junit4] 2> 1030543 INFO (jetty-launcher-20993-thread-2) [n:127.0.0.1:40002_solr ] o.a.s.c.c.SolrZkClient makePath: /overseer/collection-map-failure
    [junit4] 2> 1030544 INFO (jetty-launcher-20993-thread-2) [n:127.0.0.1:40002_solr ] o.a.s.c.c.SolrZkClient makePath: /live_nodes
    [junit4] 2> 1030544 INFO (jetty-launcher-20993-thread-1) [n:127.0.0.1:37446_solr ] o.a.s.c.c.SolrZkClient makePath: /live_nodes
    [junit4] 2> 1030544 INFO (jetty-launcher-20993-thread-1) [n:127.0.0.1:37446_solr ] o.a.s.c.c.SolrZkClient makePath: /collections
    [junit4] 2> 1030544 INFO (jetty-launcher-20993-thread-2) [n:127.0.0.1:40002_solr ] o.a.s.c.c.SolrZkClient makePath: /collections
    [junit4] 2> 1030546 INFO (jetty-launcher-20993-thread-2) [n:127.0.0.1:40002_solr ] o.a.s.c.c.SolrZkClient makePath: /aliases.json
    [junit4] 2> 1030546 INFO (jetty-launcher-20993-thread-1) [n:127.0.0.1:37446_solr ] o.a.s.c.c.SolrZkClient makePath: /aliases.json
    [junit4] 2> 1030546 INFO (jetty-launcher-20993-thread-1) [n:127.0.0.1:37446_solr ] o.a.s.c.c.SolrZkClient makePath: /clusterstate.json
    [junit4] 2> 1030546 INFO (jetty-launcher-20993-thread-2) [n:127.0.0.1:40002_solr ] o.a.s.c.c.SolrZkClient makePath: /clusterstate.json
    [junit4] 2> 1030547 INFO (jetty-launcher-20993-thread-2) [n:127.0.0.1:40002_solr ] o.a.s.c.c.SolrZkClient makePath: /security.json
    [junit4] 2> 1030547 INFO (jetty-launcher-20993-thread-1) [n:127.0.0.1:37446_solr ] o.a.s.c.c.SolrZkClient makePath: /security.json
    [junit4] 2> 1030547 INFO (jetty-launcher-20993-thread-1) [n:127.0.0.1:37446_solr ] o.a.s.c.ZkController Register node as live in ZooKeeper:/live_nodes/127.0.0.1:37446_solr
    [junit4] 2> 1030547 INFO (jetty-launcher-20993-thread-2) [n:127.0.0.1:40002_solr ] o.a.s.c.ZkController Register node as live in ZooKeeper:/live_nodes/127.0.0.1:40002_solr
    [junit4] 2> 1030547 INFO (jetty-launcher-20993-thread-1) [n:127.0.0.1:37446_solr ] o.a.s.c.c.SolrZkClient makePath: /live_nodes/127.0.0.1:37446_solr
    [junit4] 2> 1030547 INFO (jetty-launcher-20993-thread-2) [n:127.0.0.1:40002_solr ] o.a.s.c.c.SolrZkClient makePath: /live_nodes/127.0.0.1:40002_solr
    [junit4] 2> 1030548 INFO (jetty-launcher-20993-thread-1) [n:127.0.0.1:37446_solr ] o.a.s.c.c.SolrZkClient makePath: /overseer_elect
    [junit4] 2> 1030548 INFO (jetty-launcher-20993-thread-2) [n:127.0.0.1:40002_solr ] o.a.s.c.c.SolrZkClient makePath: /overseer_elect
    [junit4] 2> 1030549 INFO (jetty-launcher-20993-thread-2) [n:127.0.0.1:40002_solr ] o.a.s.c.c.SolrZkClient makePath: /overseer_elect/election
    [junit4] 2> 1030549 INFO (jetty-launcher-20993-thread-1) [n:127.0.0.1:37446_solr ] o.a.s.c.c.SolrZkClient makePath: /overseer_elect/election
    [junit4] 2> 1030549 INFO (jetty-launcher-20993-thread-2) [n:127.0.0.1:40002_solr ] o.a.s.c.Overseer Overseer (id=null) closing
    [junit4] 2> 1030549 INFO (jetty-launcher-20993-thread-1) [n:127.0.0.1:37446_solr ] o.a.s.c.Overseer Overseer (id=null) closing
    [junit4] 2> 1030550 INFO (jetty-launcher-20993-thread-2) [n:127.0.0.1:40002_solr ] o.a.s.c.LeaderElector Joined leadership election with path: /overseer_elect/election/96088810448355334-127.0.0.1:40002_solr-n_0000000000
    [junit4] 2> 1030550 INFO (jetty-launcher-20993-thread-1) [n:127.0.0.1:37446_solr ] o.a.s.c.LeaderElector Joined leadership election with path: /overseer_elect/election/96088810448355333-127.0.0.1:37446_solr-n_0000000001
    [junit4] 2> 1030550 INFO (jetty-launcher-20993-thread-2) [n:127.0.0.1:40002_solr ] o.a.s.c.OverseerElectionContext I am going to be the leader 127.0.0.1:40002_solr
    [junit4] 2> 1030550 INFO (jetty-launcher-20993-thread-2) [n:127.0.0.1:40002_solr ] o.a.s.c.c.SolrZkClient makePath: /overseer_elect/leader
    [junit4] 2> 1030550 INFO (jetty-launcher-20993-thread-1) [n:127.0.0.1:37446_solr ] o.a.s.c.LeaderElector Watching path /overseer_elect/election/96088810448355334-127.0.0.1:40002_solr-n_0000000000 to know if I could be the leader
    [junit4] 2> 1030550 INFO (jetty-launcher-20993-thread-1) [n:127.0.0.1:37446_solr ] o.a.s.c.c.ZkStateReader Updating cluster state from ZooKeeper...
    [junit4] 2> 1030550 INFO (jetty-launcher-20993-thread-2) [n:127.0.0.1:40002_solr ] o.a.s.c.Overseer Overseer (id=96088810448355334-127.0.0.1:40002_solr-n_0000000000) starting
    [junit4] 2> 1030551 INFO (jetty-launcher-20993-thread-2) [n:127.0.0.1:40002_solr ] o.a.s.c.c.SolrZkClient makePath: /overseer/queue-work
    [junit4] 2> 1030553 INFO (jetty-launcher-20993-thread-2) [n:127.0.0.1:40002_solr ] o.a.s.c.OverseerAutoReplicaFailoverThread Starting OverseerAutoReplicaFailoverThread autoReplicaFailoverWorkLoopDelay=10000 autoReplicaFailoverWaitAfterExpiration=30000 autoReplicaFailoverBadNodeExpiration=60000
    [junit4] 2> 1030553 INFO (OverseerCollectionConfigSetProcessor-96088810448355334-127.0.0.1:40002_solr-n_0000000000) [n:127.0.0.1:40002_solr ] o.a.s.c.OverseerTaskProcessor Process current queue of overseer operations
    [junit4] 2> 1030553 INFO (jetty-launcher-20993-thread-2) [n:127.0.0.1:40002_solr ] o.a.s.c.c.ZkStateReader Updating cluster state from ZooKeeper...
    [junit4] 2> 1030553 INFO (OverseerStateUpdate-96088810448355334-127.0.0.1:40002_solr-n_0000000000) [n:127.0.0.1:40002_solr ] o.a.s.c.Overseer Starting to work on the main queue
    [junit4] 2> 1030584 INFO (jetty-launcher-20993-thread-1) [n:127.0.0.1:37446_solr ] o.a.s.c.CoreContainer Security conf doesn't exist. Skipping setup for authorization module.
    [junit4] 2> 1030584 INFO (jetty-launcher-20993-thread-1) [n:127.0.0.1:37446_solr ] o.a.s.c.CoreContainer No authentication plugin used.
    [junit4] 2> 1030584 INFO (jetty-launcher-20993-thread-1) [n:127.0.0.1:37446_solr ] o.a.s.c.CorePropertiesLocator Looking for core definitions underneath /home/jenkins/workspace/Lucene-Solr-5.5-Linux/solr/build/solr-core/test/J2/temp/solr.schema.TestManagedSchemaAPI_9B1CA7132C043EF0-001/tempDir-001/node1/.
    [junit4] 2> 1030585 INFO (jetty-launcher-20993-thread-1) [n:127.0.0.1:37446_solr ] o.a.s.c.CorePropertiesLocator Found 0 core definitions
    [junit4] 2> 1030585 INFO (jetty-launcher-20993-thread-1) [n:127.0.0.1:37446_solr ] o.a.s.s.SolrDispatchFilter user.dir=/home/jenkins/workspace/Lucene-Solr-5.5-Linux/solr/build/solr-core/test/J2
    [junit4] 2> 1030585 INFO (jetty-launcher-20993-thread-1) [n:127.0.0.1:37446_solr ] o.a.s.s.SolrDispatchFilter SolrDispatchFilter.init() done
    [junit4] 2> 1030588 INFO (jetty-launcher-20993-thread-2) [n:127.0.0.1:40002_solr ] o.a.s.c.CoreContainer Security conf doesn't exist. Skipping setup for authorization module.
    [junit4] 2> 1030588 INFO (jetty-launcher-20993-thread-2) [n:127.0.0.1:40002_solr ] o.a.s.c.CoreContainer No authentication plugin used.
    [junit4] 2> 1030588 INFO (jetty-launcher-20993-thread-2) [n:127.0.0.1:40002_solr ] o.a.s.c.CorePropertiesLocator Looking for core definitions underneath /home/jenkins/workspace/Lucene-Solr-5.5-Linux/solr/build/solr-core/test/J2/temp/solr.schema.TestManagedSchemaAPI_9B1CA7132C043EF0-001/tempDir-001/node2/.
    [junit4] 2> 1030588 INFO (jetty-launcher-20993-thread-2) [n:127.0.0.1:40002_solr ] o.a.s.c.CorePropertiesLocator Found 0 core definitions
    [junit4] 2> 1030588 INFO (jetty-launcher-20993-thread-2) [n:127.0.0.1:40002_solr ] o.a.s.s.SolrDispatchFilter user.dir=/home/jenkins/workspace/Lucene-Solr-5.5-Linux/solr/build/solr-core/test/J2
    [junit4] 2> 1030588 INFO (jetty-launcher-20993-thread-2) [n:127.0.0.1:40002_solr ] o.a.s.s.SolrDispatchFilter SolrDispatchFilter.init() done
    [junit4] 2> 1030589 INFO (TEST-TestManagedSchemaAPI.test-seed#[9B1CA7132C043EF0]) [ ] o.a.s.c.c.SolrZkClient Using default ZkCredentialsProvider
    [junit4] 2> 1030589 INFO (TEST-TestManagedSchemaAPI.test-seed#[9B1CA7132C043EF0]) [ ] o.a.s.c.c.ConnectionManager Waiting for client to connect to ZooKeeper
    [junit4] 2> 1030589 INFO (zkCallback-21005-thread-1) [ ] o.a.s.c.c.ConnectionManager Watcher org.apache.solr.common.cloud.ConnectionManager@fde60f name:ZooKeeperConnection Watcher:127.0.0.1:41918 got event WatchedEvent state:SyncConnected type:None path:null path:null type:None
    [junit4] 2> 1030589 INFO (TEST-TestManagedSchemaAPI.test-seed#[9B1CA7132C043EF0]) [ ] o.a.s.c.c.ConnectionManager Client is connected to ZooKeeper
    [junit4] 2> 1030590 INFO (TEST-TestManagedSchemaAPI.test-seed#[9B1CA7132C043EF0]) [ ] o.a.s.c.c.SolrZkClient Using default ZkACLProvider
    [junit4] 2> 1030590 INFO (TEST-TestManagedSchemaAPI.test-seed#[9B1CA7132C043EF0]) [ ] o.a.s.c.c.SolrZkClient Using default ZkCredentialsProvider
    [junit4] 2> 1030591 INFO (TEST-TestManagedSchemaAPI.test-seed#[9B1CA7132C043EF0]) [ ] o.a.s.c.c.ConnectionManager Waiting for client to connect to ZooKeeper
    [junit4] 2> 1030591 INFO (zkCallback-21007-thread-1) [ ] o.a.s.c.c.ConnectionManager Watcher org.apache.solr.common.cloud.ConnectionManager@1eb643c name:ZooKeeperConnection Watcher:127.0.0.1:41918/solr got event WatchedEvent state:SyncConnected type:None path:null path:null type:None
    [junit4] 2> 1030591 INFO (TEST-TestManagedSchemaAPI.test-seed#[9B1CA7132C043EF0]) [ ] o.a.s.c.c.ConnectionManager Client is connected to ZooKeeper
    [junit4] 2> 1030591 INFO (TEST-TestManagedSchemaAPI.test-seed#[9B1CA7132C043EF0]) [ ] o.a.s.c.c.SolrZkClient Using default ZkACLProvider
    [junit4] 2> 1030591 INFO (TEST-TestManagedSchemaAPI.test-seed#[9B1CA7132C043EF0]) [ ] o.a.s.c.c.SolrZkClient makePath: /configs/conf1/solrconfig.xml
    [junit4] 2> 1030592 INFO (TEST-TestManagedSchemaAPI.test-seed#[9B1CA7132C043EF0]) [ ] o.a.s.c.c.SolrZkClient makePath: /configs/conf1/managed-schema
    [junit4] 2> 1030594 INFO (TEST-TestManagedSchemaAPI.test-seed#[9B1CA7132C043EF0]) [ ] o.a.s.c.c.SolrZkClient Using default ZkCredentialsProvider
    [junit4] 2> 1030594 INFO (TEST-TestManagedSchemaAPI.test-seed#[9B1CA7132C043EF0]) [ ] o.a.s.c.c.ConnectionManager Waiting for client to connect to ZooKeeper
    [junit4] 2> 1030594 INFO (zkCallback-21008-thread-1) [ ] o.a.s.c.c.ConnectionManager Watcher org.apache.solr.common.cloud.ConnectionManager@164cfca name:ZooKeeperConnection Watcher:127.0.0.1:41918/solr got event WatchedEvent state:SyncConnected type:None path:null path:null type:None
    [junit4] 2> 1030594 INFO (TEST-TestManagedSchemaAPI.test-seed#[9B1CA7132C043EF0]) [ ] o.a.s.c.c.ConnectionManager Client is connected to ZooKeeper
    [junit4] 2> 1030595 INFO (TEST-TestManagedSchemaAPI.test-seed#[9B1CA7132C043EF0]) [ ] o.a.s.c.c.SolrZkClient Using default ZkACLProvider
    [junit4] 2> 1030595 INFO (TEST-TestManagedSchemaAPI.test-seed#[9B1CA7132C043EF0]) [ ] o.a.s.c.c.ZkStateReader Updating cluster state from ZooKeeper...
    [junit4] 2> 1030597 INFO (qtp12607128-79281) [n:127.0.0.1:40002_solr ] o.a.s.h.a.CollectionsHandler Invoked Collection Action :create with params collection.configName=conf1&numShards=1&replicationFactor=2&name=testschemaapi&action=CREATE&version=2&wt=javabin and sendToOCPQueue=true
    [junit4] 2> 1030598 INFO (OverseerCollectionConfigSetProcessor-96088810448355334-127.0.0.1:40002_solr-n_0000000000) [n:127.0.0.1:40002_solr ] o.a.s.c.OverseerTaskProcessor Overseer Collection Message Handler: Get the message id:/overseer/collection-queue-work/qn-0000000000 message:{
    [junit4] 2> "name":"testschemaapi",
    [junit4] 2> "fromApi":"true",
    [junit4] 2> "replicationFactor":"2",
    [junit4] 2> "collection.configName":"conf1",
    [junit4] 2> "numShards":"1",
    [junit4] 2> "stateFormat":"2",
    [junit4] 2> "operation":"create"}
    [junit4] 2> 1030598 INFO (OverseerThreadFactory-6617-thread-1-processing-n:127.0.0.1:40002_solr) [n:127.0.0.1:40002_solr ] o.a.s.c.OverseerCollectionMessageHandler OverseerCollectionMessageHandler.processMessage : create , {
    [junit4] 2> "name":"testschemaapi",
    [junit4] 2> "fromApi":"true",
    [junit4] 2> "replicationFactor":"2",
    [junit4] 2> "collection.configName":"conf1",
    [junit4] 2> "numShards":"1",
    [junit4] 2> "stateFormat":"2",
    [junit4] 2> "operation":"create"}
    [junit4] 2> 1030599 INFO (OverseerThreadFactory-6617-thread-1-processing-n:127.0.0.1:40002_solr) [n:127.0.0.1:40002_solr ] o.a.s.c.OverseerCollectionMessageHandler Create collection testschemaapi
    [junit4] 2> 1030599 INFO (OverseerThreadFactory-6617-thread-1-processing-n:127.0.0.1:40002_solr) [n:127.0.0.1:40002_solr ] o.a.s.c.OverseerCollectionMessageHandler creating collections conf node /collections/testschemaapi
    [junit4] 2> 1030599 INFO (OverseerThreadFactory-6617-thread-1-processing-n:127.0.0.1:40002_solr) [n:127.0.0.1:40002_solr ] o.a.s.c.c.SolrZkClient makePath: /collections/testschemaapi
    [junit4] 2> 1030599 INFO (zkCallback-21004-thread-1-processing-n:127.0.0.1:40002_solr) [n:127.0.0.1:40002_solr ] o.a.s.c.c.ZkStateReader A collections change: [WatchedEvent state:SyncConnected type:NodeChildrenChanged path:/collections], has occurred - updating...
    [junit4] 2> 1030599 INFO (zkCallback-21008-thread-1) [ ] o.a.s.c.c.ZkStateReader A collections change: [WatchedEvent state:SyncConnected type:NodeChildrenChanged path:/collections], has occurred - updating...
    [junit4] 2> 1030600 INFO (zkCallback-21003-thread-1-processing-n:127.0.0.1:37446_solr) [n:127.0.0.1:37446_solr ] o.a.s.c.c.ZkStateReader A collections change: [WatchedEvent state:SyncConnected type:NodeChildrenChanged path:/collections], has occurred - updating...
    [junit4] 2> 1030601 INFO (OverseerStateUpdate-96088810448355334-127.0.0.1:40002_solr-n_0000000000) [n:127.0.0.1:40002_solr ] o.a.s.c.Overseer processMessage: queueSize: 1, message = {
    [junit4] 2> "name":"testschemaapi",
    [junit4] 2> "fromApi":"true",
    [junit4] 2> "replicationFactor":"2",
    [junit4] 2> "collection.configName":"conf1",
    [junit4] 2> "numShards":"1",
    [junit4] 2> "stateFormat":"2",
    [junit4] 2> "operation":"create"} current state version: 0
    [junit4] 2> 1030601 INFO (OverseerStateUpdate-96088810448355334-127.0.0.1:40002_solr-n_0000000000) [n:127.0.0.1:40002_solr ] o.a.s.c.o.ClusterStateMutator building a new cName: testschemaapi
    [junit4] 2> 1030601 INFO (OverseerStateUpdate-96088810448355334-127.0.0.1:40002_solr-n_0000000000) [n:127.0.0.1:40002_solr ] o.a.s.c.o.ZkStateWriter going to create_collection /collections/testschemaapi/state.json
    [junit4] 2> 1030701 INFO (OverseerThreadFactory-6617-thread-1-processing-n:127.0.0.1:40002_solr) [n:127.0.0.1:40002_solr ] o.a.s.c.OverseerCollectionMessageHandler Creating SolrCores for new collection testschemaapi, shardNames [shard1] , replicationFactor : 2
    [junit4] 2> 1030701 INFO (OverseerThreadFactory-6617-thread-1-processing-n:127.0.0.1:40002_solr) [n:127.0.0.1:40002_solr ] o.a.s.c.OverseerCollectionMessageHandler Creating core testschemaapi_shard1_replica1 as part of shard shard1 of collection testschemaapi on 127.0.0.1:40002_solr
    [junit4] 2> 1030702 INFO (OverseerThreadFactory-6617-thread-1-processing-n:127.0.0.1:40002_solr) [n:127.0.0.1:40002_solr ] o.a.s.c.OverseerCollectionMessageHandler Creating core testschemaapi_shard1_replica2 as part of shard shard1 of collection testschemaapi on 127.0.0.1:37446_solr
    [junit4] 2> 1030703 INFO (qtp12607128-79282) [n:127.0.0.1:40002_solr ] o.a.s.h.a.CoreAdminOperation core create command collection.configName=conf1&numShards=1&collection=testschemaapi&qt=/admin/cores&name=testschemaapi_shard1_replica1&action=CREATE&shard=shard1&version=2&wt=javabin
    [junit4] 2> 1030703 INFO (qtp12607128-79282) [n:127.0.0.1:40002_solr ] o.a.s.c.CoreDescriptor Created CoreDescriptor: {shard=shard1, collection=testschemaapi, config=solrconfig.xml, loadOnStartup=true, transient=false, configSetProperties=configsetprops.json, name=testschemaapi_shard1_replica1, collection.configName=conf1, schema=schema.xml, numShards=1, dataDir=data/}
    [junit4] 2> 1030703 INFO (qtp6816469-79270) [n:127.0.0.1:37446_solr ] o.a.s.h.a.CoreAdminOperation core create command collection.configName=conf1&numShards=1&collection=testschemaapi&qt=/admin/cores&name=testschemaapi_shard1_replica2&action=CREATE&shard=shard1&version=2&wt=javabin
    [junit4] 2> 1030704 INFO (qtp12607128-79282) [n:127.0.0.1:40002_solr c:testschemaapi s:shard1 x:testschemaapi_shard1_replica1] o.a.s.c.ZkController publishing state=down
    [junit4] 2> 1030704 INFO (qtp6816469-79270) [n:127.0.0.1:37446_solr ] o.a.s.c.CoreDescriptor Created CoreDescriptor: {numShards=1, name=testschemaapi_shard1_replica2, transient=false, schema=schema.xml, shard=shard1, configSetProperties=configsetprops.json, config=solrconfig.xml, dataDir=data/, collection=testschemaapi, loadOnStartup=true, collection.configName=conf1}
    [junit4] 2> 1030704 INFO (qtp12607128-79282) [n:127.0.0.1:40002_solr c:testschemaapi s:shard1 x:testschemaapi_shard1_replica1] o.a.s.c.ZkController Registering watch for collection testschemaapi
    [junit4] 2> 1030704 INFO (qtp6816469-79270) [n:127.0.0.1:37446_solr c:testschemaapi s:shard1 x:testschemaapi_shard1_replica2] o.a.s.c.ZkController publishing state=down
    [junit4] 2> 1030704 INFO (qtp12607128-79282) [n:127.0.0.1:40002_solr c:testschemaapi s:shard1 x:testschemaapi_shard1_replica1] o.a.s.c.c.ZkStateReader addZkWatch [testschemaapi]
    [junit4] 2> 1030704 INFO (OverseerStateUpdate-96088810448355334-127.0.0.1:40002_solr-n_0000000000) [n:127.0.0.1:40002_solr ] o.a.s.c.Overseer processMessage: queueSize: 1, message = {
    [junit4] 2> "roles":null,
    [junit4] 2> "core":"testschemaapi_shard1_replica1",
    [junit4] 2> "numShards":"1",
    [junit4] 2> "collection":"testschemaapi",
    [junit4] 2> "shard":"shard1",
    [junit4] 2> "node_name":"127.0.0.1:40002_solr",
    [junit4] 2> "state":"down",
    [junit4] 2> "operation":"state",
    [junit4] 2> "base_url":"http://127.0.0.1:40002/solr"} current state version: 0
    [junit4] 2> 1030705 INFO (qtp12607128-79282) [n:127.0.0.1:40002_solr c:testschemaapi s:shard1 x:testschemaapi_shard1_replica1] o.a.s.c.c.ZkStateReader Add data for [testschemaapi] ver [0]
    [junit4] 2> 1030705 INFO (qtp12607128-79282) [n:127.0.0.1:40002_solr c:testschemaapi s:shard1 x:testschemaapi_shard1_replica1] o.a.s.c.ZkController look for our core node name
    [junit4] 2> 1030705 INFO (OverseerStateUpdate-96088810448355334-127.0.0.1:40002_solr-n_0000000000) [n:127.0.0.1:40002_solr ] o.a.s.c.o.ReplicaMutator Update state numShards=1 message={
    [junit4] 2> "roles":null,
    [junit4] 2> "core":"testschemaapi_shard1_replica1",
    [junit4] 2> "numShards":"1",
    [junit4] 2> "collection":"testschemaapi",
    [junit4] 2> "shard":"shard1",
    [junit4] 2> "node_name":"127.0.0.1:40002_solr",
    [junit4] 2> "state":"down",
    [junit4] 2> "operation":"state",
    [junit4] 2> "base_url":"http://127.0.0.1:40002/solr"}
    [junit4] 2> 1030705 INFO (qtp6816469-79270) [n:127.0.0.1:37446_solr c:testschemaapi s:shard1 x:testschemaapi_shard1_replica2] o.a.s.c.ZkController Registering watch for collection testschemaapi
    [junit4] 2> 1030705 INFO (qtp6816469-79270) [n:127.0.0.1:37446_solr c:testschemaapi s:shard1 x:testschemaapi_shard1_replica2] o.a.s.c.c.ZkStateReader addZkWatch [testschemaapi]
    [junit4] 2> 1030705 INFO (qtp6816469-79270) [n:127.0.0.1:37446_solr c:testschemaapi s:shard1 x:testschemaapi_shard1_replica2] o.a.s.c.c.ZkStateReader Add data for [testschemaapi] ver [0]
    [junit4] 2> 1030705 INFO (qtp6816469-79270) [n:127.0.0.1:37446_solr c:testschemaapi s:shard1 x:testschemaapi_shard1_replica2] o.a.s.c.ZkController look for our core node name
    [junit4] 2> 1030705 INFO (OverseerStateUpdate-96088810448355334-127.0.0.1:40002_solr-n_0000000000) [n:127.0.0.1:40002_solr ] o.a.s.c.Overseer processMessage: queueSize: 1, message = {
    [junit4] 2> "roles":null,
    [junit4] 2> "core":"testschemaapi_shard1_replica2",
    [junit4] 2> "numShards":"1",
    [junit4] 2> "collection":"testschemaapi",
    [junit4] 2> "shard":"shard1",
    [junit4] 2> "node_name":"127.0.0.1:37446_solr",
    [junit4] 2> "state":"down",
    [junit4] 2> "operation":"state",
    [junit4] 2> "base_url":"http://127.0.0.1:37446/solr"} current state version: 0
    [junit4] 2> 1030706 INFO (OverseerStateUpdate-96088810448355334-127.0.0.1:40002_solr-n_0000000000) [n:127.0.0.1:40002_solr ] o.a.s.c.o.ReplicaMutator Update state numShards=1 message={
    [junit4] 2> "roles":null,
    [junit4] 2> "core":"testschemaapi_shard1_replica2",
    [junit4] 2> "numShards":"1",
    [junit4] 2> "collection":"testschemaapi",
    [junit4] 2> "shard":"shard1",
    [junit4] 2> "node_name":"127.0.0.1:37446_solr",
    [junit4] 2> "state":"down",
    [junit4] 2> "operation":"state",
    [junit4] 2> "base_url":"http://127.0.0.1:37446/solr"}
    [junit4] 2> 1030807 INFO (OverseerStateUpdate-96088810448355334-127.0.0.1:40002_solr-n_0000000000) [n:127.0.0.1:40002_solr ] o.a.s.c.o.ZkStateWriter going to update_collection /collections/testschemaapi/state.json version: 0
    [junit4] 2> 1030807 INFO (zkCallback-21004-thread-1-processing-n:127.0.0.1:40002_solr) [n:127.0.0.1:40002_solr ] o.a.s.c.c.ZkStateReader A cluster state change: [WatchedEvent state:SyncConnected type:NodeDataChanged path:/collections/testschemaapi/state.json] for collection [testschemaapi] has occurred - updating... (live nodes size: [2])
    [junit4] 2> 1030807 INFO (zkCallback-21003-thread-1-processing-n:127.0.0.1:37446_solr) [n:127.0.0.1:37446_solr ] o.a.s.c.c.ZkStateReader A cluster state change: [WatchedEvent state:SyncConnected type:NodeDataChanged path:/collections/testschemaapi/state.json] for collection [testschemaapi] has occurred - updating... (live nodes size: [2])
    [junit4] 2> 1030807 INFO (zkCallback-21004-thread-1-processing-n:127.0.0.1:40002_solr) [n:127.0.0.1:40002_solr ] o.a.s.c.c.ZkStateReader Updating data for [testschemaapi] from [0] to [1]
    [junit4] 2> 1030807 INFO (zkCallback-21003-thread-1-processing-n:127.0.0.1:37446_solr) [n:127.0.0.1:37446_solr ] o.a.s.c.c.ZkStateReader Updating data for [testschemaapi] from [0] to [1]
    [junit4] 2> 1031705 INFO (qtp12607128-79282) [n:127.0.0.1:40002_solr c:testschemaapi s:shard1 x:testschemaapi_shard1_replica1] o.a.s.c.ZkController waiting to find shard id in clusterstate for testschemaapi_shard1_replica1
    [junit4] 2> 1031705 INFO (qtp12607128-79282) [n:127.0.0.1:40002_solr c:testschemaapi s:shard1 x:testschemaapi_shard1_replica1] o.a.s.c.ZkController Check for collection zkNode:testschemaapi
    [junit4] 2> 1031705 INFO (qtp12607128-79282) [n:127.0.0.1:40002_solr c:testschemaapi s:shard1 x:testschemaapi_shard1_replica1] o.a.s.c.ZkController Collection zkNode exists
    [junit4] 2> 1031705 INFO (qtp12607128-79282) [n:127.0.0.1:40002_solr c:testschemaapi s:shard1 x:testschemaapi_shard1_replica1] o.a.s.c.c.ZkStateReader Load collection config from: [/collections/testschemaapi]
    [junit4] 2> 1031705 INFO (qtp6816469-79270) [n:127.0.0.1:37446_solr c:testschemaapi s:shard1 x:testschemaapi_shard1_replica2] o.a.s.c.ZkController waiting to find shard id in clusterstate for testschemaapi_shard1_replica2
    [junit4] 2> 1031705 INFO (qtp6816469-79270) [n:127.0.0.1:37446_solr c:testschemaapi s:shard1 x:testschemaapi_shard1_replica2] o.a.s.c.ZkController Check for collection zkNode:testschemaapi
    [junit4] 2> 1031705 INFO (qtp12607128-79282) [n:127.0.0.1:40002_solr c:testschemaapi s:shard1 x:testschemaapi_shard1_replica1] o.a.s.c.c.ZkStateReader path=[/collections/testschemaapi] [configName]=[conf1] specified config exists in ZooKeeper
    [junit4] 2> 1031705 INFO (qtp6816469-79270) [n:127.0.0.1:37446_solr c:testschemaapi s:shard1 x:testschemaapi_shard1_replica2] o.a.s.c.ZkController Collection zkNode exists
    [junit4] 2> 1031705 INFO (qtp12607128-79282) [n:127.0.0.1:40002_solr c:testschemaapi s:shard1 x:testschemaapi_shard1_replica1] o.a.s.c.SolrResourceLoader new SolrResourceLoader for directory: '/home/jenkins/workspace/Lucene-Solr-5.5-Linux/solr/build/solr-core/test/J2/temp/solr.schema.TestManagedSchemaAPI_9B1CA7132C043EF0-001/tempDir-001/node2/testschemaapi_shard1_replica1'
    [junit4] 2> 1031705 INFO (qtp6816469-79270) [n:127.0.0.1:37446_solr c:testschemaapi s:shard1 x:testschemaapi_shard1_replica2] o.a.s.c.c.ZkStateReader Load collection config from: [/collections/testschemaapi]
    [junit4] 2> 1031706 INFO (qtp12607128-79282) [n:127.0.0.1:40002_solr c:testschemaapi s:shard1 x:testschemaapi_shard1_replica1] o.a.s.c.SolrResourceLoader JNDI not configured for solr (NoInitialContextEx)
    [junit4] 2> 1031706 INFO (qtp12607128-79282) [n:127.0.0.1:40002_solr c:testschemaapi s:shard1 x:testschemaapi_shard1_replica1] o.a.s.c.SolrResourceLoader solr home defaulted to 'solr/' (could not find system property or JNDI)
    [junit4] 2> 1031706 INFO (qtp6816469-79270) [n:127.0.0.1:37446_solr c:testschemaapi s:shard1 x:testschemaapi_shard1_replica2] o.a.s.c.c.ZkStateReader path=[/collections/testschemaapi] [configName]=[conf1] specified config exists in ZooKeeper
    [junit4] 2> 1031706 INFO (qtp6816469-79270) [n:127.0.0.1:37446_solr c:testschemaapi s:shard1 x:testschemaapi_shard1_replica2] o.a.s.c.SolrResourceLoader new SolrResourceLoader for directory: '/home/jenkins/workspace/Lucene-Solr-5.5-Linux/solr/build/solr-core/test/J2/temp/solr.schema.TestManagedSchemaAPI_9B1CA7132C043EF0-001/tempDir-001/node1/testschemaapi_shard1_replica2'
    [junit4] 2> 1031706 INFO (qtp6816469-79270) [n:127.0.0.1:37446_solr c:testschemaapi s:shard1 x:testschemaapi_shard1_replica2] o.a.s.c.SolrResourceLoader JNDI not configured for solr (NoInitialContextEx)
    [junit4] 2> 1031706 INFO (qtp6816469-79270) [n:127.0.0.1:37446_solr c:testschemaapi s:shard1 x:testschemaapi_shard1_replica2] o.a.s.c.SolrResourceLoader solr home defaulted to 'solr/' (could not find system property or JNDI)
    [junit4] 2> 1031707 INFO (qtp12607128-79282) [n:127.0.0.1:40002_solr c:testschemaapi s:shard1 x:testschemaapi_shard1_replica1] o.a.s.c.Config loaded config solrconfig.xml with version 0
    [junit4] 2> 1031707 INFO (qtp6816469-79270) [n:127.0.0.1:37446_solr c:testschemaapi s:shard1 x:testschemaapi_shard1_replica2] o.a.s.c.Config loaded config solrconfig.xml with version 0
    [junit4] 2> 1031711 INFO (qtp6816469-79270) [n:127.0.0.1:37446_solr c:testschemaapi s:shard1 x:testschemaapi_shard1_replica2] o.a.s.c.SolrConfig current version of requestparams : -1
    [junit4] 2> 1031711 INFO (qtp12607128-79282) [n:127.0.0.1:40002_solr c:testschemaapi s:shard1 x:testschemaapi_shard1_replica1] o.a.s.c.SolrConfig current version of requestparams : -1
    [junit4] 2> 1031722 INFO (qtp6816469-79270) [n:127.0.0.1:37446_solr c:testschemaapi s:shard1 x:testschemaapi_shard1_replica2] o.a.s.c.SolrConfig Using Lucene MatchVersion: 5.5.2
    [junit4] 2> 1031722 INFO (qtp12607128-79282) [n:127.0.0.1:40002_solr c:testschemaapi s:shard1 x:testschemaapi_shard1_replica1] o.a.s.c.SolrConfig Using Lucene MatchVersion: 5.5.2
    [junit4] 2> 1031759 INFO (qtp12607128-79282) [n:127.0.0.1:40002_solr c:testschemaapi s:shard1 x:testschemaapi_shard1_replica1] o.a.s.c.SolrConfig Loaded SolrConfig: solrconfig.xml
    [junit4] 2> 1031760 INFO (qtp6816469-79270) [n:127.0.0.1:37446_solr c:testschemaapi s:shard1 x:testschemaapi_shard1_replica2] o.a.s.c.SolrConfig Loaded SolrConfig: solrconfig.xml
    [junit4] 2> 1031763 INFO (qtp12607128-79282) [n:127.0.0.1:40002_solr c:testschemaapi s:shard1 x:testschemaapi_shard1_replica1] o.a.s.s.IndexSchema [testschemaapi_shard1_replica1] Schema name=minimal
    [junit4] 2> 1031763 INFO (qtp6816469-79270) [n:127.0.0.1:37446_solr c:testschemaapi s:shard1 x:testschemaapi_shard1_replica2] o.a.s.s.IndexSchema [testschemaapi_shard1_replica2] Schema name=minimal
    [junit4] 2> 1031772 INFO (qtp6816469-79270) [n:127.0.0.1:37446_solr c:testschemaapi s:shard1 x:testschemaapi_shard1_replica2] o.a.s.s.IndexSchema unique key field: id
    [junit4] 2> 1031772 INFO (qtp12607128-79282) [n:127.0.0.1:40002_solr c:testschemaapi s:shard1 x:testschemaapi_shard1_replica1] o.a.s.s.IndexSchema unique key field: id
    [junit4] 2> 1031773 INFO (qtp6816469-79270) [n:127.0.0.1:37446_solr c:testschemaapi s:shard1 x:testschemaapi_shard1_replica2] o.a.s.c.ConfigSetProperties Did not find ConfigSet properties, assuming default properties: Can't find resource 'configsetprops.json' in classpath or '/configs/conf1', cwd=/home/jenkins/workspace/Lucene-Solr-5.5-Linux/solr/build/solr-core/test/J2
    [junit4] 2> 1031773 INFO (qtp12607128-79282) [n:127.0.0.1:40002_solr c:testschemaapi s:shard1 x:testschemaapi_shard1_replica1] o.a.s.c.ConfigSetProperties Did not find ConfigSet properties, assuming default properties: Can't find resource 'configsetprops.json' in classpath or '/configs/conf1', cwd=/home/jenkins/workspace/Lucene-Solr-5.5-Linux/solr/build/solr-core/test/J2
    [junit4] 2> 1031773 INFO (qtp6816469-79270) [n:127.0.0.1:37446_solr c:testschemaapi s:shard1 x:testschemaapi_shard1_replica2] o.a.s.c.CoreContainer Creating SolrCore 'testschemaapi_shard1_replica2' using configuration from collection testschemaapi
    [junit4] 2> 1031773 INFO (qtp12607128-79282) [n:127.0.0.1:40002_solr c:testschemaapi s:shard1 x:testschemaapi_shard1_replica1] o.a.s.c.CoreContainer Creating SolrCore 'testschemaapi_shard1_replica1' using configuration from collection testschemaapi
    [junit4] 2> 1031773 INFO (qtp12607128-79282) [n:127.0.0.1:40002_solr c:testschemaapi s:shard1 r:core_node1 x:testschemaapi_shard1_replica1] o.a.s.c.SolrCore org.apache.solr.core.MockDirectoryFactory
    [junit4] 2> 1031773 INFO (qtp6816469-79270) [n:127.0.0.1:37446_solr c:testschemaapi s:shard1 r:core_node2 x:testschemaapi_shard1_replica2] o.a.s.c.SolrCore org.apache.solr.core.MockDirectoryFactory
    [junit4] 2> 1031774 INFO (qtp12607128-79282) [n:127.0.0.1:40002_solr c:testschemaapi s:shard1 r:core_node1 x:testschemaapi_shard1_replica1] o.a.s.c.SolrCore [[testschemaapi_shard1_replica1] ] Opening new SolrCore at [/home/jenkins/workspace/Lucene-Solr-5.5-Linux/solr/build/solr-core/test/J2/temp/solr.schema.TestManagedSchemaAPI_9B1CA7132C043EF0-001/tempDir-001/node2/testschemaapi_shard1_replica1], dataDir=[/home/jenkins/workspace/Lucene-Solr-5.5-Linux/solr/build/solr-core/test/J2/temp/solr.schema.TestManagedSchemaAPI_9B1CA7132C043EF0-001/tempDir-001/node2/./testschemaapi_shard1_replica1/data/]
    [junit4] 2> 1031774 INFO (qtp6816469-79270) [n:127.0.0.1:37446_solr c:testschemaapi s:shard1 r:core_node2 x:testschemaapi_shard1_replica2] o.a.s.c.SolrCore [[testschemaapi_shard1_replica2] ] Opening new SolrCore at [/home/jenkins/workspace/Lucene-Solr-5.5-Linux/solr/build/solr-core/test/J2/temp/solr.schema.TestManagedSchemaAPI_9B1CA7132C043EF0-001/tempDir-001/node1/testschemaapi_shard1_replica2], dataDir=[/home/jenkins/workspace/Lucene-Solr-5.5-Linux/solr/build/solr-core/test/J2/temp/solr.schema.TestManagedSchemaAPI_9B1CA7132C043EF0-001/tempDir-001/node1/./testschemaapi_shard1_replica2/data/]
    [junit4] 2> 1031774 INFO (qtp12607128-79282) [n:127.0.0.1:40002_solr c:testschemaapi s:shard1 r:core_node1 x:testschemaapi_shard1_replica1] o.a.s.c.SolrCore JMX monitoring not detected for core: testschemaapi_shard1_replica1
    [junit4] 2> 1031774 INFO (qtp6816469-79270) [n:127.0.0.1:37446_solr c:testschemaapi s:shard1 r:core_node2 x:testschemaapi_shard1_replica2] o.a.s.c.SolrCore JMX monitoring not detected for core: testschemaapi_shard1_replica2
    [junit4] 2> 1031774 INFO (qtp12607128-79282) [n:127.0.0.1:40002_solr c:testschemaapi s:shard1 r:core_node1 x:testschemaapi_shard1_replica1] o.a.s.c.CachingDirectoryFactory return new directory for /home/jenkins/workspace/Lucene-Solr-5.5-Linux/solr/build/solr-core/test/J2/temp/solr.schema.TestManagedSchemaAPI_9B1CA7132C043EF0-001/tempDir-001/node2/./testschemaapi_shard1_replica1/data
    [junit4] 2> 1031774 INFO (qtp12607128-79282) [n:127.0.0.1:40002_solr c:testschemaapi s:shard1 r:core_node1 x:testschemaapi_shard1_replica1] o.a.s.c.SolrCore New index directory detected: old=null new=/home/jenkins/workspace/Lucene-Solr-5.5-Linux/solr/build/solr-core/test/J2/temp/solr.schema.TestManagedSchemaAPI_9B1CA7132C043EF0-001/tempDir-001/node2/./testschemaapi_shard1_replica1/data/index/
    [junit4] 2> 1031774 INFO (qtp6816469-79270) [n:127.0.0.1:37446_solr c:testschemaapi s:shard1 r:core_node2 x:testschemaapi_shard1_replica2] o.a.s.c.CachingDirectoryFactory return new directory for /home/jenkins/workspace/Lucene-Solr-5.5-Linux/solr/build/solr-core/test/J2/temp/solr.schema.TestManagedSchemaAPI_9B1CA7132C043EF0-001/tempDir-001/node1/./testschemaapi_shard1_replica2/data
    [junit4] 2> 1031774 WARN (qtp12607128-79282) [n:127.0.0.1:40002_solr c:testschemaapi s:shard1 r:core_node1 x:testschemaapi_shard1_replica1] o.a.s.c.SolrCore [testschemaapi_shard1_replica1] Solr index directory '/home/jenkins/workspace/Lucene-Solr-5.5-Linux/solr/build/solr-core/test/J2/temp/solr.schema.TestManagedSchemaAPI_9B1CA7132C043EF0-001/tempDir-001/node2/./testschemaapi_shard1_replica1/data/index' doesn't exist. Creating new index...
    [junit4] 2> 1031775 INFO (qtp6816469-79270) [n:127.0.0.1:37446_solr c:testschemaapi s:shard1 r:core_node2 x:testschemaapi_shard1_replica2] o.a.s.c.SolrCore New index directory detected: old=null new=/home/jenkins/workspace/Lucene-Solr-5.5-Linux/solr/build/solr-core/test/J2/temp/solr.schema.TestManagedSchemaAPI_9B1CA7132C043EF0-001/tempDir-001/node1/./testschemaapi_shard1_replica2/data/index/
    [junit4] 2> 1031775 WARN (qtp6816469-79270) [n:127.0.0.1:37446_solr c:testschemaapi s:shard1 r:core_node2 x:testschemaapi_shard1_replica2] o.a.s.c.SolrCore [testschemaapi_shard1_replica2] Solr index directory '/home/jenkins/workspace/Lucene-Solr-5.5-Linux/solr/build/solr-core/test/J2/temp/solr.schema.TestManagedSchemaAPI_9B1CA7132C043EF0-001/tempDir-001/node1/./testschemaapi_shard1_replica2/data/index' doesn't exist. Creating new index...
    [junit4] 2> 1031775 INFO (qtp12607128-79282) [n:127.0.0.1:40002_solr c:testschemaapi s:shard1 r:core_node1 x:testschemaapi_shard1_replica1] o.a.s.c.CachingDirectoryFactory return new directory for /home/jenkins/workspace/Lucene-Solr-5.5-Linux/solr/build/solr-core/test/J2/temp/solr.schema.TestManagedSchemaAPI_9B1CA7132C043EF0-001/tempDir-001/node2/./testschemaapi_shard1_replica1/data/index
    [junit4] 2> 1031775 INFO (qtp6816469-79270) [n:127.0.0.1:37446_solr c:testschemaapi s:shard1 r:core_node2 x:testschemaapi_shard1_replica2] o.a.s.c.CachingDirectoryFactory return new directory for /home/jenkins/workspace/Lucene-Solr-5.5-Linux/solr/build/solr-core/test/J2/temp/solr.schema.TestManagedSchemaAPI_9B1CA7132C043EF0-001/tempDir-001/node1/./testschemaapi_shard1_replica2/data/index
    [junit4] 2> 1031776 INFO (qtp12607128-79282) [n:127.0.0.1:40002_solr c:testschemaapi s:shard1 r:core_node1 x:testschemaapi_shard1_replica1] o.a.s.c.SolrDeletionPolicy SolrDeletionPolicy.onCommit: commits: num=1
    [junit4] 2> commit{dir=MockDirectoryWrapper(RAMDirectory@1650807 lockFactory=org.apache.lucene.store.SingleInstanceLockFactory@1f2230e),segFN=segments_1,generation=1}
    [junit4] 2> 1031776 INFO (qtp12607128-79282) [n:127.0.0.1:40002_solr c:testschemaapi s:shard1 r:core_node1 x:testschemaapi_shard1_replica1] o.a.s.c.SolrDeletionPolicy newest commit generation = 1
    [junit4] 2> 1031776 INFO (qtp6816469-79270) [n:127.0.0.1:37446_solr c:testschemaapi s:shard1 r:core_node2 x:testschemaapi_shard1_replica2] o.a.s.c.SolrDeletionPolicy SolrDeletionPolicy.onCommit: commits: num=1
    [junit4] 2> commit{dir=MockDirectoryWrapper(RAMDirectory@1db86c6 lockFactory=org.apache.lucene.store.SingleInstanceLockFactory@16d614d),segFN=segments_1,generation=1}
    [junit4] 2> 1031776 INFO (qtp6816469-79270) [n:127.0.0.1:37446_solr c:testschemaapi s:shard1 r:core_node2 x:testschemaapi_shard1_replica2] o.a.s.c.SolrDeletionPolicy newest commit generation = 1
    [junit4] 2> 1031776 INFO (OldIndexDirectoryCleanupThreadForCore-testschemaapi_shard1_replica1) [n:127.0.0.1:40002_solr c:testschemaapi s:shard1 r:core_node1 x:testschemaapi_shard1_replica1] o.a.s.c.SolrCore Looking for old index directories to cleanup for core testschemaapi_shard1_replica1 in /home/jenkins/workspace/Lucene-Solr-5.5-Linux/solr/build/solr-core/test/J2/temp/solr.schema.TestManagedSchemaAPI_9B1CA7132C043EF0-001/tempDir-001/node2/./testschemaapi_shard1_replica1/data/
    [junit4] 2> 1031776 WARN (OldIndexDirectoryCleanupThreadForCore-testschemaapi_shard1_replica1) [n:127.0.0.1:40002_solr c:testschemaapi s:shard1 r:core_node1 x:testschemaapi_shard1_replica1] o.a.s.c.DirectoryFactory /home/jenkins/workspace/Lucene-Solr-5.5-Linux/solr/build/solr-core/test/J2/temp/solr.schema.TestManagedSchemaAPI_9B1CA7132C043EF0-001/tempDir-001/node2/./testschemaapi_shard1_replica1/data/ does not point to a valid data directory; skipping clean-up of old index directories.
    [junit4] 2> 1031776 INFO (OldIndexDirectoryCleanupThreadForCore-testschemaapi_shard1_replica2) [n:127.0.0.1:37446_solr c:testschemaapi s:shard1 r:core_node2 x:testschemaapi_shard1_replica2] o.a.s.c.SolrCore Looking for old index directories to cleanup for core testschemaapi_shard1_replica2 in /home/jenkins/workspace/Lucene-Solr-5.5-Linux/solr/build/solr-core/test/J2/temp/solr.schema.TestManagedSchemaAPI_9B1CA7132C043EF0-001/tempDir-001/node1/./testschemaapi_shard1_replica2/data/
    [junit4] 2> 1031776 WARN (OldIndexDirectoryCleanupThreadForCore-testschemaapi_shard1_replica2) [n:127.0.0.1:37446_solr c:testschemaapi s:shard1 r:core_node2 x:testschemaapi_shard1_replica2] o.a.s.c.DirectoryFactory /home/jenkins/workspace/Lucene-Solr-5.5-Linux/solr/build/solr-core/test/J2/temp/solr.schema.TestManagedSchemaAPI_9B1CA7132C043EF0-001/tempDir-001/node1/./testschemaapi_shard1_replica2/data/ does not point to a valid data directory; skipping clean-up of old index directories.
    [junit4] 2> 1031777 INFO (qtp12607128-79282) [n:127.0.0.1:40002_solr c:testschemaapi s:shard1 r:core_node1 x:testschemaapi_shard1_replica1] o.a.s.c.SolrCore no updateRequestProcessorChain defined as default, creating implicit default
    [junit4] 2> 1031777 INFO (qtp6816469-79270) [n:127.0.0.1:37446_solr c:testschemaapi s:shard1 r:core_node2 x:testschemaapi_shard1_replica2] o.a.s.c.SolrCore no updateRequestProcessorChain defined as default, creating implicit default
    [junit4] 2> 1031779 INFO (qtp6816469-79270) [n:127.0.0.1:37446_solr c:testschemaapi s:shard1 r:core_node2 x:testschemaapi_shard1_replica2] o.a.s.h.l.XMLLoader xsltCacheLifetimeSeconds=60
    [junit4] 2> 1031779 INFO (qtp12607128-79282) [n:127.0.0.1:40002_solr c:testschemaapi s:shard1 r:core_node1 x:testschemaapi_shard1_replica1] o.a.s.h.l.XMLLoader xsltCacheLifetimeSeconds=60
    [junit4] 2> 1031780 INFO (qtp6816469-79270) [n:127.0.0.1:37446_solr c:testschemaapi s:shard1 r:core_node2 x:testschemaapi_shard1_replica2] o.a.s.h.l.XMLLoader xsltCacheLifetimeSeconds=60
    [junit4] 2> 1031780 INFO (qtp12607128-79282) [n:127.0.0.1:40002_solr c:testschemaapi s:shard1 r:core_node1 x:testschemaapi_shard1_replica1] o.a.s.h.l.XMLLoader xsltCacheLifetimeSeconds=60
    [junit4] 2> 1031781 INFO (qtp6816469-79270) [n:127.0.0.1:37446_solr c:testschemaapi s:shard1 r:core_node2 x:testschemaapi_shard1_replica2] o.a.s.h.l.XMLLoader xsltCacheLifetimeSeconds=60
    [junit4] 2> 1031781 INFO (qtp12607128-79282) [n:127.0.0.1:40002_solr c:testschemaapi s:shard1 r:core_node1 x:testschemaapi_shard1_replica1] o.a.s.h.l.XMLLoader xsltCacheLifetimeSeconds=60
    [junit4] 2> 1031782 INFO (qtp6816469-79270) [n:127.0.0.1:37446_solr c:testschemaapi s:shard1 r:core_node2 x:testschemaapi_shard1_replica2] o.a.s.h.l.XMLLoader xsltCacheLifetimeSeconds=60
    [junit4] 2> 1031782 INFO (qtp12607128-79282) [n:127.0.0.1:40002_solr c:testschemaapi s:shard1 r:core_node1 x:testschemaapi_shard1_replica1] o.a.s.h.l.XMLLoader xsltCacheLifetimeSeconds=60
    [junit4] 2> 1031783 INFO (qtp6816469-79270) [n:127.0.0.1:37446_solr c:testschemaapi s:shard1 r:core_node2 x:testschemaapi_shard1_replica2] o.a.s.c.RequestHandlers Registered paths: /replication,/update/json/docs,/select,/admin/file,/admin/properties,/admin/mbeans,/admin/threads,/schema,/update/csv,/admin/luke,/admin/logging,/update/json,/admin/segments,/get,/admin/ping,/config,/admin/system,/admin/plugins,/update
    [junit4] 2> 1031783 INFO (qtp12607128-79282) [n:127.0.0.1:40002_solr c:testschemaapi s:shard1 r:core_node1 x:testschemaapi_shard1_replica1] o.a.s.c.RequestHandlers Registered paths: /replication,/update/json/docs,/select,/admin/file,/admin/properties,/admin/mbeans,/admin/threads,/schema,/update/csv,/admin/luke,/admin/logging,/update/json,/admin/segments,/get,/admin/ping,/config,/admin/system,/admin/plugins,/update
    [junit4] 2> 1031784 INFO (qtp6816469-79270) [n:127.0.0.1:37446_solr c:testschemaapi s:shard1 r:core_node2 x:testschemaapi_shard1_replica2] o.a.s.c.SolrCore Using default statsCache cache: org.apache.solr.search.stats.LocalStatsCache
    [junit4] 2> 1031784 INFO (qtp12607128-79282) [n:127.0.0.1:40002_solr c:testschemaapi s:shard1 r:core_node1 x:testschemaapi_shard1_replica1] o.a.s.c.SolrCore Using default statsCache cache: org.apache.solr.search.stats.LocalStatsCache
    [junit4] 2> 1031784 INFO (qtp6816469-79270) [n:127.0.0.1:37446_solr c:testschemaapi s:shard1 r:core_node2 x:testschemaapi_shard1_replica2] o.a.s.u.UpdateHandler Using UpdateLog implementation: org.apache.solr.update.UpdateLog
    [junit4] 2> 1031784 INFO (qtp6816469-79270) [n:127.0.0.1:37446_solr c:testschemaapi s:shard1 r:core_node2 x:testschemaapi_shard1_replica2] o.a.s.u.UpdateLog Initializing UpdateLog: dataDir=null defaultSyncLevel=FLUSH numRecordsToKeep=100 maxNumLogsToKeep=10 numVersionBuckets=65536
    [junit4] 2> 1031784 INFO (qtp12607128-79282) [n:127.0.0.1:40002_solr c:testschemaapi s:shard1 r:core_node1 x:testschemaapi_shard1_replica1] o.a.s.u.UpdateHandler Using UpdateLog implementation: org.apache.solr.update.UpdateLog
    [junit4] 2> 1031784 INFO (qtp12607128-79282) [n:127.0.0.1:40002_solr c:testschemaapi s:shard1 r:core_node1 x:testschemaapi_shard1_replica1] o.a.s.u.UpdateLog Initializing UpdateLog: dataDir=null defaultSyncLevel=FLUSH numRecordsToKeep=100 maxNumLogsToKeep=10 numVersionBuckets=65536
    [junit4] 2> 1031785 INFO (qtp6816469-79270) [n:127.0.0.1:37446_solr c:testschemaapi s:shard1 r:core_node2 x:testschemaapi_shard1_replica2] o.a.s.u.CommitTracker Hard AutoCommit: disabled
    [junit4] 2> 1031785 INFO (qtp6816469-79270) [n:127.0.0.1:37446_solr c:testschemaapi s:shard1 r:core_node2 x:testschemaapi_shard1_replica2] o.a.s.u.CommitTracker Soft AutoCommit: disabled
    [junit4] 2> 1031785 INFO (qtp12607128-79282) [n:127.0.0.1:40002_solr c:testschemaapi s:shard1 r:core_node1 x:testschemaapi_shard1_replica1] o.a.s.u.CommitTracker Hard AutoCommit: disabled
    [junit4] 2> 1031785 INFO (qtp12607128-79282) [n:127.0.0.1:40002_solr c:testschemaapi s:shard1 r:core_node1 x:testschemaapi_shard1_replica1] o.a.s.u.CommitTracker Soft AutoCommit: disabled
    [junit4] 2> 1031786 INFO (qtp6816469-79270) [n:127.0.0.1:37446_solr c:testschemaapi s:shard1 r:core_node2 x:testschemaapi_shard1_replica2] o.a.s.c.SolrDeletionPolicy SolrDeletionPolicy.onInit: commits: num=1
    [junit4] 2> commit{dir=MockDirectoryWrapper(RAMDirectory@1db86c6 lockFactory=org.apache.lucene.store.SingleInstanceLockFactory@16d614d),segFN=segments_1,generation=1}
    [junit4] 2> 1031786 INFO (qtp6816469-79270) [n:127.0.0.1:37446_solr c:testschemaapi s:shard1 r:core_node2 x:testschemaapi_shard1_replica2] o.a.s.c.SolrDeletionPolicy newest commit generation = 1
    [junit4] 2> 1031786 INFO (qtp12607128-79282) [n:127.0.0.1:40002_solr c:testschemaapi s:shard1 r:core_node1 x:testschemaapi_shard1_replica1] o.a.s.c.SolrDeletionPolicy SolrDeletionPolicy.onInit: commits: num=1
    [junit4] 2> commit{dir=MockDirectoryWrapper(RAMDirectory@1650807 lockFactory=org.apache.lucene.store.SingleInstanceLockFactory@1f2230e),segFN=segments_1,generation=1}
    [junit4] 2> 1031786 INFO (qtp12607128-79282) [n:127.0.0.1:40002_solr c:testschemaapi s:shard1 r:core_node1 x:testschemaapi_shard1_replica1] o.a.s.c.SolrDeletionPolicy newest commit generation = 1
    [junit4] 2> 1031786 INFO (qtp6816469-79270) [n:127.0.0.1:37446_solr c:testschemaapi s:shard1 r:core_node2 x:testschemaapi_shard1_replica2] o.a.s.s.SolrIndexSearcher Opening Searcher@c17a62[testschemaapi_shard1_replica2] main
    [junit4] 2> 1031786 INFO (qtp12607128-79282) [n:127.0.0.1:40002_solr c:testschemaapi s:shard1 r:core_node1 x:testschemaapi_shard1_replica1] o.a.s.s.SolrIndexSearcher Opening Searcher@6a8f37[testschemaapi_shard1_replica1] main
    [junit4] 2> 1031786 INFO (qtp6816469-79270) [n:127.0.0.1:37446_solr c:testschemaapi s:shard1 r:core_node2 x:testschemaapi_shard1_replica2] o.a.s.c.c.ZkStateReader Load collection config from: [/collections/testschemaapi]
    [junit4] 2> 1031786 INFO (qtp12607128-79282) [n:127.0.0.1:40002_solr c:testschemaapi s:shard1 r:core_node1 x:testschemaapi_shard1_replica1] o.a.s.c.c.ZkStateReader Load collection config from: [/collections/testschemaapi]
    [junit4] 2> 1031786 INFO (qtp6816469-79270) [n:127.0.0.1:37446_solr c:testschemaapi s:shard1 r:core_node2 x:testschemaapi_shard1_replica2] o.a.s.c.c.ZkStateReader path=[/collections/testschemaapi] [configName]=[conf1] specified config exists in ZooKeeper
    [junit4] 2> 1031786 INFO (qtp12607128-79282) [n:127.0.0.1:40002_solr c:testschemaapi s:shard1 r:core_node1 x:testschemaapi_shard1_replica1] o.a.s.c.c.ZkStateReader path=[/collections/testschemaapi] [configName]=[conf1] specified config exists in ZooKeeper
    [junit4] 2> 1031786 INFO (qtp6816469-79270) [n:127.0.0.1:37446_solr c:testschemaapi s:shard1 r:core_node2 x:testschemaapi_shard1_replica2] o.a.s.r.ManagedResourceStorage Setting up ZooKeeper-based storage for the RestManager with znodeBase: /configs/conf1
    [junit4] 2> 1031786 INFO (qtp12607128-79282) [n:127.0.0.1:40002_solr c:testschemaapi s:shard1 r:core_node1 x:testschemaapi_shard1_replica1] o.a.s.r.ManagedResourceStorage Setting up ZooKeeper-based storage for the RestManager with znodeBase: /configs/conf1
    [junit4] 2> 1031787 INFO (qtp6816469-79270) [n:127.0.0.1:37446_solr c:testschemaapi s:shard1 r:core_node2 x:testschemaapi_shard1_replica2] o.a.s.r.ManagedResourceStorage Configured ZooKeeperStorageIO with znodeBase: /configs/conf1
    [junit4] 2> 1031787 INFO (qtp12607128-79282) [n:127.0.0.1:40002_solr c:testschemaapi s:shard1 r:core_node1 x:testschemaapi_shard1_replica1] o.a.s.r.ManagedResourceStorage Configured ZooKeeperStorageIO with znodeBase: /configs/conf1
    [junit4] 2> 1031787 INFO (qtp6816469-79270) [n:127.0.0.1:37446_solr c:testschemaapi s:shard1 r:core_node2 x:testschemaapi_shard1_replica2] o.a.s.r.RestManager Initializing RestManager with initArgs: {}
    [junit4] 2> 1031787 INFO (qtp12607128-79282) [n:127.0.0.1:40002_solr c:testschemaapi s:shard1 r:core_node1 x:testschemaapi_shard1_replica1] o.a.s.r.RestManager Initializing RestManager with initArgs: {}
    [junit4] 2> 1031787 INFO (qtp6816469-79270) [n:127.0.0.1:37446_solr c:testschemaapi s:shard1 r:core_node2 x:testschemaapi_shard1_replica2] o.a.s.r.ManagedResourceStorage Reading _rest_managed.json using ZooKeeperStorageIO:path=/configs/conf1
    [junit4] 2> 1031787 INFO (qtp12607128-79282) [n:127.0.0.1:40002_solr c:testschemaapi s:shard1 r:core_node1 x:testschemaapi_shard1_replica1] o.a.s.r.ManagedResourceStorage Reading _rest_managed.json using ZooKeeperStorageIO:path=/configs/conf1
    [junit4] 2> 1031787 INFO (qtp6816469-79270) [n:127.0.0.1:37446_solr c:testschemaapi s:shard1 r:core_node2 x:testschemaapi_shard1_replica2] o.a.s.r.ManagedResourceStorage No data found for znode /configs/conf1/_rest_managed.json
    [junit4] 2> 1031787 INFO (qtp12607128-79282) [n:127.0.0.1:40002_solr c:testschemaapi s:shard1 r:core_node1 x:testschemaapi_shard1_replica1] o.a.s.r.ManagedResourceStorage No data found for znode /configs/conf1/_rest_managed.json
    [junit4] 2> 1031787 INFO (qtp6816469-79270) [n:127.0.0.1:37446_solr c:testschemaapi s:shard1 r:core_node2 x:testschemaapi_shard1_replica2] o.a.s.r.ManagedResourceStorage Loaded null at path _rest_managed.json using ZooKeeperStorageIO:path=/configs/conf1
    [junit4] 2> 1031787 INFO (qtp12607128-79282) [n:127.0.0.1:40002_solr c:testschemaapi s:shard1 r:core_node1 x:testschemaapi_shard1_replica1] o.a.s.r.ManagedResourceStorage Loaded null at path _rest_managed.json using ZooKeeperStorageIO:path=/configs/conf1
    [junit4] 2> 1031787 INFO (qtp6816469-79270) [n:127.0.0.1:37446_solr c:testschemaapi s:shard1 r:core_node2 x:testschemaapi_shard1_replica2] o.a.s.r.RestManager Initializing 0 registered ManagedResources
    [junit4] 2> 1031787 INFO (qtp12607128-79282) [n:127.0.0.1:40002_solr c:testschemaapi s:shard1 r:core_node1 x:testschemaapi_shard1_replica1] o.a.s.r.RestManager Initializing 0 registered ManagedResources
    [junit4] 2> 1031789 INFO (qtp12607128-79282) [n:127.0.0.1:40002_solr c:testschemaapi s:shard1 r:core_node1 x:testschemaapi_shard1_replica1] o.a.s.s.ZkIndexSchemaReader Creating ZooKeeper watch for the managed schema at /configs/conf1/managed-schema
    [junit4] 2> 1031789 INFO (qtp6816469-79270) [n:127.0.0.1:37446_solr c:testschemaapi s:shard1 r:core_node2 x:testschemaapi_shard1_replica2] o.a.s.s.ZkIndexSchemaReader Creating ZooKeeper watch for the managed schema at /configs/conf1/managed-schema
    [junit4] 2> 1031790 INFO (qtp6816469-79270) [n:127.0.0.1:37446_solr c:testschemaapi s:shard1 r:core_node2 x:testschemaapi_shard1_replica2] o.a.s.c.ZkController Added new OnReconnect listener ZkIndexSchemaReader: /configs/conf1/managed-schema, uniqueCoreId: testschemaapi_shard1_replica2:430633044634087
    [junit4] 2> 1031790 INFO (qtp12607128-79282) [n:127.0.0.1:40002_solr c:testschemaapi s:shard1 r:core_node1 x:testschemaapi_shard1_replica1] o.a.s.c.ZkController Added new OnReconnect listener ZkIndexSchemaReader: /configs/conf1/managed-schema, uniqueCoreId: testschemaapi_shard1_replica1:430633044667519
    [junit4] 2> 1031790 INFO (qtp6816469-79270) [n:127.0.0.1:37446_solr c:testschemaapi s:shard1 r:core_node2 x:testschemaapi_shard1_replica2] o.a.s.h.ReplicationHandler Commits will be reserved for 10000
    [junit4] 2> 1031790 INFO (qtp12607128-79282) [n:127.0.0.1:40002_solr c:testschemaapi s:shard1 r:core_node1 x:testschemaapi_shard1_replica1] o.a.s.h.ReplicationHandler Commits will be reserved for 10000
    [junit4] 2> 1031790 INFO (searcherExecutor-6622-thread-1-processing-x:testschemaapi_shard1_replica2 c:testschemaapi s:shard1 r:core_node2 n:127.0.0.1:37446_solr) [n:127.0.0.1:37446_solr c:testschemaapi s:shard1 r:core_node2 x:testschemaapi_shard1_replica2] o.a.s.c.SolrCore [testschemaapi_shard1_replica2] Registered new searcher Searcher@c17a62[testschemaapi_shard1_replica2] main{ExitableDirectoryReader(UninvertingDirectoryReader())}
    [junit4] 2> 1031790 INFO (searcherExecutor-6623-thread-1-processing-x:testschemaapi_shard1_replica1 c:testschemaapi r:core_node1 s:shard1 n:127.0.0.1:40002_solr) [n:127.0.0.1:40002_solr c:testschemaapi s:shard1 r:core_node1 x:testschemaapi_shard1_replica1] o.a.s.c.SolrCore [testschemaapi_shard1_replica1] Registered new searcher Searcher@6a8f37[testschemaapi_shard1_replica1] main{ExitableDirectoryReader(UninvertingDirectoryReader())}
    [junit4] 2> 1031790 INFO (qtp6816469-79270) [n:127.0.0.1:37446_solr c:testschemaapi s:shard1 r:core_node2 x:testschemaapi_shard1_replica2] o.a.s.u.UpdateLog Looking up max value of version field to seed version buckets
    [junit4] 2> 1031790 INFO (qtp12607128-79282) [n:127.0.0.1:40002_solr c:testschemaapi s:shard1 r:core_node1 x:testschemaapi_shard1_replica1] o.a.s.u.UpdateLog Looking up max value of version field to seed version buckets
    [junit4] 2> 1031790 INFO (qtp6816469-79270) [n:127.0.0.1:37446_solr c:testschemaapi s:shard1 r:core_node2 x:testschemaapi_shard1_replica2] o.a.s.u.VersionInfo Refreshing highest value of _version_ for 65536 version buckets from index
    [junit4] 2> 1031790 INFO (qtp12607128-79282) [n:127.0.0.1:40002_solr c:testschemaapi s:shard1 r:core_node1 x:testschemaapi_shard1_replica1] o.a.s.u.VersionInfo Refreshing highest value of _version_ for 65536 version buckets from index
    [junit4] 2> 1031790 INFO (qtp6816469-79270) [n:127.0.0.1:37446_solr c:testschemaapi s:shard1 r:core_node2 x:testschemaapi_shard1_replica2] o.a.s.u.VersionInfo No terms found for _version_, cannot seed version bucket highest value from index
    [junit4] 2> 1031791 INFO (qtp12607128-79282) [n:127.0.0.1:40002_solr c:testschemaapi s:shard1 r:core_node1 x:testschemaapi_shard1_replica1] o.a.s.u.VersionInfo No terms found for _version_, cannot seed version bucket highest value from index
    [junit4] 2> 1031791 INFO (qtp6816469-79270) [n:127.0.0.1:37446_solr c:testschemaapi s:shard1 r:core_node2 x:testschemaapi_shard1_replica2] o.a.s.u.UpdateLog Could not find max version in index or recent updates, using new clock 1537420968616525824
    [junit4] 2> 1031791 INFO (qtp12607128-79282) [n:127.0.0.1:40002_solr c:testschemaapi s:shard1 r:core_node1 x:testschemaapi_shard1_replica1] o.a.s.u.UpdateLog Could not find max version in index or recent updates, using new clock 1537420968616525824
    [junit4] 2> 1031792 INFO (qtp6816469-79270) [n:127.0.0.1:37446_solr c:testschemaapi s:shard1 r:core_node2 x:testschemaapi_shard1_replica2] o.a.s.u.UpdateLog Took 1.0ms to seed version buckets with highest version 1537420968616525824
    [junit4] 2> 1031792 INFO (qtp12607128-79282) [n:127.0.0.1:40002_solr c:testschemaapi s:shard1 r:core_node1 x:testschemaapi_shard1_replica1] o.a.s.u.UpdateLog Took 1.0ms to seed version buckets with highest version 1537420968616525824
    [junit4] 2> 1031792 INFO (qtp6816469-79270) [n:127.0.0.1:37446_solr c:testschemaapi s:shard1 r:core_node2 x:testschemaapi_shard1_replica2] o.a.s.c.ZkController watch zkdir /configs/conf1
    [junit4] 2> 1031792 INFO (qtp12607128-79282) [n:127.0.0.1:40002_solr c:testschemaapi s:shard1 r:core_node1 x:testschemaapi_shard1_replica1] o.a.s.c.ZkController watch zkdir /configs/conf1
    [junit4] 2> 1031793 INFO (qtp6816469-79270) [n:127.0.0.1:37446_solr c:testschemaapi s:shard1 r:core_node2 x:testschemaapi_shard1_replica2] o.a.s.c.CoreContainer registering core: testschemaapi_shard1_replica2
    [junit4] 2> 1031793 INFO (qtp12607128-79282) [n:127.0.0.1:40002_solr c:testschemaapi s:shard1 r:core_node1 x:testschemaapi_shard1_replica1] o.a.s.c.CoreContainer registering core: testschemaapi_shard1_replica1
    [junit4] 2> 1031793 INFO (qtp6816469-79270) [n:127.0.0.1:37446_solr c:testschemaapi s:shard1 r:core_node2 x:testschemaapi_shard1_replica2] o.a.s.c.ZkController Register replica - core:testschemaapi_shard1_replica2 address:http://127.0.0.1:37446/solr collection:testschemaapi shard:shard1
    [junit4] 2> 1031793 INFO (qtp12607128-79282) [n:127.0.0.1:40002_solr c:testschemaapi s:shard1 r:core_node1 x:testschemaapi_shard1_replica1] o.a.s.c.ZkController Register replica - core:testschemaapi_shard1_replica1 address:http://127.0.0.1:40002/solr collection:testschemaapi shard:shard1
    [junit4] 2> 1031793 INFO (qtp12607128-79282) [n:127.0.0.1:40002_solr c:testschemaapi s:shard1 r:core_node1 x:testschemaapi_shard1_replica1] o.a.s.c.c.SolrZkClient makePath: /collections/testschemaapi/leader_elect/shard1/election
    [junit4] 2> 1031793 INFO (qtp6816469-79270) [n:127.0.0.1:37446_solr c:testschemaapi s:shard1 r:core_node2 x:testschemaapi_shard1_replica2] o.a.s.c.c.SolrZkClient makePath: /collections/testschemaapi/leader_elect/shard1/election
    [junit4] 2> 1031795 INFO (qtp6816469-79270) [n:127.0.0.1:37446_solr c:testschemaapi s:shard1 r:core_node2 x:testschemaapi_shard1_replica2] o.a.s.c.LeaderElector Joined leadership election with path: /collections/testschemaapi/leader_elect/shard1/election/96088810448355333-core_node2-n_0000000000
    [junit4] 2> 1031795 INFO (qtp12607128-79282) [n:127.0.0.1:40002_solr c:testschemaapi s:shard1 r:core_node1 x:testschemaapi_shard1_replica1] o.a.s.c.LeaderElector Joined leadership election with path: /collections/testschemaapi/leader_elect/shard1/election/96088810448355334-core_node1-n_0000000001
    [junit4] 2> 1031795 INFO (qtp6816469-79270) [n:127.0.0.1:37446_solr c:testschemaapi s:shard1 r:core_node2 x:testschemaapi_shard1_replica2] o.a.s.c.ShardLeaderElectionContext Running the leader process for shard=shard1 and weAreReplacement=false and leaderVoteWait=10000
    [junit4] 2> 1031795 INFO (qtp12607128-79282) [n:127.0.0.1:40002_solr c:testschemaapi s:shard1 r:core_node1 x:testschemaapi_shard1_replica1] o.a.s.c.LeaderElector Watching path /collections/testschemaapi/leader_elect/shard1/election/96088810448355333-core_node2-n_0000000000 to know if I could be the leader
    [junit4] 2> 1031796 INFO (qtp6816469-79270) [n:127.0.0.1:37446_solr c:testschemaapi s:shard1 r:core_node2 x:testschemaapi_shard1_replica2] o.a.s.c.ShardLeaderElectionContext Enough replicas found to continue.
    [junit4] 2> 1031796 INFO (qtp6816469-79270) [n:127.0.0.1:37446_solr c:testschemaapi s:shard1 r:core_node2 x:testschemaapi_shard1_replica2] o.a.s.c.ShardLeaderElectionContext I may be the new leader - try and sync
    [junit4] 2> 1031796 INFO (qtp6816469-79270) [n:127.0.0.1:37446_solr c:testschemaapi s:shard1 r:core_node2 x:testschemaapi_shard1_replica2] o.a.s.c.SyncStrategy Sync replicas to http://127.0.0.1:37446/solr/testschemaapi_shard1_replica2/
    [junit4] 2> 1031796 INFO (OverseerStateUpdate-96088810448355334-127.0.0.1:40002_solr-n_0000000000) [n:127.0.0.1:40002_solr ] o.a.s.c.Overseer processMessage: queueSize: 1, message = {
    [junit4] 2> "operation":"leader",
    [junit4] 2> "shard":"shard1",
    [junit4] 2> "collection":"testschemaapi"} current state version: 0
    [junit4] 2> 1031796 INFO (qtp6816469-79270) [n:127.0.0.1:37446_solr c:testschemaapi s:shard1 r:core_node2 x:testschemaapi_shard1_replica2] o.a.s.u.PeerSync PeerSync: core=testschemaapi_shard1_replica2 url=http://127.0.0.1:37446/solr START replicas=[http://127.0.0.1:40002/solr/testschemaapi_shard1_replica1/] nUpdates=100
    [junit4] 2> 1031796 INFO (qtp6816469-79270) [n:127.0.0.1:37446_solr c:testschemaapi s:shard1 r:core_node2 x:testschemaapi_shard1_replica2] o.a.s.u.PeerSync PeerSync: core=testschemaapi_shard1_replica2 url=http://127.0.0.1:37446/solr DONE. We have no versions. sync failed.
    [junit4] 2> 1031796 INFO (qtp6816469-79270) [n:127.0.0.1:37446_solr c:testschemaapi s:shard1 r:core_node2 x:testschemaapi_shard1_replica2] o.a.s.c.SyncStrategy Leader's attempt to sync with shard failed, moving to the next candidate
    [junit4] 2> 1031796 INFO (qtp6816469-79270) [n:127.0.0.1:37446_solr c:testschemaapi s:shard1 r:core_node2 x:testschemaapi_shard1_replica2] o.a.s.c.ShardLeaderElectionContext We failed sync, but we have no versions - we can't sync in that case - we were active before, so become leader anyway
    [junit4] 2> 1031797 INFO (qtp6816469-79270) [n:127.0.0.1:37446_solr c:testschemaapi s:shard1 r:core_node2 x:testschemaapi_shard1_replica2] o.a.s.c.c.SolrZkClient makePath: /collections/testschemaapi/leaders/shard1
    [junit4] 2> 1031797 INFO (qtp12607128-79283) [n:127.0.0.1:40002_solr c:testschemaapi s:shard1 r:core_node1 x:testschemaapi_shard1_replica1] o.a.s.c.S.Request [testschemaapi_shard1_replica1] webapp=/solr path=/get params={fingerprint=false&distrib=false&qt=/get&getVersions=100&version=2&wt=javabin} status=0 QTime=0
    [junit4] 2> 1031798 INFO (qtp6816469-79270) [n:127.0.0.1:37446_solr c:testschemaapi s:shard1 r:core_node2 x:testschemaapi_shard1_replica2] o.a.s.c.ShardLeaderElectionContextBase Creating leader registration node /collections/testschemaapi/leaders/shard1/leader after winning as /collections/testschemaapi/leader_elect/shard1/election/96088810448355333-core_node2-n_0000000000
    [junit4] 2> 1031799 INFO (qtp6816469-79270) [n:127.0.0.1:37446_solr c:testschemaapi s:shard1 r:core_node2 x:testschemaapi_shard1_replica2] o.a.s.c.ShardLeaderElectionContext I am the new leader: http://127.0.0.1:37446/solr/testschemaapi_shard1_replica2/ shard1
    [junit4] 2> 1031799 INFO (OverseerStateUpdate-96088810448355334-127.0.0.1:40002_solr-n_0000000000) [n:127.0.0.1:40002_solr ] o.a.s.c.Overseer processMessage: queueSize: 1, message = {
    [junit4] 2> "operation":"leader",
    [junit4] 2> "shard":"shard1",
    [junit4] 2> "collection":"testschemaapi",
    [junit4] 2> "base_url":"http://127.0.0.1:37446/solr",
    [junit4] 2> "core":"testschemaapi_shard1_replica2",
    [junit4] 2> "state":"active"} current state version: 0
    [junit4] 2> 1031900 INFO (OverseerStateUpdate-96088810448355334-127.0.0.1:40002_solr-n_0000000000) [n:127.0.0.1:40002_solr ] o.a.s.c.o.ZkStateWriter going to update_collection /collections/testschemaapi/state.json version: 1
    [junit4] 2> 1031900 INFO (zkCallback-21004-thread-1-processing-n:127.0.0.1:40002_solr) [n:127.0.0.1:40002_solr ] o.a.s.c.c.ZkStateReader A cluster state change: [WatchedEvent state:SyncConnected type:NodeDataChanged path:/collections/testschemaapi/state.json] for collection [testschemaapi] has occurred - updating... (live nodes size: [2])
    [junit4] 2> 1031900 INFO (zkCallback-21003-thread-1-processing-n:127.0.0.1:37446_solr) [n:127.0.0.1:37446_solr ] o.a.s.c.c.ZkStateReader A cluster state change: [WatchedEvent state:SyncConnected type:NodeDataChanged path:/collections/testschemaapi/state.json] for collection [testschemaapi] has occurred - updating... (live nodes size: [2])
    [junit4] 2> 1031901 INFO (zkCallback-21004-thread-1-processing-n:127.0.0.1:40002_solr) [n:127.0.0.1:40002_solr ] o.a.s.c.c.ZkStateReader Updating data for [testschemaapi] from [1] to [2]
    [junit4] 2> 1031901 INFO (zkCallback-21003-thread-1-processing-n:127.0.0.1:37446_solr) [n:127.0.0.1:37446_solr ] o.a.s.c.c.ZkStateReader Updating data for [testschemaapi] from [1] to [2]
    [junit4] 2> 1031949 INFO (qtp6816469-79270) [n:127.0.0.1:37446_solr c:testschemaapi s:shard1 r:core_node2 x:testschemaapi_shard1_replica2] o.a.s.c.ZkController We are http://127.0.0.1:37446/solr/testschemaapi_shard1_replica2/ and leader is http://127.0.0.1:37446/solr/testschemaapi_shard1_replica2/
    [junit4] 2> 1031949 INFO (qtp6816469-79270) [n:127.0.0.1:37446_solr c:testschemaapi s:shard1 r:core_node2 x:testschemaapi_shard1_replica2] o.a.s.c.ZkController No LogReplay needed for core=testschemaapi_shard1_replica2 baseURL=http://127.0.0.1:37446/solr
    [junit4] 2> 1031949 INFO (qtp6816469-79270) [n:127.0.0.1:37446_solr c:testschemaapi s:shard1 r:core_node2 x:testschemaapi_shard1_replica2] o.a.s.c.ZkController I am the leader, no recovery necessary
    [junit4] 2> 1031949 INFO (qtp6816469-79270) [n:127.0.0.1:37446_solr c:testschemaapi s:shard1 r:core_node2 x:testschemaapi_shard1_replica2] o.a.s.c.ZkController publishing state=active
    [junit4] 2> 1031950 INFO (OverseerStateUpdate-96088810448355334-127.0.0.1:40002_solr-n_0000000000) [n:127.0.0.1:40002_solr ] o.a.s.c.Overseer processMessage: queueSize: 1, message = {
    [junit4] 2> "roles":null,
    [junit4] 2> "core":"testschemaapi_shard1_replica2",
    [junit4] 2> "numShards":"1",
    [junit4] 2> "collection":"testschemaapi",
    [junit4] 2> "shard":"shard1",
    [junit4] 2> "core_node_name":"core_node2",
    [junit4] 2> "node_name":"127.0.0.1:37446_solr",
    [junit4] 2> "state":"active",
    [junit4] 2> "operation":"state",
    [junit4] 2> "base_url":"http://127.0.0.1:37446/solr"} current state version: 0
    [junit4] 2> 1031951 INFO (OverseerStateUpdate-96088810448355334-127.0.0.1:40002_solr-n_0000000000) [n:127.0.0.1:40002_solr ] o.a.s.c.o.ReplicaMutator Update state numShards=1 message={
    [junit4] 2> "roles":null,
    [junit4] 2> "core":"testschemaapi_shard1_replica2",
    [junit4] 2> "numShards":"1",
    [junit4] 2> "collection":"testschemaapi",
    [junit4] 2> "shard":"shard1",
    [junit4] 2> "core_node_name":"core_node2",
    [junit4] 2> "node_name":"127.0.0.1:37446_solr",
    [junit4] 2> "state":"active",
    [junit4] 2> "operation":"state",
    [junit4] 2> "base_url":"http://127.0.0.1:37446/solr"}
    [junit4] 2> 1031951 INFO (qtp6816469-79270) [n:127.0.0.1:37446_solr c:testschemaapi s:shard1 r:core_node2 x:testschemaapi_shard1_replica2] o.a.s.s.HttpSolrCall [admin] webapp=null path=/admin/cores params={numShards=1&collection.configName=conf1&collection=testschemaapi&qt=/admin/cores&name=testschemaapi_shard1_replica2&action=CREATE&shard=shard1&version=2&wt=javabin} status=0 QTime=1247
    [junit4] 2> 1032052 INFO (OverseerStateUpdate-96088810448355334-127.0.0.1:40002_solr-n_0000000000) [n:127.0.0.1:40002_solr ] o.a.s.c.o.ZkStateWriter going to update_collection /collections/testschemaapi/state.json version: 2
    [junit4] 2> 1032053 INFO (zkCallback-21004-thread-2-processing-n:127.0.0.1:40002_solr) [n:127.0.0.1:40002_solr ] o.a.s.c.c.ZkStateReader A cluster state change: [WatchedEvent state:SyncConnected type:NodeDataChanged path:/collections/testschemaapi/state.json] for collection [testschemaapi] has occurred - updating... (live nodes size: [2])
    [junit4] 2> 1032053 INFO (zkCallback-21003-thread-1-processing-n:127.0.0.1:37446_solr) [n:127.0.0.1:37446_solr ] o.a.s.c.c.ZkStateReader A cluster state change: [WatchedEvent state:SyncConnected type:NodeDataChanged path:/collections/testschemaapi/state.json] for collection [testschemaapi] has occurred - updating... (live nodes size: [2])
    [junit4] 2> 1032053 INFO (zkCallback-21004-thread-2-processing-n:127.0.0.1:40002_solr) [n:127.0.0.1:40002_solr ] o.a.s.c.c.ZkStateReader Updating data for [testschemaapi] from [2] to [3]
    [junit4] 2> 1032053 INFO (zkCallback-21003-thread-1-processing-n:127.0.0.1:37446_solr) [n:127.0.0.1:37446_solr ] o.a.s.c.c.ZkStateReader Updating data for [testschemaapi] from [2] to [3]
    [junit4] 2> 1032796 INFO (qtp12607128-79282) [n:127.0.0.1:40002_solr c:testschemaapi s:shard1 r:core_node1 x:testschemaapi_shard1_replica1] o.a.s.c.ZkController We are http://127.0.0.1:40002/solr/testschemaapi_shard1_replica1/ and leader is http://127.0.0.1:37446/solr/testschemaapi_shard1_replica2/
    [junit4] 2> 1032796 INFO (qtp12607128-79282) [n:127.0.0.1:40002_solr c:testschemaapi s:shard1 r:core_node1 x:testschemaapi_shard1_replica1] o.a.s.c.ZkController No LogReplay needed for core=testschemaapi_shard1_replica1 baseURL=http://127.0.0.1:40002/solr
    [junit4] 2> 1032796 INFO (qtp12607128-79282)

[...truncated too long message...]

eption.java:127)
    [junit4] 2> at org.apache.zookeeper.KeeperException.create(KeeperException.java:51)
    [junit4] 2> at org.apache.zookeeper.ZooKeeper.getData(ZooKeeper.java:1155)
    [junit4] 2> at org.apache.solr.common.cloud.SolrZkClient$7.execute(SolrZkClient.java:345)
    [junit4] 2> at org.apache.solr.common.cloud.SolrZkClient$7.execute(SolrZkClient.java:342)
    [junit4] 2> at org.apache.solr.common.cloud.ZkCmdExecutor.retryOperation(ZkCmdExecutor.java:60)
    [junit4] 2> at org.apache.solr.common.cloud.SolrZkClient.getData(SolrZkClient.java:342)
    [junit4] 2> at org.apache.solr.schema.ManagedIndexSchemaFactory.create(ManagedIndexSchemaFactory.java:128)
    [junit4] 2> at org.apache.solr.schema.ManagedIndexSchemaFactory.create(ManagedIndexSchemaFactory.java:47)
    [junit4] 2> at org.apache.solr.schema.IndexSchemaFactory.buildIndexSchema(IndexSchemaFactory.java:70)
    [junit4] 2> at org.apache.solr.core.ConfigSetService.createIndexSchema(ConfigSetService.java:108)
    [junit4] 2> at org.apache.solr.core.ConfigSetService.getConfig(ConfigSetService.java:79)
    [junit4] 2> at org.apache.solr.core.CoreContainer.reload(CoreContainer.java:915)
    [junit4] 2> at org.apache.solr.core.SolrCore$11.run(SolrCore.java:2603)
    [junit4] 2> at org.apache.solr.cloud.ZkController$5.run(ZkController.java:2480)
    [junit4] 2> 1042160 WARN (Thread-2442) [n:127.0.0.1:40002_solr ] o.a.s.c.ZkController listener throws error
    [junit4] 2> org.apache.solr.common.SolrException: Unable to reload core [testschemaapi_shard1_replica1]
    [junit4] 2> at org.apache.solr.core.CoreContainer.reload(CoreContainer.java:922)
    [junit4] 2> at org.apache.solr.core.SolrCore$11.run(SolrCore.java:2603)
    [junit4] 2> at org.apache.solr.cloud.ZkController$5.run(ZkController.java:2480)
    [junit4] 2> Caused by: org.apache.solr.common.SolrException: Could not load conf for core testschemaapi_shard1_replica1: Error attempting to access /configs/conf1/managed-schema
    [junit4] 2> at org.apache.solr.core.ConfigSetService.getConfig(ConfigSetService.java:84)
    [junit4] 2> at org.apache.solr.core.CoreContainer.reload(CoreContainer.java:915)
    [junit4] 2> ... 2 more
    [junit4] 2> Caused by: org.apache.solr.common.SolrException: Error attempting to access /configs/conf1/managed-schema
    [junit4] 2> at org.apache.solr.schema.ManagedIndexSchemaFactory.create(ManagedIndexSchemaFactory.java:143)
    [junit4] 2> at org.apache.solr.schema.ManagedIndexSchemaFactory.create(ManagedIndexSchemaFactory.java:47)
    [junit4] 2> at org.apache.solr.schema.IndexSchemaFactory.buildIndexSchema(IndexSchemaFactory.java:70)
    [junit4] 2> at org.apache.solr.core.ConfigSetService.createIndexSchema(ConfigSetService.java:108)
    [junit4] 2> at org.apache.solr.core.ConfigSetService.getConfig(ConfigSetService.java:79)
    [junit4] 2> ... 3 more
    [junit4] 2> Caused by: org.apache.zookeeper.KeeperException$SessionExpiredException: KeeperErrorCode = Session expired for /configs/conf1/managed-schema
    [junit4] 2> at org.apache.zookeeper.KeeperException.create(KeeperException.java:127)
    [junit4] 2> at org.apache.zookeeper.KeeperException.create(KeeperException.java:51)
    [junit4] 2> at org.apache.zookeeper.ZooKeeper.getData(ZooKeeper.java:1155)
    [junit4] 2> at org.apache.solr.common.cloud.SolrZkClient$7.execute(SolrZkClient.java:345)
    [junit4] 2> at org.apache.solr.common.cloud.SolrZkClient$7.execute(SolrZkClient.java:342)
    [junit4] 2> at org.apache.solr.common.cloud.ZkCmdExecutor.retryOperation(ZkCmdExecutor.java:60)
    [junit4] 2> at org.apache.solr.common.cloud.SolrZkClient.getData(SolrZkClient.java:342)
    [junit4] 2> at org.apache.solr.schema.ManagedIndexSchemaFactory.create(ManagedIndexSchemaFactory.java:128)
    [junit4] 2> ... 7 more
    [junit4] 2> 1042161 WARN (Thread-2443) [n:127.0.0.1:37446_solr ] o.a.s.c.ZkController listener throws error
    [junit4] 2> org.apache.solr.common.SolrException: Unable to reload core [testschemaapi_shard1_replica2]
    [junit4] 2> at org.apache.solr.core.CoreContainer.reload(CoreContainer.java:922)
    [junit4] 2> at org.apache.solr.core.SolrCore$11.run(SolrCore.java:2603)
    [junit4] 2> at org.apache.solr.cloud.ZkController$5.run(ZkController.java:2480)
    [junit4] 2> Caused by: org.apache.solr.common.SolrException: Could not load conf for core testschemaapi_shard1_replica2: Error attempting to access /configs/conf1/managed-schema
    [junit4] 2> at org.apache.solr.core.ConfigSetService.getConfig(ConfigSetService.java:84)
    [junit4] 2> at org.apache.solr.core.CoreContainer.reload(CoreContainer.java:915)
    [junit4] 2> ... 2 more
    [junit4] 2> Caused by: org.apache.solr.common.SolrException: Error attempting to access /configs/conf1/managed-schema
    [junit4] 2> at org.apache.solr.schema.ManagedIndexSchemaFactory.create(ManagedIndexSchemaFactory.java:143)
    [junit4] 2> at org.apache.solr.schema.ManagedIndexSchemaFactory.create(ManagedIndexSchemaFactory.java:47)
    [junit4] 2> at org.apache.solr.schema.IndexSchemaFactory.buildIndexSchema(IndexSchemaFactory.java:70)
    [junit4] 2> at org.apache.solr.core.ConfigSetService.createIndexSchema(ConfigSetService.java:108)
    [junit4] 2> at org.apache.solr.core.ConfigSetService.getConfig(ConfigSetService.java:79)
    [junit4] 2> ... 3 more
    [junit4] 2> Caused by: org.apache.zookeeper.KeeperException$SessionExpiredException: KeeperErrorCode = Session expired for /configs/conf1/managed-schema
    [junit4] 2> at org.apache.zookeeper.KeeperException.create(KeeperException.java:127)
    [junit4] 2> at org.apache.zookeeper.KeeperException.create(KeeperException.java:51)
    [junit4] 2> at org.apache.zookeeper.ZooKeeper.getData(ZooKeeper.java:1155)
    [junit4] 2> at org.apache.solr.common.cloud.SolrZkClient$7.execute(SolrZkClient.java:345)
    [junit4] 2> at org.apache.solr.common.cloud.SolrZkClient$7.execute(SolrZkClient.java:342)
    [junit4] 2> at org.apache.solr.common.cloud.ZkCmdExecutor.retryOperation(ZkCmdExecutor.java:60)
    [junit4] 2> at org.apache.solr.common.cloud.SolrZkClient.getData(SolrZkClient.java:342)
    [junit4] 2> at org.apache.solr.schema.ManagedIndexSchemaFactory.create(ManagedIndexSchemaFactory.java:128)
    [junit4] 2> ... 7 more
    [junit4] 2> NOTE: test params are: codec=Asserting(Lucene54): {_version_=PostingsFormat(name=Memory doPackFST= false), id=TestBloomFilteredLucenePostings(BloomFilteringPostingsFormat(Lucene50(blocksize=128))), myNewField=PostingsFormat(name=LuceneVarGapDocFreqInterval)}, docValues:{}, sim=DefaultSimilarity, locale=ko-KR, timezone=America/Campo_Grande
    [junit4] 2> NOTE: Linux 4.4.0-24-generic i386/Oracle Corporation 1.7.0_80 (32-bit)/cpus=12,threads=1,free=153798952,total=483573760
    [junit4] 2> NOTE: All tests run in this JVM: [TestUseDocValuesAsStored2, HdfsRecoverLeaseTest, CoreMergeIndexesAdminHandlerTest, TestFieldCollectionResource, TestSolr4Spatial2, RegexBoostProcessorTest, BlockJoinFacetSimpleTest, ScriptEngineTest, SimpleFacetsTest, CursorMarkTest, TestSolrQueryParser, TestPerFieldSimilarityWithDefaultOverride, CollectionsAPIAsyncDistributedZkTest, BadComponentTest, TestBulkSchemaAPI, TestMiniSolrCloudCluster, TestReloadAndDeleteDocs, BlockDirectoryTest, DocValuesMultiTest, TestCryptoKeys, NoCacheHeaderTest, TestSearchPerf, UnloadDistributedZkTest, SuggesterTSTTest, TestAuthorizationFramework, TestIndexSearcher, DirectUpdateHandlerTest, TestStressLiveNodes, TestConfigSetsAPI, HardAutoCommitTest, LeaderElectionTest, BadCopyFieldTest, TestJmxMonitoredMap, TestReqParamsAPI, TestStressReorder, CircularListTest, HighlighterConfigTest, DirectSolrConnectionTest, TestManagedResource, DebugComponentTest, HdfsWriteToMultipleCollectionsTest, TestJettySolrRunner, TestPerFieldSimilarity, TestRebalanceLeaders, UpdateParamsTest, XmlUpdateRequestHandlerTest, SuggesterWFSTTest, DocValuesMissingTest, RequestHandlersTest, TestExclusionRuleCollectionAccess, TestCloudInspectUtil, CustomCollectionTest, TestNamedUpdateProcessors, CollectionReloadTest, TestSha256AuthenticationProvider, TestSolrIndexConfig, TestCharFilters, HdfsLockFactoryTest, TestStressRecovery, TestChildDocTransformer, TestRequestStatusCollectionAPI, ClusterStateTest, TestReload, IgnoreCommitOptimizeUpdateProcessorFactoryTest, PrimitiveFieldTypeTest, TestIndexingPerformance, TestSearcherReuse, HLLSerializationTest, LukeRequestHandlerTest, TestSerializedLuceneMatchVersion, SolrTestCaseJ4Test, HttpPartitionTest, TestFuzzyAnalyzedSuggestions, TestFastWriter, SortSpecParsingTest, TestManagedSchemaAPI]
    [junit4] Completed [257/572 (1!)] on J2 in 12.23s, 1 test, 1 error <<< FAILURES!

[...truncated 1005 lines...]
BUILD FAILED
/home/jenkins/workspace/Lucene-Solr-5.5-Linux/build.xml:750: The following error occurred while executing this line:
/home/jenkins/workspace/Lucene-Solr-5.5-Linux/build.xml:694: The following error occurred while executing this line:
/home/jenkins/workspace/Lucene-Solr-5.5-Linux/build.xml:59: The following error occurred while executing this line:
/home/jenkins/workspace/Lucene-Solr-5.5-Linux/solr/build.xml:233: The following error occurred while executing this line:
/home/jenkins/workspace/Lucene-Solr-5.5-Linux/solr/common-build.xml:534: The following error occurred while executing this line:
/home/jenkins/workspace/Lucene-Solr-5.5-Linux/lucene/common-build.xml:1477: The following error occurred while executing this line:
/home/jenkins/workspace/Lucene-Solr-5.5-Linux/lucene/common-build.xml:1033: There were test failures: 572 suites (7 ignored), 2303 tests, 1 error, 84 ignored (39 assumptions) [seed: 9B1CA7132C043EF0]

Total time: 62 minutes 54 seconds
Build step 'Invoke Ant' marked build as failure
Archiving artifacts
[WARNINGS] Skipping publisher since build result is FAILURE
Recording test results
Email was triggered for: Failure - Any
Sending email for trigger: Failure - Any

Search Discussions

Discussion Posts

Previous

Follow ups

Related Discussions

Discussion Navigation
viewthread | post
posts ‹ prev | 3 of 4 | next ›
Discussion Overview
groupdev @
categorieslucene
postedJun 17, '16 at 3:38p
activeJun 18, '16 at 2:52a
posts4
users1
websitelucene.apache.org

1 user in discussion

Policeman Jenkins Server: 4 posts

People

Translate

site design / logo © 2017 Grokbase