Grokbase Groups Lucene dev June 2016
FAQ
Build: http://jenkins.thetaphi.de/job/Lucene-Solr-6.1-Windows/15/
Java: 64bit/jdk1.8.0_92 -XX:+UseCompressedOops -XX:+UseG1GC

1 tests failed.
FAILED: TEST-org.apache.lucene.codecs.lucene50.TestLucene50CompoundFormat.xml.[failed-to-read]

Error Message:


Stack Trace:
Failed to read test report file C:\Users\jenkins\workspace\Lucene-Solr-6.1-Windows\lucene\build\core\test\TEST-org.apache.lucene.codecs.lucene50.TestLucene50CompoundFormat.xml
org.dom4j.DocumentException: Error on line 3 of document file:///C:/Users/jenkins/workspace/Lucene-Solr-6.1-Windows/lucene/build/core/test/TEST-org.apache.lucene.codecs.lucene50.TestLucene50CompoundFormat.xml : XML document structures must start and end within the same entity. Nested exception: XML document structures must start and end within the same entity.
  at org.dom4j.io.SAXReader.read(SAXReader.java:482)
  at org.dom4j.io.SAXReader.read(SAXReader.java:264)
  at hudson.tasks.junit.SuiteResult.parse(SuiteResult.java:126)
  at hudson.tasks.junit.TestResult.parse(TestResult.java:301)
  at hudson.tasks.junit.TestResult.parsePossiblyEmpty(TestResult.java:244)
  at hudson.tasks.junit.TestResult.parse(TestResult.java:175)
  at hudson.tasks.junit.TestResult.parse(TestResult.java:154)
  at hudson.tasks.junit.TestResult.(JUnitParser.java:132)
  at hudson.tasks.junit.JUnitParser$ParseResultCallable.invoke(JUnitParser.java:107)
  at hudson.FilePath$FileCallableWrapper.call(FilePath.java:2772)
  at hudson.remoting.UserRequest.perform(UserRequest.java:152)
  at hudson.remoting.UserRequest.perform(UserRequest.java:50)
  at hudson.remoting.Request$2.run(Request.java:332)
  at hudson.remoting.InterceptingExecutorService$1.call(InterceptingExecutorService.java:68)
  at java.util.concurrent.FutureTask.run(Unknown Source)
  at java.util.concurrent.ThreadPoolExecutor.runWorker(Unknown Source)
  at java.util.concurrent.ThreadPoolExecutor$Worker.run(Unknown Source)
  at java.lang.Thread.run(Unknown Source)
Caused by: org.xml.sax.SAXParseException; systemId: file:///C:/Users/jenkins/workspace/Lucene-Solr-6.1-Windows/lucene/build/core/test/TEST-org.apache.lucene.codecs.lucene50.TestLucene50CompoundFormat.xml; lineNumber: 3; columnNumber: 50; XML document structures must start and end within the same entity.
  at com.sun.org.apache.xerces.internal.util.ErrorHandlerWrapper.createSAXParseException(Unknown Source)
  at com.sun.org.apache.xerces.internal.util.ErrorHandlerWrapper.fatalError(Unknown Source)
  at com.sun.org.apache.xerces.internal.impl.XMLErrorReporter.reportError(Unknown Source)
  at com.sun.org.apache.xerces.internal.impl.XMLErrorReporter.reportError(Unknown Source)
  at com.sun.org.apache.xerces.internal.impl.XMLScanner.reportFatalError(Unknown Source)
  at com.sun.org.apache.xerces.internal.impl.XMLDocumentFragmentScannerImpl.endEntity(Unknown Source)
  at com.sun.org.apache.xerces.internal.impl.XMLDocumentScannerImpl.endEntity(Unknown Source)
  at com.sun.org.apache.xerces.internal.impl.XMLEntityManager.endEntity(Unknown Source)
  at com.sun.org.apache.xerces.internal.impl.XMLEntityScanner.load(Unknown Source)
  at com.sun.org.apache.xerces.internal.impl.XMLEntityScanner.peekChar(Unknown Source)
  at com.sun.org.apache.xerces.internal.impl.XMLDocumentFragmentScannerImpl$FragmentContentDriver.next(Unknown Source)
  at com.sun.org.apache.xerces.internal.impl.XMLDocumentScannerImpl.next(Unknown Source)
  at com.sun.org.apache.xerces.internal.impl.XMLNSDocumentScannerImpl.next(Unknown Source)
  at com.sun.org.apache.xerces.internal.impl.XMLDocumentFragmentScannerImpl.scanDocument(Unknown Source)
  at com.sun.org.apache.xerces.internal.parsers.XML11Configuration.parse(Unknown Source)
  at com.sun.org.apache.xerces.internal.parsers.XML11Configuration.parse(Unknown Source)
  at com.sun.org.apache.xerces.internal.parsers.XMLParser.parse(Unknown Source)
  at com.sun.org.apache.xerces.internal.parsers.AbstractSAXParser.parse(Unknown Source)
  at com.sun.org.apache.xerces.internal.jaxp.SAXParserImpl$JAXPSAXParser.parse(Unknown Source)
  at org.dom4j.io.SAXReader.read(SAXReader.java:465)
  ... 18 more
Nested exception:
org.xml.sax.SAXParseException; systemId: file:///C:/Users/jenkins/workspace/Lucene-Solr-6.1-Windows/lucene/build/core/test/TEST-org.apache.lucene.codecs.lucene50.TestLucene50CompoundFormat.xml; lineNumber: 3; columnNumber: 50; XML document structures must start and end within the same entity.
  at com.sun.org.apache.xerces.internal.util.ErrorHandlerWrapper.createSAXParseException(Unknown Source)
  at com.sun.org.apache.xerces.internal.util.ErrorHandlerWrapper.fatalError(Unknown Source)
  at com.sun.org.apache.xerces.internal.impl.XMLErrorReporter.reportError(Unknown Source)
  at com.sun.org.apache.xerces.internal.impl.XMLErrorReporter.reportError(Unknown Source)
  at com.sun.org.apache.xerces.internal.impl.XMLScanner.reportFatalError(Unknown Source)
  at com.sun.org.apache.xerces.internal.impl.XMLDocumentFragmentScannerImpl.endEntity(Unknown Source)
  at com.sun.org.apache.xerces.internal.impl.XMLDocumentScannerImpl.endEntity(Unknown Source)
  at com.sun.org.apache.xerces.internal.impl.XMLEntityManager.endEntity(Unknown Source)
  at com.sun.org.apache.xerces.internal.impl.XMLEntityScanner.load(Unknown Source)
  at com.sun.org.apache.xerces.internal.impl.XMLEntityScanner.peekChar(Unknown Source)
  at com.sun.org.apache.xerces.internal.impl.XMLDocumentFragmentScannerImpl$FragmentContentDriver.next(Unknown Source)
  at com.sun.org.apache.xerces.internal.impl.XMLDocumentScannerImpl.next(Unknown Source)
  at com.sun.org.apache.xerces.internal.impl.XMLNSDocumentScannerImpl.next(Unknown Source)
  at com.sun.org.apache.xerces.internal.impl.XMLDocumentFragmentScannerImpl.scanDocument(Unknown Source)
  at com.sun.org.apache.xerces.internal.parsers.XML11Configuration.parse(Unknown Source)
  at com.sun.org.apache.xerces.internal.parsers.XML11Configuration.parse(Unknown Source)
  at com.sun.org.apache.xerces.internal.parsers.XMLParser.parse(Unknown Source)
  at com.sun.org.apache.xerces.internal.parsers.AbstractSAXParser.parse(Unknown Source)
  at com.sun.org.apache.xerces.internal.jaxp.SAXParserImpl$JAXPSAXParser.parse(Unknown Source)
  at org.dom4j.io.SAXReader.read(SAXReader.java:465)
  at org.dom4j.io.SAXReader.read(SAXReader.java:264)
  at hudson.tasks.junit.SuiteResult.parse(SuiteResult.java:126)
  at hudson.tasks.junit.TestResult.parse(TestResult.java:301)
  at hudson.tasks.junit.TestResult.parsePossiblyEmpty(TestResult.java:244)
  at hudson.tasks.junit.TestResult.parse(TestResult.java:175)
  at hudson.tasks.junit.TestResult.parse(TestResult.java:154)
  at hudson.tasks.junit.TestResult.(JUnitParser.java:132)
  at hudson.tasks.junit.JUnitParser$ParseResultCallable.invoke(JUnitParser.java:107)
  at hudson.FilePath$FileCallableWrapper.call(FilePath.java:2772)
  at hudson.remoting.UserRequest.perform(UserRequest.java:152)
  at hudson.remoting.UserRequest.perform(UserRequest.java:50)
  at hudson.remoting.Request$2.run(Request.java:332)
  at hudson.remoting.InterceptingExecutorService$1.call(InterceptingExecutorService.java:68)
  at java.util.concurrent.FutureTask.run(Unknown Source)
  at java.util.concurrent.ThreadPoolExecutor.runWorker(Unknown Source)
  at java.util.concurrent.ThreadPoolExecutor$Worker.run(Unknown Source)
  at java.lang.Thread.run(Unknown Source)




Build Log:
[...truncated 616 lines...]
    [junit4] JVM J0: stdout was not empty, see: C:\Users\jenkins\workspace\Lucene-Solr-6.1-Windows\lucene\build\core\test\temp\junit4-J0-20160616_141151_679.sysout
    [junit4] >>> JVM J0 emitted unexpected output (verbatim) ----
    [junit4] java.lang.OutOfMemoryError: Java heap space
    [junit4] Dumping heap to C:\Users\jenkins\workspace\Lucene-Solr-6.1-Windows\heapdumps\java_pid4308.hprof ...
    [junit4] Heap dump file created [609343086 bytes in 3.618 secs]
    [junit4] #
    [junit4] # A fatal error has been detected by the Java Runtime Environment:
    [junit4] #
    [junit4] # EXCEPTION_ACCESS_VIOLATION (0xc0000005) at pc=0x000000006882efc0, pid=4308, tid=0x0000000000000a08
    [junit4] #
    [junit4] # JRE version: Java(TM) SE Runtime Environment (8.0_92-b14) (build 1.8.0_92-b14)
    [junit4] # Java VM: Java HotSpot(TM) 64-Bit Server VM (25.92-b14 mixed mode windows-amd64 compressed oops)
    [junit4] # Problematic frame:
    [junit4] # V [jvm.dll+0xaefc0]
    [junit4] #
    [junit4] # Failed to write core dump. Minidumps are not enabled by default on client versions of Windows
    [junit4] #
    [junit4] # An error report file with more information is saved as:
    [junit4] # C:\Users\jenkins\workspace\Lucene-Solr-6.1-Windows\lucene\build\core\test\J0\hs_err_pid4308.log
    [junit4] #
    [junit4] # If you would like to submit a bug report, please visit:
    [junit4] # http://bugreport.java.com/bugreport/crash.jsp
    [junit4] #
    [junit4] <<< JVM J0: EOF ----

[...truncated 516 lines...]
    [junit4] Suite: org.apache.lucene.codecs.lucene50.TestLucene50CompoundFormat
    [junit4] 2> NOTE: reproduce with: ant test -Dtestcase=TestLucene50CompoundFormat -Dtests.method=testLargeCFS -Dtests.seed=14C5BC91BD806C2C -Dtests.slow=true -Dtests.locale=de-AT -Dtests.timezone=NST -Dtests.asserts=true -Dtests.file.encoding=UTF-8
    [junit4] ERROR 0.87s J1 | TestLucene50CompoundFormat.testLargeCFS <<<
    [junit4] > Throwable #1: java.io.IOException: There is not enough space on the disk
    [junit4] > at __randomizedtesting.SeedInfo.seed([14C5BC91BD806C2C:3687A0CB8EBF5139]:0)
    [junit4] > at sun.nio.ch.FileDispatcherImpl.write0(Native Method)
    [junit4] > at sun.nio.ch.FileDispatcherImpl.write(FileDispatcherImpl.java:75)
    [junit4] > at sun.nio.ch.IOUtil.writeFromNativeBuffer(IOUtil.java:93)
    [junit4] > at sun.nio.ch.IOUtil.write(IOUtil.java:65)
    [junit4] > at sun.nio.ch.FileChannelImpl.write(FileChannelImpl.java:211)
    [junit4] > at java.nio.channels.Channels.writeFullyImpl(Channels.java:78)
    [junit4] > at java.nio.channels.Channels.writeFully(Channels.java:101)
    [junit4] > at java.nio.channels.Channels.access$000(Channels.java:61)
    [junit4] > at java.nio.channels.Channels$1.write(Channels.java:174)
    [junit4] > at org.apache.lucene.mockfile.FilterOutputStream2.write(FilterOutputStream2.java:62)
    [junit4] > at org.apache.lucene.mockfile.FilterOutputStream2.write(FilterOutputStream2.java:62)
    [junit4] > at org.apache.lucene.store.FSDirectory$FSIndexOutput$1.write(FSDirectory.java:414)
    [junit4] > at java.util.zip.CheckedOutputStream.write(CheckedOutputStream.java:73)
    [junit4] > at java.io.BufferedOutputStream.flushBuffer(BufferedOutputStream.java:82)
    [junit4] > at java.io.BufferedOutputStream.write(BufferedOutputStream.java:126)
    [junit4] > at org.apache.lucene.store.OutputStreamIndexOutput.writeBytes(OutputStreamIndexOutput.java:53)
    [junit4] > at org.apache.lucene.store.MockIndexOutputWrapper.writeBytes(MockIndexOutputWrapper.java:141)
    [junit4] > at org.apache.lucene.index.BaseCompoundFormatTestCase.testLargeCFS(BaseCompoundFormatTestCase.java:171)
    [junit4] > at java.lang.Thread.run(Thread.java:745)
    [junit4] 2> NOTE: reproduce with: ant test -Dtestcase=TestLucene50CompoundFormat -Dtests.method=testMultiClose -Dtests.seed=14C5BC91BD806C2C -Dtests.slow=true -Dtests.locale=de-AT -Dtests.timezone=NST -Dtests.asserts=true -Dtests.file.encoding=UTF-8
    [junit4] ERROR 0.01s J1 | TestLucene50CompoundFormat.testMultiClose <<<
    [junit4] > Throwable #1: java.nio.file.FileSystemException: C:\Users\jenkins\workspace\Lucene-Solr-6.1-Windows\lucene\build\core\test\J1\temp\lucene.codecs.lucene50.TestLucene50CompoundFormat_14C5BC91BD806C2C-001\justSoYouGetSomeChannelErrors-001\_0_Lucene50_0.tim: There is not enough space on the disk.
    [junit4] > at __randomizedtesting.SeedInfo.seed([14C5BC91BD806C2C:90F850AAA2E20534]:0)
    [junit4] > at sun.nio.fs.WindowsException.translateToIOException(WindowsException.java:86)
    [junit4] > at sun.nio.fs.WindowsException.rethrowAsIOException(WindowsException.java:97)
    [junit4] > at sun.nio.fs.WindowsException.rethrowAsIOException(WindowsException.java:102)
    [junit4] > at sun.nio.fs.WindowsFileSystemProvider.newByteChannel(WindowsFileSystemProvider.java:230)
    [junit4] > at java.nio.file.spi.FileSystemProvider.newOutputStream(FileSystemProvider.java:434)
    [junit4] > at org.apache.lucene.mockfile.FilterFileSystemProvider.newOutputStream(FilterFileSystemProvider.java:197)
    [junit4] > at org.apache.lucene.mockfile.FilterFileSystemProvider.newOutputStream(FilterFileSystemProvider.java:197)
    [junit4] > at org.apache.lucene.mockfile.HandleTrackingFS.newOutputStream(HandleTrackingFS.java:129)
    [junit4] > at org.apache.lucene.mockfile.HandleTrackingFS.newOutputStream(HandleTrackingFS.java:129)
    [junit4] > at org.apache.lucene.mockfile.FilterFileSystemProvider.newOutputStream(FilterFileSystemProvider.java:197)
    [junit4] > at java.nio.file.Files.newOutputStream(Files.java:216)
    [junit4] > at org.apache.lucene.store.FSDirectory$FSIndexOutput.<init>(FSDirectory.java:408)
    [junit4] > at org.apache.lucene.store.FSDirectory$FSIndexOutput.<init>(FSDirectory.java:404)
    [junit4] > at org.apache.lucene.store.FSDirectory.createOutput(FSDirectory.java:253)
    [junit4] > at org.apache.lucene.store.MockDirectoryWrapper.createOutput(MockDirectoryWrapper.java:653)
    [junit4] > at org.apache.lucene.codecs.blocktree.BlockTreeTermsWriter.<init>(BlockTreeTermsWriter.java:328)
    [junit4] > at org.apache.lucene.codecs.blocktree.BlockTreeTermsWriter.<init>(BlockTreeTermsWriter.java:280)
    [junit4] > at org.apache.lucene.codecs.lucene50.Lucene50PostingsFormat.fieldsConsumer(Lucene50PostingsFormat.java:428)
    [junit4] > at org.apache.lucene.codecs.perfield.PerFieldPostingsFormat$FieldsWriter.write(PerFieldPostingsFormat.java:196)
    [junit4] > at org.apache.lucene.index.BaseIndexFileFormatTestCase.testMultiClose(BaseIndexFileFormatTestCase.java:322)
    [junit4] > at org.apache.lucene.index.BaseCompoundFormatTestCase.testMultiClose(BaseCompoundFormatTestCase.java:51)
    [junit4] > at java.lang.Thread.run(Thread.java:745)
    [junit4] 2>
    [junit4] ERROR 0.02s J1 | TestLucene50CompoundFormat.testManySubFiles <<<
    [junit4] > Throwable #1: java.nio.file.FileSystemException: C:\Users\jenkins\workspace\Lucene-Solr-6.1-Windows\lucene\build\core\test\J1\temp\lucene.codecs.lucene50.TestLucene50CompoundFormat_14C5BC91BD806C2C-001\CFSManySubFiles-001\_123.5: There is not enough space on the disk.
    [junit4] > at __randomizedtesting.SeedInfo.seed([14C5BC91BD806C2C:93C48DAED91AAF3F]:0)
    [junit4] > at sun.nio.fs.WindowsException.translateToIOException(WindowsException.java:86)
    [junit4] > at sun.nio.fs.WindowsException.rethrowAsIOException(WindowsException.java:97)
    [junit4] > at sun.nio.fs.WindowsException.rethrowAsIOException(WindowsException.java:102)
    [junit4] > at sun.nio.fs.WindowsFileSystemProvider.newByteChannel(WindowsFileSystemProvider.java:230)
    [junit4] > at java.nio.file.spi.FileSystemProvider.newOutputStream(FileSystemProvider.java:434)
    [junit4] > at org.apache.lucene.mockfile.FilterFileSystemProvider.newOutputStream(FilterFileSystemProvider.java:197)
    [junit4] > at org.apache.lucene.mockfile.FilterFileSystemProvider.newOutputStream(FilterFileSystemProvider.java:197)
    [junit4] > at org.apache.lucene.mockfile.HandleTrackingFS.newOutputStream(HandleTrackingFS.java:129)
    [junit4] > at org.apache.lucene.mockfile.HandleTrackingFS.newOutputStream(HandleTrackingFS.java:129)
    [junit4] > at org.apache.lucene.mockfile.FilterFileSystemProvider.newOutputStream(FilterFileSystemProvider.java:197)
    [junit4] > at java.nio.file.Files.newOutputStream(Files.java:216)
    [junit4] > at org.apache.lucene.store.FSDirectory$FSIndexOutput.<init>(FSDirectory.java:408)
    [junit4] > at org.apache.lucene.store.FSDirectory$FSIndexOutput.<init>(FSDirectory.java:404)
    [junit4] > at org.apache.lucene.store.FSDirectory.createOutput(FSDirectory.java:253)
    [junit4] > at org.apache.lucene.store.MockDirectoryWrapper.createOutput(MockDirectoryWrapper.java:653)
    [junit4] > at org.apache.lucene.index.BaseCompoundFormatTestCase.testManySubFiles(BaseCompoundFormatTestCase.java:376)
    [junit4] > at java.lang.Thread.run(Thread.java:745)
    [junit4] 2>
    [junit4] 2>
    [junit4] 2>
    [junit4] 2>
    [junit4] Completed [271/422 (1!)] on J1 in 1.32s, 24 tests, 3 errors <<< FAILURES!

[...truncated 43 lines...]
    [junit4] JVM J1: stderr was not empty, see: C:\Users\jenkins\workspace\Lucene-Solr-6.1-Windows\lucene\build\core\test\temp\junit4-J1-20160616_141151_679.syserr
    [junit4] >>> JVM J1 emitted unexpected output (verbatim) ----
    [junit4] WARN: Unhandled exception in event serialization. -> java.security.PrivilegedActionException: java.io.IOException: There is not enough space on the disk
    [junit4] at java.security.AccessController.doPrivileged(Native Method)
    [junit4] at com.carrotsearch.ant.tasks.junit4.events.Serializer.flushQueue(Serializer.java:96)
    [junit4] at com.carrotsearch.ant.tasks.junit4.events.Serializer.serialize(Serializer.java:81)
    [junit4] at com.carrotsearch.ant.tasks.junit4.slave.SlaveMain$3$2.write(SlaveMain.java:456)
    [junit4] at java.io.BufferedOutputStream.flushBuffer(BufferedOutputStream.java:82)
    [junit4] at java.io.BufferedOutputStream.flush(BufferedOutputStream.java:140)
    [junit4] at java.io.PrintStream.flush(PrintStream.java:338)
    [junit4] at java.io.FilterOutputStream.flush(FilterOutputStream.java:140)
    [junit4] at java.io.PrintStream.write(PrintStream.java:482)
    [junit4] at sun.nio.cs.StreamEncoder.writeBytes(StreamEncoder.java:221)
    [junit4] at sun.nio.cs.StreamEncoder.implFlushBuffer(StreamEncoder.java:291)
    [junit4] at sun.nio.cs.StreamEncoder.flushBuffer(StreamEncoder.java:104)
    [junit4] at java.io.OutputStreamWriter.flushBuffer(OutputStreamWriter.java:185)
    [junit4] at java.io.PrintStream.write(PrintStream.java:527)
    [junit4] at java.io.PrintStream.print(PrintStream.java:669)
    [junit4] at java.io.PrintStream.println(PrintStream.java:806)
    [junit4] at org.apache.lucene.util.RunListenerPrintReproduceInfo.printDebuggingInformation(RunListenerPrintReproduceInfo.java:144)
    [junit4] at org.apache.lucene.util.RunListenerPrintReproduceInfo.testRunFinished(RunListenerPrintReproduceInfo.java:118)
    [junit4] at com.carrotsearch.randomizedtesting.RandomizedRunner.runSuite(RandomizedRunner.java:706)
    [junit4] at com.carrotsearch.randomizedtesting.RandomizedRunner.access$200(RandomizedRunner.java:140)
    [junit4] at com.carrotsearch.randomizedtesting.RandomizedRunner$2.run(RandomizedRunner.java:591)
    [junit4] Caused by: java.io.IOException: There is not enough space on the disk
    [junit4] at java.io.FileOutputStream.writeBytes(Native Method)
    [junit4] at java.io.FileOutputStream.write(FileOutputStream.java:326)
    [junit4] at java.io.BufferedOutputStream.flushBuffer(BufferedOutputStream.java:82)
    [junit4] at java.io.BufferedOutputStream.
    [junit4] write(BufferedOutputStream.java:121)
    [junit4] at com.carrotsearch.ant.tasks.junit4.slave.EventsOutputStream.write(EventsOutputStream.java:28)
    [junit4] at sun.nio.cs.StreamEncoder.writeBytes(StreamEncoder.java:221)
    [junit4] at sun.nio.cs.StreamEncoder.implWrite(StreamEncoder.java:282)
    [junit4] at sun.nio.cs.StreamEncoder.write(StreamEncoder.java:125)
    [junit4] at sun.nio.cs.StreamEncoder.write(StreamEncoder.java:135)
    [junit4] at java.io.OutputStreamWriter.write(OutputStreamWriter.java:220)
    [junit4] at com.carrotsearch.ant.tasks.junit4.gson.stream.JsonWriter.string(JsonWriter.java:571)
    [junit4] at com.carrotsearch.ant.tasks.junit4.gson.stream.JsonWriter.value(JsonWriter.java:414)
    [junit4] at com.carrotsearch.ant.tasks.junit4.events.AbstractEvent.writeBinaryProperty(AbstractEvent.java:36)
    [junit4] at com.carrotsearch.ant.tasks.junit4.events.AppendStdErrEvent.serialize(AppendStdErrEvent.java:30)
    [junit4] at com.carrotsearch.ant.tasks.junit4.events.Serializer$2.run(Serializer.java:101)
    [junit4] at com.carrotsearch.ant.tasks.junit4.events.Serializer$2.run(Serializer.java:96)
    [junit4] ... 21 more
    [junit4] <<< JVM J1: EOF ----

[...truncated 8 lines...]
    [junit4] ERROR: JVM J0 ended with an exception, command line: C:\Users\jenkins\tools\java\64bit\jdk1.8.0_92\jre\bin\java.exe -XX:+UseCompressedOops -XX:+UseG1GC -XX:+HeapDumpOnOutOfMemoryError -XX:HeapDumpPath=C:\Users\jenkins\workspace\Lucene-Solr-6.1-Windows\heapdumps -ea -esa -Dtests.prefix=tests -Dtests.seed=14C5BC91BD806C2C -Xmx512M -Dtests.iters= -Dtests.verbose=false -Dtests.infostream=false -Dtests.codec=random -Dtests.postingsformat=random -Dtests.docvaluesformat=random -Dtests.locale=random -Dtests.timezone=random -Dtests.directory=random -Dtests.linedocsfile=europarl.lines.txt.gz -Dtests.luceneMatchVersion=6.1.0 -Dtests.cleanthreads=perMethod -Djava.util.logging.config.file=C:\Users\jenkins\workspace\Lucene-Solr-6.1-Windows\lucene\tools\junit4\logging.properties -Dtests.nightly=false -Dtests.weekly=false -Dtests.monster=false -Dtests.slow=true -Dtests.asserts=true -Dtests.multiplier=1 -DtempDir=./temp -Djava.io.tmpdir=./temp -Djunit4.tempDir=C:\Users\jenkins\workspace\Lucene-Solr-6.1-Windows\lucene\build\core\test\temp -Dcommon.dir=C:\Users\jenkins\workspace\Lucene-Solr-6.1-Windows\lucene -Dclover.db.dir=C:\Users\jenkins\workspace\Lucene-Solr-6.1-Windows\lucene\build\clover\db -Djava.security.policy=C:\Users\jenkins\workspace\Lucene-Solr-6.1-Windows\lucene\tools\junit4\tests.policy -Dtests.LUCENE_VERSION=6.1.0 -Djetty.testMode=1 -Djetty.insecurerandom=1 -Dsolr.directoryFactory=org.apache.solr.core.MockDirectoryFactory -Djava.awt.headless=true -Djdk.map.althashing.threshold=0 -Djunit4.childvm.cwd=C:\Users\jenkins\workspace\Lucene-Solr-6.1-Windows\lucene\build\core\test\J0 -Djunit4.childvm.id=0 -Djunit4.childvm.count=2 -Dtests.leaveTemporary=false -Dtests.filterstacks=true -Djava.security.manager=org.apache.lucene.util.TestSecurityManager -Dfile.encoding=UTF-8 -classpath C:\Users\jenkins\workspace\Lucene-Solr-6.1-Windows\lucene\build\codecs\classes\java;C:\Users\jenkins\workspace\Lucene-Solr-6.1-Windows\lucene\build\test-framework\classes\java;C:\Users\jenkins\workspace\Lucene-Solr-6.1-Windows\lucene\test-framework\lib\junit-4.10.jar;C:\Users\jenkins\workspace\Lucene-Solr-6.1-Windows\lucene\test-framework\lib\randomizedtesting-runner-2.3.4.jar;C:\Users\jenkins\workspace\Lucene-Solr-6.1-Windows\lucene\build\core\classes\java;C:\Users\jenkins\workspace\Lucene-Solr-6.1-Windows\lucene\build\core\classes\test;C:\Users\jenkins\tools\hudson.tasks.Ant_AntInstallation\ANT_1.8.2\lib\ant-launcher.jar;C:\Users\jenkins\.ant\lib\ivy-2.3.0.jar;C:\Users\jenkins\tools\hudson.tasks.Ant_AntInstallation\ANT_1.8.2\lib\ant-antlr.jar;C:\Users\jenkins\tools\hudson.tasks.Ant_AntInstallation\ANT_1.8.2\lib\ant-apache-bcel.jar;C:\Users\jenkins\tools\hudson.tasks.Ant_AntInstallation\ANT_1.8.2\lib\ant-apache-bsf.jar;C:\Users\jenkins\tools\hudson.tasks.Ant_AntInstallation\ANT_1.8.2\lib\ant-apache-log4j.jar;C:\Users\jenkins\tools\hudson.tasks.Ant_AntInstallation\ANT_1.8.2\lib\ant-apache-oro.jar;C:\Users\jenkins\tools\hudson.tasks.Ant_AntInstallation\ANT_1.8.2\lib\ant-apache-regexp.jar;C:\Users\jenkins\tools\hudson.tasks.Ant_AntInstallation\ANT_1.8.2\lib\ant-apache-resolver.jar;C:\Users\jenkins\tools\hudson.tasks.Ant_AntInstallation\ANT_1.8.2\lib\ant-apache-xalan2.jar;C:\Users\jenkins\tools\hudson.tasks.Ant_AntInstallation\ANT_1.8.2\lib\ant-commons-logging.jar;C:\Users\jenkins\tools\hudson.tasks.Ant_AntInstallation\ANT_1.8.2\lib\ant-commons-net.jar;C:\Users\jenkins\tools\hudson.tasks.Ant_AntInstallation\ANT_1.8.2\lib\ant-jai.jar;C:\Users\jenkins\tools\hudson.tasks.Ant_AntInstallation\ANT_1.8.2\lib\ant-javamail.jar;C:\Users\jenkins\tools\hudson.tasks.Ant_AntInstallation\ANT_1.8.2\lib\ant-jdepend.jar;C:\Users\jenkins\tools\hudson.tasks.Ant_AntInstallation\ANT_1.8.2\lib\ant-jmf.jar;C:\Users\jenkins\tools\hudson.tasks.Ant_AntInstallation\ANT_1.8.2\lib\ant-jsch.jar;C:\Users\jenkins\tools\hudson.tasks.Ant_AntInstallation\ANT_1.8.2\lib\ant-junit.jar;C:\Users\jenkins\tools\hudson.tasks.Ant_AntInstallation\ANT_1.8.2\lib\ant-junit4.jar;C:\Users\jenkins\tools\hudson.tasks.Ant_AntInstallation\ANT_1.8.2\lib\ant-netrexx.jar;C:\Users\jenkins\tools\hudson.tasks.Ant_AntInstallation\ANT_1.8.2\lib\ant-swing.jar;C:\Users\jenkins\tools\hudson.tasks.Ant_AntInstallation\ANT_1.8.2\lib\ant-testutil.jar;C:\Users\jenkins\tools\hudson.tasks.Ant_AntInstallation\ANT_1.8.2\lib\ant.jar;C:\Users\jenkins\tools\java\64bit\jdk1.8.0_92\lib\tools.jar;C:\Users\jenkins\.ivy2\cache\com.carrotsearch.randomizedtesting\junit4-ant\jars\junit4-ant-2.3.4.jar com.carrotsearch.ant.tasks.junit4.slave.SlaveMainSafe -eventsfile C:\Users\jenkins\workspace\Lucene-Solr-6.1-Windows\lucene\build\core\test\temp\junit4-J0-20160616_141151_679.events @C:\Users\jenkins\workspace\Lucene-Solr-6.1-Windows\lucene\build\core\test\temp\junit4-J0-20160616_141151_679.suites -stdin
    [junit4] ERROR: JVM J0 ended with an exception: Forked process returned with error code: 1. Very likely a JVM crash. See process stdout at: C:\Users\jenkins\workspace\Lucene-Solr-6.1-Windows\lucene\build\core\test\temp\junit4-J0-20160616_141151_679.sysout
    [junit4] at com.carrotsearch.ant.tasks.junit4.JUnit4.executeSlave(JUnit4.java:1481)
    [junit4] at com.carrotsearch.ant.tasks.junit4.JUnit4.access$000(JUnit4.java:121)
    [junit4] at com.carrotsearch.ant.tasks.junit4.JUnit4$2.call(JUnit4.java:955)
    [junit4] at com.carrotsearch.ant.tasks.junit4.JUnit4$2.call(JUnit4.java:952)
    [junit4] at java.util.concurrent.FutureTask.run(FutureTask.java:266)
    [junit4] at java.util.concurrent.ThreadPoolExecutor.runWorker(ThreadPoolExecutor.java:1142)
    [junit4] at java.util.concurrent.ThreadPoolExecutor$Worker.run(ThreadPoolExecutor.java:617)
    [junit4] at java.lang.Thread.run(Thread.java:745)
    [junit4] ERROR: JVM J1 ended with an exception, command line: C:\Users\jenkins\tools\java\64bit\jdk1.8.0_92\jre\bin\java.exe -XX:+UseCompressedOops -XX:+UseG1GC -XX:+HeapDumpOnOutOfMemoryError -XX:HeapDumpPath=C:\Users\jenkins\workspace\Lucene-Solr-6.1-Windows\heapdumps -ea -esa -Dtests.prefix=tests -Dtests.seed=14C5BC91BD806C2C -Xmx512M -Dtests.iters= -Dtests.verbose=false -Dtests.infostream=false -Dtests.codec=random -Dtests.postingsformat=random -Dtests.docvaluesformat=random -Dtests.locale=random -Dtests.timezone=random -Dtests.directory=random -Dtests.linedocsfile=europarl.lines.txt.gz -Dtests.luceneMatchVersion=6.1.0 -Dtests.cleanthreads=perMethod -Djava.util.logging.config.file=C:\Users\jenkins\workspace\Lucene-Solr-6.1-Windows\lucene\tools\junit4\logging.properties -Dtests.nightly=false -Dtests.weekly=false -Dtests.monster=false -Dtests.slow=true -Dtests.asserts=true -Dtests.multiplier=1 -DtempDir=./temp -Djava.io.tmpdir=./temp -Djunit4.tempDir=C:\Users\jenkins\workspace\Lucene-Solr-6.1-Windows\lucene\build\core\test\temp -Dcommon.dir=C:\Users\jenkins\workspace\Lucene-Solr-6.1-Windows\lucene -Dclover.db.dir=C:\Users\jenkins\workspace\Lucene-Solr-6.1-Windows\lucene\build\clover\db -Djava.security.policy=C:\Users\jenkins\workspace\Lucene-Solr-6.1-Windows\lucene\tools\junit4\tests.policy -Dtests.LUCENE_VERSION=6.1.0 -Djetty.testMode=1 -Djetty.insecurerandom=1 -Dsolr.directoryFactory=org.apache.solr.core.MockDirectoryFactory -Djava.awt.headless=true -Djdk.map.althashing.threshold=0 -Djunit4.childvm.cwd=C:\Users\jenkins\workspace\Lucene-Solr-6.1-Windows\lucene\build\core\test\J1 -Djunit4.childvm.id=1 -Djunit4.childvm.count=2 -Dtests.leaveTemporary=false -Dtests.filterstacks=true -Djava.security.manager=org.apache.lucene.util.TestSecurityManager -Dfile.encoding=UTF-8 -classpath C:\Users\jenkins\workspace\Lucene-Solr-6.1-Windows\lucene\build\codecs\classes\java;C:\Users\jenkins\workspace\Lucene-Solr-6.1-Windows\lucene\build\test-framework\classes\java;C:\Users\jenkins\workspace\Lucene-Solr-6.1-Windows\lucene\test-framework\lib\junit-4.10.jar;C:\Users\jenkins\workspace\Lucene-Solr-6.1-Windows\lucene\test-framework\lib\randomizedtesting-runner-2.3.4.jar;C:\Users\jenkins\workspace\Lucene-Solr-6.1-Windows\lucene\build\core\classes\java;C:\Users\jenkins\workspace\Lucene-Solr-6.1-Windows\lucene\build\core\classes\test;C:\Users\jenkins\tools\hudson.tasks.Ant_AntInstallation\ANT_1.8.2\lib\ant-launcher.jar;C:\Users\jenkins\.ant\lib\ivy-2.3.0.jar;C:\Users\jenkins\tools\hudson.tasks.Ant_AntInstallation\ANT_1.8.2\lib\ant-antlr.jar;C:\Users\jenkins\tools\hudson.tasks.Ant_AntInstallation\ANT_1.8.2\lib\ant-apache-bcel.jar;C:\Users\jenkins\tools\hudson.tasks.Ant_AntInstallation\ANT_1.8.2\lib\ant-apache-bsf.jar;C:\Users\jenkins\tools\hudson.tasks.Ant_AntInstallation\ANT_1.8.2\lib\ant-apache-log4j.jar;C:\Users\jenkins\tools\hudson.tasks.Ant_AntInstallation\ANT_1.8.2\lib\ant-apache-oro.jar;C:\Users\jenkins\tools\hudson.tasks.Ant_AntInstallation\ANT_1.8.2\lib\ant-apache-regexp.jar;C:\Users\jenkins\tools\hudson.tasks.Ant_AntInstallation\ANT_1.8.2\lib\ant-apache-resolver.jar;C:\Users\jenkins\tools\hudson.tasks.Ant_AntInstallation\ANT_1.8.2\lib\ant-apache-xalan2.jar;C:\Users\jenkins\tools\hudson.tasks.Ant_AntInstallation\ANT_1.8.2\lib\ant-commons-logging.jar;C:\Users\jenkins\tools\hudson.tasks.Ant_AntInstallation\ANT_1.8.2\lib\ant-commons-net.jar;C:\Users\jenkins\tools\hudson.tasks.Ant_AntInstallation\ANT_1.8.2\lib\ant-jai.jar;C:\Users\jenkins\tools\hudson.tasks.Ant_AntInstallation\ANT_1.8.2\lib\ant-javamail.jar;C:\Users\jenkins\tools\hudson.tasks.Ant_AntInstallation\ANT_1.8.2\lib\ant-jdepend.jar;C:\Users\jenkins\tools\hudson.tasks.Ant_AntInstallation\ANT_1.8.2\lib\ant-jmf.jar;C:\Users\jenkins\tools\hudson.tasks.Ant_AntInstallation\ANT_1.8.2\lib\ant-jsch.jar;C:\Users\jenkins\tools\hudson.tasks.Ant_AntInstallation\ANT_1.8.2\lib\ant-junit.jar;C:\Users\jenkins\tools\hudson.tasks.Ant_AntInstallation\ANT_1.8.2\lib\ant-junit4.jar;C:\Users\jenkins\tools\hudson.tasks.Ant_AntInstallation\ANT_1.8.2\lib\ant-netrexx.jar;C:\Users\jenkins\tools\hudson.tasks.Ant_AntInstallation\ANT_1.8.2\lib\ant-swing.jar;C:\Users\jenkins\tools\hudson.tasks.Ant_AntInstallation\ANT_1.8.2\lib\ant-testutil.jar;C:\Users\jenkins\tools\hudson.tasks.Ant_AntInstallation\ANT_1.8.2\lib\ant.jar;C:\Users\jenkins\tools\java\64bit\jdk1.8.0_92\lib\tools.jar;C:\Users\jenkins\.ivy2\cache\com.carrotsearch.randomizedtesting\junit4-ant\jars\junit4-ant-2.3.4.jar com.carrotsearch.ant.tasks.junit4.slave.SlaveMainSafe -eventsfile C:\Users\jenkins\workspace\Lucene-Solr-6.1-Windows\lucene\build\core\test\temp\junit4-J1-20160616_141151_679.events @C:\Users\jenkins\workspace\Lucene-Solr-6.1-Windows\lucene\build\core\test\temp\junit4-J1-20160616_141151_679.suites -stdin
    [junit4] ERROR: JVM J1 ended with an exception: Quit event not received from the forked process? This may indicate JVM crash or runner bugs.
    [junit4] at com.carrotsearch.ant.tasks.junit4.JUnit4.executeSlave(JUnit4.java:1501)
    [junit4] at com.carrotsearch.ant.tasks.junit4.JUnit4.access$000(JUnit4.java:121)
    [junit4] at com.carrotsearch.ant.tasks.junit4.JUnit4$2.call(JUnit4.java:955)
    [junit4] at com.carrotsearch.ant.tasks.junit4.JUnit4$2.call(JUnit4.java:952)
    [junit4] at java.util.concurrent.FutureTask.run(FutureTask.java:266)
    [junit4] at java.util.concurrent.ThreadPoolExecutor.runWorker(ThreadPoolExecutor.java:1142)
    [junit4] at java.util.concurrent.ThreadPoolExecutor$Worker.run(ThreadPoolExecutor.java:617)
    [junit4] at java.lang.Thread.run(Thread.java:745)

BUILD FAILED
C:\Users\jenkins\workspace\Lucene-Solr-6.1-Windows\build.xml:740: The following error occurred while executing this line:
C:\Users\jenkins\workspace\Lucene-Solr-6.1-Windows\build.xml:684: The following error occurred while executing this line:
C:\Users\jenkins\workspace\Lucene-Solr-6.1-Windows\build.xml:59: The following error occurred while executing this line:
C:\Users\jenkins\workspace\Lucene-Solr-6.1-Windows\lucene\build.xml:50: The following error occurred while executing this line:
C:\Users\jenkins\workspace\Lucene-Solr-6.1-Windows\lucene\common-build.xml:1427: The following error occurred while executing this line:
C:\Users\jenkins\workspace\Lucene-Solr-6.1-Windows\lucene\common-build.xml:984: At least one slave process threw an exception, first: Forked process returned with error code: 1. Very likely a JVM crash. See process stdout at: C:\Users\jenkins\workspace\Lucene-Solr-6.1-Windows\lucene\build\core\test\temp\junit4-J0-20160616_141151_679.sysout

Total time: 5 minutes 20 seconds
Build step 'Invoke Ant' marked build as failure
Archiving artifacts
[WARNINGS] Skipping publisher since build result is FAILURE
Recording test results
Email was triggered for: Failure - Any
Sending email for trigger: Failure - Any

Search Discussions

Discussion Posts

Previous

Related Discussions

Discussion Navigation
viewthread | post
posts ‹ prev | 4 of 4 | next ›
Discussion Overview
groupdev @
categorieslucene
postedJun 15, '16 at 4:38a
activeJun 16, '16 at 2:17p
posts4
users1
websitelucene.apache.org

1 user in discussion

Policeman Jenkins Server: 4 posts

People

Translate

site design / logo © 2017 Grokbase