Grokbase Groups Lucene dev June 2016
FAQ
Build: http://jenkins.thetaphi.de/job/Lucene-Solr-6.x-Solaris/201/
Java: 64bit/jdk1.8.0 -XX:-UseCompressedOops -XX:+UseG1GC

1 tests failed.
FAILED: org.apache.solr.core.TestArbitraryIndexDir.testLoadNewIndexDir

Error Message:
Exception during query

Stack Trace:
java.lang.RuntimeException: Exception during query
  at __randomizedtesting.SeedInfo.seed([7FF6DF1CCEAE89F2:96AC64245037195A]:0)
  at org.apache.solr.SolrTestCaseJ4.assertQ(SolrTestCaseJ4.java:781)
  at org.apache.solr.core.TestArbitraryIndexDir.testLoadNewIndexDir(TestArbitraryIndexDir.java:107)
  at sun.reflect.NativeMethodAccessorImpl.invoke0(Native Method)
  at sun.reflect.NativeMethodAccessorImpl.invoke(NativeMethodAccessorImpl.java:62)
  at sun.reflect.DelegatingMethodAccessorImpl.invoke(DelegatingMethodAccessorImpl.java:43)
  at java.lang.reflect.Method.invoke(Method.java:498)
  at com.carrotsearch.randomizedtesting.RandomizedRunner.invoke(RandomizedRunner.java:1764)
  at com.carrotsearch.randomizedtesting.RandomizedRunner$8.evaluate(RandomizedRunner.java:871)
  at com.carrotsearch.randomizedtesting.RandomizedRunner$9.evaluate(RandomizedRunner.java:907)
  at com.carrotsearch.randomizedtesting.RandomizedRunner$10.evaluate(RandomizedRunner.java:921)
  at com.carrotsearch.randomizedtesting.rules.SystemPropertiesRestoreRule$1.evaluate(SystemPropertiesRestoreRule.java:57)
  at com.carrotsearch.randomizedtesting.rules.SystemPropertiesRestoreRule$1.evaluate(SystemPropertiesRestoreRule.java:57)
  at org.apache.lucene.util.TestRuleSetupTeardownChained$1.evaluate(TestRuleSetupTeardownChained.java:49)
  at org.apache.lucene.util.AbstractBeforeAfterRule$1.evaluate(AbstractBeforeAfterRule.java:45)
  at org.apache.lucene.util.TestRuleThreadAndTestName$1.evaluate(TestRuleThreadAndTestName.java:48)
  at org.apache.lucene.util.TestRuleIgnoreAfterMaxFailures$1.evaluate(TestRuleIgnoreAfterMaxFailures.java:64)
  at org.apache.lucene.util.TestRuleMarkFailure$1.evaluate(TestRuleMarkFailure.java:47)
  at com.carrotsearch.randomizedtesting.rules.StatementAdapter.evaluate(StatementAdapter.java:36)
  at com.carrotsearch.randomizedtesting.ThreadLeakControl$StatementRunner.run(ThreadLeakControl.java:367)
  at com.carrotsearch.randomizedtesting.ThreadLeakControl.forkTimeoutingTask(ThreadLeakControl.java:809)
  at com.carrotsearch.randomizedtesting.ThreadLeakControl$3.evaluate(ThreadLeakControl.java:460)
  at com.carrotsearch.randomizedtesting.RandomizedRunner.runSingleTest(RandomizedRunner.java:880)
  at com.carrotsearch.randomizedtesting.RandomizedRunner$5.evaluate(RandomizedRunner.java:781)
  at com.carrotsearch.randomizedtesting.RandomizedRunner$6.evaluate(RandomizedRunner.java:816)
  at com.carrotsearch.randomizedtesting.RandomizedRunner$7.evaluate(RandomizedRunner.java:827)
  at com.carrotsearch.randomizedtesting.rules.StatementAdapter.evaluate(StatementAdapter.java:36)
  at com.carrotsearch.randomizedtesting.rules.SystemPropertiesRestoreRule$1.evaluate(SystemPropertiesRestoreRule.java:57)
  at org.apache.lucene.util.AbstractBeforeAfterRule$1.evaluate(AbstractBeforeAfterRule.java:45)
  at com.carrotsearch.randomizedtesting.rules.StatementAdapter.evaluate(StatementAdapter.java:36)
  at org.apache.lucene.util.TestRuleStoreClassName$1.evaluate(TestRuleStoreClassName.java:41)
  at com.carrotsearch.randomizedtesting.rules.NoShadowingOrOverridesOnMethodsRule$1.evaluate(NoShadowingOrOverridesOnMethodsRule.java:40)
  at com.carrotsearch.randomizedtesting.rules.NoShadowingOrOverridesOnMethodsRule$1.evaluate(NoShadowingOrOverridesOnMethodsRule.java:40)
  at com.carrotsearch.randomizedtesting.rules.StatementAdapter.evaluate(StatementAdapter.java:36)
  at com.carrotsearch.randomizedtesting.rules.StatementAdapter.evaluate(StatementAdapter.java:36)
  at com.carrotsearch.randomizedtesting.rules.StatementAdapter.evaluate(StatementAdapter.java:36)
  at org.apache.lucene.util.TestRuleAssertionsRequired$1.evaluate(TestRuleAssertionsRequired.java:53)
  at org.apache.lucene.util.TestRuleMarkFailure$1.evaluate(TestRuleMarkFailure.java:47)
  at org.apache.lucene.util.TestRuleIgnoreAfterMaxFailures$1.evaluate(TestRuleIgnoreAfterMaxFailures.java:64)
  at org.apache.lucene.util.TestRuleIgnoreTestSuites$1.evaluate(TestRuleIgnoreTestSuites.java:54)
  at com.carrotsearch.randomizedtesting.rules.StatementAdapter.evaluate(StatementAdapter.java:36)
  at com.carrotsearch.randomizedtesting.ThreadLeakControl$StatementRunner.run(ThreadLeakControl.java:367)
  at java.lang.Thread.run(Thread.java:745)
Caused by: java.lang.RuntimeException: REQUEST FAILED: xpath=*[count(//doc)=1]
  xml response was: <?xml version="1.0" encoding="UTF-8"?>
<response>
<lst name="responseHeader"><int name="status">0</int><int name="QTime">0</int></lst><result name="response" numFound="0" start="0"></result>
</response>

  request was:q=id:2&qt=standard&start=0&rows=20&version=2.2
  at org.apache.solr.SolrTestCaseJ4.assertQ(SolrTestCaseJ4.java:774)
  ... 41 more




Build Log:
[...truncated 11721 lines...]
    [junit4] Suite: org.apache.solr.core.TestArbitraryIndexDir
    [junit4] 2> Creating dataDir: /export/home/jenkins/workspace/Lucene-Solr-6.x-Solaris/solr/build/solr-core/test/J0/temp/solr.core.TestArbitraryIndexDir_7FF6DF1CCEAE89F2-001/init-core-data-001
    [junit4] 2> 2171306 INFO (SUITE-TestArbitraryIndexDir-seed#[7FF6DF1CCEAE89F2]-worker) [ ] o.a.s.SolrTestCaseJ4 Randomized ssl (false) and clientAuth (false) via: @org.apache.solr.util.RandomizeSSL(reason=, value=NaN, ssl=NaN, clientAuth=NaN)
    [junit4] 2> 2171308 INFO (TEST-TestArbitraryIndexDir.testLoadNewIndexDir-seed#[7FF6DF1CCEAE89F2]) [ ] o.a.s.SolrTestCaseJ4 ###Starting testLoadNewIndexDir
    [junit4] 2> 2171308 INFO (TEST-TestArbitraryIndexDir.testLoadNewIndexDir-seed#[7FF6DF1CCEAE89F2]) [ ] o.a.s.SolrTestCaseJ4 ####initCore
    [junit4] 2> 2171308 INFO (TEST-TestArbitraryIndexDir.testLoadNewIndexDir-seed#[7FF6DF1CCEAE89F2]) [ ] o.a.s.c.SolrResourceLoader new SolrResourceLoader for directory: '/export/home/jenkins/workspace/Lucene-Solr-6.x-Solaris/solr/core/src/test-files/solr/collection1'
    [junit4] 2> 2171309 INFO (TEST-TestArbitraryIndexDir.testLoadNewIndexDir-seed#[7FF6DF1CCEAE89F2]) [ ] o.a.s.c.SolrResourceLoader JNDI not configured for solr (NoInitialContextEx)
    [junit4] 2> 2171309 INFO (TEST-TestArbitraryIndexDir.testLoadNewIndexDir-seed#[7FF6DF1CCEAE89F2]) [ ] o.a.s.c.SolrResourceLoader using system property solr.solr.home: /export/home/jenkins/workspace/Lucene-Solr-6.x-Solaris/solr/core/src/test-files/solr
    [junit4] 2> 2171309 INFO (TEST-TestArbitraryIndexDir.testLoadNewIndexDir-seed#[7FF6DF1CCEAE89F2]) [ ] o.a.s.c.SolrResourceLoader Adding 'file:/export/home/jenkins/workspace/Lucene-Solr-6.x-Solaris/solr/core/src/test-files/solr/collection1/lib/classes/' to classloader
    [junit4] 2> 2171309 INFO (TEST-TestArbitraryIndexDir.testLoadNewIndexDir-seed#[7FF6DF1CCEAE89F2]) [ ] o.a.s.c.SolrResourceLoader Adding 'file:/export/home/jenkins/workspace/Lucene-Solr-6.x-Solaris/solr/core/src/test-files/solr/collection1/lib/README' to classloader
    [junit4] 2> 2171330 INFO (TEST-TestArbitraryIndexDir.testLoadNewIndexDir-seed#[7FF6DF1CCEAE89F2]) [ ] o.a.s.c.SolrConfig current version of requestparams : -1
    [junit4] 2> 2171339 INFO (TEST-TestArbitraryIndexDir.testLoadNewIndexDir-seed#[7FF6DF1CCEAE89F2]) [ ] o.a.s.c.SolrConfig Using Lucene MatchVersion: 6.2.0
    [junit4] 2> 2171359 INFO (TEST-TestArbitraryIndexDir.testLoadNewIndexDir-seed#[7FF6DF1CCEAE89F2]) [ ] o.a.s.c.SolrConfig Loaded SolrConfig: solrconfig.xml
    [junit4] 2> 2171363 INFO (TEST-TestArbitraryIndexDir.testLoadNewIndexDir-seed#[7FF6DF1CCEAE89F2]) [ ] o.a.s.s.IndexSchema [null] Schema name=test
    [junit4] 2> 2171429 INFO (TEST-TestArbitraryIndexDir.testLoadNewIndexDir-seed#[7FF6DF1CCEAE89F2]) [ ] o.a.s.s.IndexSchema default search field in schema is text
    [junit4] 2> 2171429 INFO (TEST-TestArbitraryIndexDir.testLoadNewIndexDir-seed#[7FF6DF1CCEAE89F2]) [ ] o.a.s.s.IndexSchema unique key field: id
    [junit4] 2> 2171430 WARN (TEST-TestArbitraryIndexDir.testLoadNewIndexDir-seed#[7FF6DF1CCEAE89F2]) [ ] o.a.s.s.IndexSchema Field text is not multivalued and destination for multiple copyFields (2)
    [junit4] 2> 2171433 INFO (TEST-TestArbitraryIndexDir.testLoadNewIndexDir-seed#[7FF6DF1CCEAE89F2]) [ ] o.a.s.s.FileExchangeRateProvider Reloading exchange rates from file currency.xml
    [junit4] 2> 2171435 INFO (TEST-TestArbitraryIndexDir.testLoadNewIndexDir-seed#[7FF6DF1CCEAE89F2]) [ ] o.a.s.s.FileExchangeRateProvider Reloading exchange rates from file currency.xml
    [junit4] 2> 2171436 INFO (TEST-TestArbitraryIndexDir.testLoadNewIndexDir-seed#[7FF6DF1CCEAE89F2]) [ ] o.a.s.c.SolrResourceLoader JNDI not configured for solr (NoInitialContextEx)
    [junit4] 2> 2171436 INFO (TEST-TestArbitraryIndexDir.testLoadNewIndexDir-seed#[7FF6DF1CCEAE89F2]) [ ] o.a.s.c.SolrResourceLoader using system property solr.solr.home: /export/home/jenkins/workspace/Lucene-Solr-6.x-Solaris/solr/core/src/test-files/solr
    [junit4] 2> 2171436 INFO (TEST-TestArbitraryIndexDir.testLoadNewIndexDir-seed#[7FF6DF1CCEAE89F2]) [ ] o.a.s.c.SolrResourceLoader new SolrResourceLoader for directory: '/export/home/jenkins/workspace/Lucene-Solr-6.x-Solaris/solr/core/src/test-files/solr'
    [junit4] 2> 2171437 INFO (TEST-TestArbitraryIndexDir.testLoadNewIndexDir-seed#[7FF6DF1CCEAE89F2]) [ ] o.a.s.c.SolrResourceLoader JNDI not configured for solr (NoInitialContextEx)
    [junit4] 2> 2171437 INFO (TEST-TestArbitraryIndexDir.testLoadNewIndexDir-seed#[7FF6DF1CCEAE89F2]) [ ] o.a.s.c.SolrResourceLoader using system property solr.solr.home: /export/home/jenkins/workspace/Lucene-Solr-6.x-Solaris/solr/core/src/test-files/solr
    [junit4] 2> 2171437 INFO (TEST-TestArbitraryIndexDir.testLoadNewIndexDir-seed#[7FF6DF1CCEAE89F2]) [ ] o.a.s.c.CoreContainer New CoreContainer 1926960332
    [junit4] 2> 2171437 INFO (TEST-TestArbitraryIndexDir.testLoadNewIndexDir-seed#[7FF6DF1CCEAE89F2]) [ ] o.a.s.c.CoreContainer Loading cores into CoreContainer [instanceDir=/export/home/jenkins/workspace/Lucene-Solr-6.x-Solaris/solr/core/src/test-files/solr]
    [junit4] 2> 2171437 WARN (TEST-TestArbitraryIndexDir.testLoadNewIndexDir-seed#[7FF6DF1CCEAE89F2]) [ ] o.a.s.c.CoreContainer Couldn't add files from /export/home/jenkins/workspace/Lucene-Solr-6.x-Solaris/solr/core/src/test-files/solr/lib to classpath: /export/home/jenkins/workspace/Lucene-Solr-6.x-Solaris/solr/core/src/test-files/solr/lib
    [junit4] 2> 2171437 INFO (TEST-TestArbitraryIndexDir.testLoadNewIndexDir-seed#[7FF6DF1CCEAE89F2]) [ ] o.a.s.h.c.HttpShardHandlerFactory created with socketTimeout : 600000,connTimeout : 60000,maxConnectionsPerHost : 20,maxConnections : 10000,corePoolSize : 0,maximumPoolSize : 2147483647,maxThreadIdleTime : 5,sizeOfQueue : -1,fairnessPolicy : false,useRetries : false,
    [junit4] 2> 2171438 INFO (TEST-TestArbitraryIndexDir.testLoadNewIndexDir-seed#[7FF6DF1CCEAE89F2]) [ ] o.a.s.u.UpdateShardHandler Creating UpdateShardHandler HTTP client with params: socketTimeout=30000&connTimeout=30000&retry=true
    [junit4] 2> 2171438 INFO (TEST-TestArbitraryIndexDir.testLoadNewIndexDir-seed#[7FF6DF1CCEAE89F2]) [ ] o.a.s.l.LogWatcher SLF4J impl is org.slf4j.impl.Log4jLoggerFactory
    [junit4] 2> 2171438 INFO (TEST-TestArbitraryIndexDir.testLoadNewIndexDir-seed#[7FF6DF1CCEAE89F2]) [ ] o.a.s.l.LogWatcher Registering Log Listener [Log4j (org.slf4j.impl.Log4jLoggerFactory)]
    [junit4] 2> 2171439 INFO (TEST-TestArbitraryIndexDir.testLoadNewIndexDir-seed#[7FF6DF1CCEAE89F2]) [ ] o.a.s.c.CoreContainer Security conf doesn't exist. Skipping setup for authorization module.
    [junit4] 2> 2171439 INFO (TEST-TestArbitraryIndexDir.testLoadNewIndexDir-seed#[7FF6DF1CCEAE89F2]) [ ] o.a.s.c.CoreContainer No authentication plugin used.
    [junit4] 2> 2171439 INFO (TEST-TestArbitraryIndexDir.testLoadNewIndexDir-seed#[7FF6DF1CCEAE89F2]) [ ] o.a.s.c.CoreDescriptor Created CoreDescriptor: {name=collection1, config=solrconfig.xml, transient=false, schema=schema12.xml, loadOnStartup=true, configSetProperties=configsetprops.json, collection=collection1, dataDir=/export/home/jenkins/workspace/Lucene-Solr-6.x-Solaris/solr/build/solr-core/test/J0/temp/solr.core.TestArbitraryIndexDir_7FF6DF1CCEAE89F2-001/init-core-data-001, shard=shard1}
    [junit4] 2> 2171440 INFO (coreLoadExecutor-8216-thread-1) [ ] o.a.s.c.SolrResourceLoader new SolrResourceLoader for directory: '/export/home/jenkins/workspace/Lucene-Solr-6.x-Solaris/solr/core/src/test-files/solr/collection1'
    [junit4] 2> 2171440 INFO (coreLoadExecutor-8216-thread-1) [ ] o.a.s.c.SolrResourceLoader JNDI not configured for solr (NoInitialContextEx)
    [junit4] 2> 2171440 INFO (coreLoadExecutor-8216-thread-1) [ ] o.a.s.c.SolrResourceLoader using system property solr.solr.home: /export/home/jenkins/workspace/Lucene-Solr-6.x-Solaris/solr/core/src/test-files/solr
    [junit4] 2> 2171440 INFO (coreLoadExecutor-8216-thread-1) [ ] o.a.s.c.SolrResourceLoader Adding 'file:/export/home/jenkins/workspace/Lucene-Solr-6.x-Solaris/solr/core/src/test-files/solr/collection1/lib/classes/' to classloader
    [junit4] 2> 2171440 INFO (coreLoadExecutor-8216-thread-1) [ ] o.a.s.c.SolrResourceLoader Adding 'file:/export/home/jenkins/workspace/Lucene-Solr-6.x-Solaris/solr/core/src/test-files/solr/collection1/lib/README' to classloader
    [junit4] 2> 2171458 INFO (coreLoadExecutor-8216-thread-1) [ ] o.a.s.c.SolrConfig current version of requestparams : -1
    [junit4] 2> 2171511 INFO (coreLoadExecutor-8216-thread-1) [ ] o.a.s.c.SolrConfig Using Lucene MatchVersion: 6.2.0
    [junit4] 2> 2171529 INFO (coreLoadExecutor-8216-thread-1) [ ] o.a.s.c.SolrConfig Loaded SolrConfig: solrconfig.xml
    [junit4] 2> 2171533 INFO (coreLoadExecutor-8216-thread-1) [ ] o.a.s.s.IndexSchema [collection1] Schema name=test
    [junit4] 2> 2171621 INFO (coreLoadExecutor-8216-thread-1) [ ] o.a.s.s.IndexSchema default search field in schema is text
    [junit4] 2> 2171622 INFO (coreLoadExecutor-8216-thread-1) [ ] o.a.s.s.IndexSchema unique key field: id
    [junit4] 2> 2171623 WARN (coreLoadExecutor-8216-thread-1) [ ] o.a.s.s.IndexSchema Field text is not multivalued and destination for multiple copyFields (2)
    [junit4] 2> 2171626 INFO (coreLoadExecutor-8216-thread-1) [ ] o.a.s.s.FileExchangeRateProvider Reloading exchange rates from file currency.xml
    [junit4] 2> 2171628 INFO (coreLoadExecutor-8216-thread-1) [ ] o.a.s.s.FileExchangeRateProvider Reloading exchange rates from file currency.xml
    [junit4] 2> 2171631 INFO (coreLoadExecutor-8216-thread-1) [ ] o.a.s.c.ConfigSetProperties Did not find ConfigSet properties, assuming default properties: Can't find resource 'configsetprops.json' in classpath or '/export/home/jenkins/workspace/Lucene-Solr-6.x-Solaris/solr/core/src/test-files/solr/collection1'
    [junit4] 2> 2171631 INFO (coreLoadExecutor-8216-thread-1) [ ] o.a.s.c.CoreContainer Creating SolrCore 'collection1' using configuration from instancedir /export/home/jenkins/workspace/Lucene-Solr-6.x-Solaris/solr/core/src/test-files/solr/collection1
    [junit4] 2> 2171631 INFO (coreLoadExecutor-8216-thread-1) [ x:collection1] o.a.s.c.SolrCore org.apache.solr.core.MockFSDirectoryFactory
    [junit4] 2> 2171631 INFO (coreLoadExecutor-8216-thread-1) [ x:collection1] o.a.s.c.SolrCore [[collection1] ] Opening new SolrCore at [/export/home/jenkins/workspace/Lucene-Solr-6.x-Solaris/solr/core/src/test-files/solr/collection1], dataDir=[/export/home/jenkins/workspace/Lucene-Solr-6.x-Solaris/solr/build/solr-core/test/J0/temp/solr.core.TestArbitraryIndexDir_7FF6DF1CCEAE89F2-001/init-core-data-001/]
    [junit4] 2> 2171631 INFO (coreLoadExecutor-8216-thread-1) [ x:collection1] o.a.s.c.JmxMonitoredMap JMX monitoring is enabled. Adding Solr mbeans to JMX Server: com.sun.jmx.mbeanserver.JmxMBeanServer@4f85cb65
    [junit4] 2> 2171632 INFO (coreLoadExecutor-8216-thread-1) [ x:collection1] o.a.s.c.CachingDirectoryFactory return new directory for /export/home/jenkins/workspace/Lucene-Solr-6.x-Solaris/solr/build/solr-core/test/J0/temp/solr.core.TestArbitraryIndexDir_7FF6DF1CCEAE89F2-001/init-core-data-001
    [junit4] 2> 2171632 INFO (coreLoadExecutor-8216-thread-1) [ x:collection1] o.a.s.c.SolrCore New index directory detected: old=null new=/export/home/jenkins/workspace/Lucene-Solr-6.x-Solaris/solr/build/solr-core/test/J0/temp/solr.core.TestArbitraryIndexDir_7FF6DF1CCEAE89F2-001/init-core-data-001/index/
    [junit4] 2> 2171632 WARN (coreLoadExecutor-8216-thread-1) [ x:collection1] o.a.s.c.SolrCore [collection1] Solr index directory '/export/home/jenkins/workspace/Lucene-Solr-6.x-Solaris/solr/build/solr-core/test/J0/temp/solr.core.TestArbitraryIndexDir_7FF6DF1CCEAE89F2-001/init-core-data-001/index' doesn't exist. Creating new index...
    [junit4] 2> 2171632 INFO (coreLoadExecutor-8216-thread-1) [ x:collection1] o.a.s.c.CachingDirectoryFactory return new directory for /export/home/jenkins/workspace/Lucene-Solr-6.x-Solaris/solr/build/solr-core/test/J0/temp/solr.core.TestArbitraryIndexDir_7FF6DF1CCEAE89F2-001/init-core-data-001/index
    [junit4] 2> 2171633 INFO (coreLoadExecutor-8216-thread-1) [ x:collection1] o.a.s.u.RandomMergePolicy RandomMergePolicy wrapping class org.apache.lucene.index.TieredMergePolicy: [TieredMergePolicy: maxMergeAtOnce=43, maxMergeAtOnceExplicit=23, maxMergedSegmentMB=97.7509765625, floorSegmentMB=1.4482421875, forceMergeDeletesPctAllowed=27.615880460448057, segmentsPerTier=41.0, maxCFSSegmentSizeMB=8.796093022207999E12, noCFSRatio=0.6579123361830516
    [junit4] 2> 2171656 INFO (coreLoadExecutor-8216-thread-1) [ x:collection1] o.a.s.c.SolrDeletionPolicy SolrDeletionPolicy.onCommit: commits: num=1
    [junit4] 2> commit{dir=MockDirectoryWrapper(SimpleFSDirectory@/export/home/jenkins/workspace/Lucene-Solr-6.x-Solaris/solr/build/solr-core/test/J0/temp/solr.core.TestArbitraryIndexDir_7FF6DF1CCEAE89F2-001/init-core-data-001/index lockFactory=org.apache.lucene.store.SingleInstanceLockFactory@33d8448b),segFN=segments_1,generation=1}
    [junit4] 2> 2171656 INFO (coreLoadExecutor-8216-thread-1) [ x:collection1] o.a.s.c.SolrDeletionPolicy newest commit generation = 1
    [junit4] 2> 2171657 INFO (OldIndexDirectoryCleanupThreadForCore-collection1) [ x:collection1] o.a.s.c.SolrCore Looking for old index directories to cleanup for core collection1 in /export/home/jenkins/workspace/Lucene-Solr-6.x-Solaris/solr/build/solr-core/test/J0/temp/solr.core.TestArbitraryIndexDir_7FF6DF1CCEAE89F2-001/init-core-data-001/
    [junit4] 2> 2171660 INFO (coreLoadExecutor-8216-thread-1) [ x:collection1] o.a.s.u.p.UpdateRequestProcessorChain creating updateRequestProcessorChain "dedupe"
    [junit4] 2> 2171660 INFO (coreLoadExecutor-8216-thread-1) [ x:collection1] o.a.s.u.p.UpdateRequestProcessorChain inserting DistributedUpdateProcessorFactory into updateRequestProcessorChain "dedupe"
    [junit4] 2> 2171660 INFO (coreLoadExecutor-8216-thread-1) [ x:collection1] o.a.s.u.p.UpdateRequestProcessorChain creating updateRequestProcessorChain "dedupe-allfields"
    [junit4] 2> 2171660 INFO (coreLoadExecutor-8216-thread-1) [ x:collection1] o.a.s.u.p.UpdateRequestProcessorChain inserting DistributedUpdateProcessorFactory into updateRequestProcessorChain "dedupe-allfields"
    [junit4] 2> 2171660 INFO (coreLoadExecutor-8216-thread-1) [ x:collection1] o.a.s.u.p.UpdateRequestProcessorChain creating updateRequestProcessorChain "stored_sig"
    [junit4] 2> 2171660 INFO (coreLoadExecutor-8216-thread-1) [ x:collection1] o.a.s.u.p.UpdateRequestProcessorChain inserting DistributedUpdateProcessorFactory into updateRequestProcessorChain "stored_sig"
    [junit4] 2> 2171661 INFO (coreLoadExecutor-8216-thread-1) [ x:collection1] o.a.s.u.p.UpdateRequestProcessorChain creating updateRequestProcessorChain "uniq-fields"
    [junit4] 2> 2171661 INFO (coreLoadExecutor-8216-thread-1) [ x:collection1] o.a.s.u.p.UpdateRequestProcessorChain inserting DistributedUpdateProcessorFactory into updateRequestProcessorChain "uniq-fields"
    [junit4] 2> 2171661 INFO (coreLoadExecutor-8216-thread-1) [ x:collection1] o.a.s.u.p.UpdateRequestProcessorChain creating updateRequestProcessorChain "distrib-dup-test-chain-explicit"
    [junit4] 2> 2171661 INFO (coreLoadExecutor-8216-thread-1) [ x:collection1] o.a.s.u.p.UpdateRequestProcessorChain creating updateRequestProcessorChain "distrib-dup-test-chain-implicit"
    [junit4] 2> 2171661 INFO (coreLoadExecutor-8216-thread-1) [ x:collection1] o.a.s.u.p.UpdateRequestProcessorChain inserting DistributedUpdateProcessorFactory into updateRequestProcessorChain "distrib-dup-test-chain-implicit"
    [junit4] 2> 2171661 INFO (coreLoadExecutor-8216-thread-1) [ x:collection1] o.a.s.c.SolrCore no updateRequestProcessorChain defined as default, creating implicit default
    [junit4] 2> 2171663 INFO (coreLoadExecutor-8216-thread-1) [ x:collection1] o.a.s.h.l.XMLLoader xsltCacheLifetimeSeconds=60
    [junit4] 2> 2171664 INFO (coreLoadExecutor-8216-thread-1) [ x:collection1] o.a.s.h.l.XMLLoader xsltCacheLifetimeSeconds=60
    [junit4] 2> 2171665 INFO (coreLoadExecutor-8216-thread-1) [ x:collection1] o.a.s.h.l.XMLLoader xsltCacheLifetimeSeconds=60
    [junit4] 2> 2171666 INFO (coreLoadExecutor-8216-thread-1) [ x:collection1] o.a.s.h.l.XMLLoader xsltCacheLifetimeSeconds=60
    [junit4] 2> 2171669 INFO (coreLoadExecutor-8216-thread-1) [ x:collection1] o.a.s.c.PluginBag requestHandler : 'lazy' created with startup=lazy
    [junit4] 2> 2171670 INFO (coreLoadExecutor-8216-thread-1) [ x:collection1] o.a.s.c.RequestHandlers Registered paths: /admin/mbeans,standard,spellCheckCompRH,lazy,/update/json/docs,/admin/luke,/export,spellCheckWithWordbreak_Direct,tvrh,/get,/admin/properties,/update/json,mltrh,/admin/threads,/search-facet-def,/update/csv,/sql,/graph,/search-facet-invariants,/admin/segments,spellCheckCompRH1,/mlt,/admin/system,/replication,dismax,defaults,/config,/stream,/schema,/admin/plugins,/admin/logging,spellCheckWithWordbreak,mock,/admin/ping,/update,/admin/file,/terms,spellCheckCompRH_Direct,/debug/dump
    [junit4] 2> 2171670 INFO (coreLoadExecutor-8216-thread-1) [ x:collection1] o.a.s.c.SolrCore Using default statsCache cache: org.apache.solr.search.stats.LocalStatsCache
    [junit4] 2> 2171671 INFO (coreLoadExecutor-8216-thread-1) [ x:collection1] o.a.s.u.CommitTracker Hard AutoCommit: disabled
    [junit4] 2> 2171671 INFO (coreLoadExecutor-8216-thread-1) [ x:collection1] o.a.s.u.CommitTracker Soft AutoCommit: disabled
    [junit4] 2> 2171671 INFO (coreLoadExecutor-8216-thread-1) [ x:collection1] o.a.s.u.RandomMergePolicy RandomMergePolicy wrapping class org.apache.lucene.index.LogByteSizeMergePolicy: [LogByteSizeMergePolicy: minMergeSize=1677721, mergeFactor=46, maxMergeSize=2147483648, maxMergeSizeForForcedMerge=9223372036854775807, calibrateSizeByDeletes=false, maxMergeDocs=2147483647, maxCFSSegmentSizeMB=8.796093022207999E12, noCFSRatio=1.0]
    [junit4] 2> 2171671 INFO (coreLoadExecutor-8216-thread-1) [ x:collection1] o.a.s.c.SolrDeletionPolicy SolrDeletionPolicy.onInit: commits: num=1
    [junit4] 2> commit{dir=MockDirectoryWrapper(SimpleFSDirectory@/export/home/jenkins/workspace/Lucene-Solr-6.x-Solaris/solr/build/solr-core/test/J0/temp/solr.core.TestArbitraryIndexDir_7FF6DF1CCEAE89F2-001/init-core-data-001/index lockFactory=org.apache.lucene.store.SingleInstanceLockFactory@33d8448b),segFN=segments_1,generation=1}
    [junit4] 2> 2171672 INFO (coreLoadExecutor-8216-thread-1) [ x:collection1] o.a.s.c.SolrDeletionPolicy newest commit generation = 1
    [junit4] 2> 2171672 INFO (coreLoadExecutor-8216-thread-1) [ x:collection1] o.a.s.s.SolrIndexSearcher Opening [Searcher@27c7ea53[collection1] main]
    [junit4] 2> 2171672 INFO (coreLoadExecutor-8216-thread-1) [ x:collection1] o.a.s.r.RestManager Initializing RestManager with initArgs: {storageIO=org.apache.solr.rest.ManagedResourceStorage$InMemoryStorageIO}
    [junit4] 2> 2171672 INFO (coreLoadExecutor-8216-thread-1) [ x:collection1] o.a.s.r.ManagedResourceStorage Reading _rest_managed.json using InMemoryStorage
    [junit4] 2> 2171672 INFO (coreLoadExecutor-8216-thread-1) [ x:collection1] o.a.s.r.RestManager Initializing 0 registered ManagedResources
    [junit4] 2> 2171672 INFO (coreLoadExecutor-8216-thread-1) [ x:collection1] o.a.s.h.c.SpellCheckComponent Initializing spell checkers
    [junit4] 2> 2171681 INFO (coreLoadExecutor-8216-thread-1) [ x:collection1] o.a.s.s.DirectSolrSpellChecker init: {name=direct,classname=DirectSolrSpellChecker,field=lowerfilt,minQueryLength=3}
    [junit4] 2> 2171743 INFO (coreLoadExecutor-8216-thread-1) [ x:collection1] o.a.s.h.ReplicationHandler Commits will be reserved for 10000
    [junit4] 2> 2171743 INFO (searcherExecutor-8217-thread-1-processing-x:collection1) [ x:collection1] o.a.s.h.c.SpellCheckComponent Loading spell index for spellchecker: default
    [junit4] 2> 2171744 INFO (searcherExecutor-8217-thread-1-processing-x:collection1) [ x:collection1] o.a.s.h.c.SpellCheckComponent Loading spell index for spellchecker: direct
    [junit4] 2> 2171744 INFO (searcherExecutor-8217-thread-1-processing-x:collection1) [ x:collection1] o.a.s.h.c.SpellCheckComponent Loading spell index for spellchecker: wordbreak
    [junit4] 2> 2171744 INFO (searcherExecutor-8217-thread-1-processing-x:collection1) [ x:collection1] o.a.s.h.c.SpellCheckComponent Loading spell index for spellchecker: multipleFields
    [junit4] 2> 2171744 INFO (coreLoadExecutor-8216-thread-1) [ x:collection1] o.a.s.c.CoreContainer registering core: collection1
    [junit4] 2> 2171745 INFO (searcherExecutor-8217-thread-1-processing-x:collection1) [ x:collection1] o.a.s.h.c.SpellCheckComponent Loading spell index for spellchecker: jarowinkler
    [junit4] 2> 2171745 INFO (searcherExecutor-8217-thread-1-processing-x:collection1) [ x:collection1] o.a.s.h.c.SpellCheckComponent Loading spell index for spellchecker: external
    [junit4] 2> 2171745 INFO (searcherExecutor-8217-thread-1-processing-x:collection1) [ x:collection1] o.a.s.h.c.SpellCheckComponent Loading spell index for spellchecker: freq
    [junit4] 2> 2171746 INFO (TEST-TestArbitraryIndexDir.testLoadNewIndexDir-seed#[7FF6DF1CCEAE89F2]) [ ] o.a.s.SolrTestCaseJ4 ####initCore end
    [junit4] 2> 2171746 INFO (searcherExecutor-8217-thread-1-processing-x:collection1) [ x:collection1] o.a.s.h.c.SpellCheckComponent Loading spell index for spellchecker: fqcn
    [junit4] 2> 2171746 INFO (searcherExecutor-8217-thread-1-processing-x:collection1) [ x:collection1] o.a.s.h.c.SpellCheckComponent Loading spell index for spellchecker: perDict
    [junit4] 2> 2171746 INFO (TEST-TestArbitraryIndexDir.testLoadNewIndexDir-seed#[7FF6DF1CCEAE89F2]) [ ] o.a.s.u.p.LogUpdateProcessorFactory [collection1] webapp=null path=null params={}{add=[1]} 0 0
    [junit4] 2> 2171747 INFO (searcherExecutor-8217-thread-1-processing-x:collection1) [ x:collection1] o.a.s.c.SolrCore [collection1] Registered new searcher Searcher@27c7ea53[collection1] main{ExitableDirectoryReader(UninvertingDirectoryReader())}
    [junit4] 2> 2171782 INFO (TEST-TestArbitraryIndexDir.testLoadNewIndexDir-seed#[7FF6DF1CCEAE89F2]) [ ] o.a.s.u.DirectUpdateHandler2 start commit{,optimize=false,openSearcher=true,waitSearcher=true,expungeDeletes=false,softCommit=false,prepareCommit=false}
    [junit4] 2> 2171822 INFO (TEST-TestArbitraryIndexDir.testLoadNewIndexDir-seed#[7FF6DF1CCEAE89F2]) [ ] o.a.s.c.SolrDeletionPolicy SolrDeletionPolicy.onCommit: commits: num=2
    [junit4] 2> commit{dir=MockDirectoryWrapper(SimpleFSDirectory@/export/home/jenkins/workspace/Lucene-Solr-6.x-Solaris/solr/build/solr-core/test/J0/temp/solr.core.TestArbitraryIndexDir_7FF6DF1CCEAE89F2-001/init-core-data-001/index lockFactory=org.apache.lucene.store.SingleInstanceLockFactory@33d8448b),segFN=segments_1,generation=1}
    [junit4] 2> commit{dir=MockDirectoryWrapper(SimpleFSDirectory@/export/home/jenkins/workspace/Lucene-Solr-6.x-Solaris/solr/build/solr-core/test/J0/temp/solr.core.TestArbitraryIndexDir_7FF6DF1CCEAE89F2-001/init-core-data-001/index lockFactory=org.apache.lucene.store.SingleInstanceLockFactory@33d8448b),segFN=segments_2,generation=2}
    [junit4] 2> 2171823 INFO (TEST-TestArbitraryIndexDir.testLoadNewIndexDir-seed#[7FF6DF1CCEAE89F2]) [ ] o.a.s.c.SolrDeletionPolicy newest commit generation = 2
    [junit4] 2> 2171824 INFO (TEST-TestArbitraryIndexDir.testLoadNewIndexDir-seed#[7FF6DF1CCEAE89F2]) [ ] o.a.s.c.SolrCore New index directory detected: old=/export/home/jenkins/workspace/Lucene-Solr-6.x-Solaris/solr/build/solr-core/test/J0/temp/solr.core.TestArbitraryIndexDir_7FF6DF1CCEAE89F2-001/init-core-data-001/index/ new=/export/home/jenkins/workspace/Lucene-Solr-6.x-Solaris/solr/build/solr-core/test/J0/temp/solr.core.TestArbitraryIndexDir_7FF6DF1CCEAE89F2-001/init-core-data-001/index_temp
    [junit4] 2> 2171825 INFO (TEST-TestArbitraryIndexDir.testLoadNewIndexDir-seed#[7FF6DF1CCEAE89F2]) [ ] o.a.s.s.SolrIndexSearcher Opening [Searcher@28ed72c4[collection1] main]
    [junit4] 2> 2171825 INFO (TEST-TestArbitraryIndexDir.testLoadNewIndexDir-seed#[7FF6DF1CCEAE89F2]) [ ] o.a.s.u.DirectUpdateHandler2 end_commit_flush
    [junit4] 2> 2171826 INFO (searcherExecutor-8217-thread-1) [ ] o.a.s.c.SolrCore [collection1] Registered new searcher Searcher@28ed72c4[collection1] main{ExitableDirectoryReader(UninvertingDirectoryReader(Uninverting(_0(6.2.0):c1)))}
    [junit4] 2> 2171826 INFO (TEST-TestArbitraryIndexDir.testLoadNewIndexDir-seed#[7FF6DF1CCEAE89F2]) [ ] o.a.s.u.p.LogUpdateProcessorFactory [collection1] webapp=null path=null params={}{commit=} 0 44
    [junit4] 2> 2171826 INFO (TEST-TestArbitraryIndexDir.testLoadNewIndexDir-seed#[7FF6DF1CCEAE89F2]) [ ] o.a.s.c.SolrResourceLoader new SolrResourceLoader for directory: '/export/home/jenkins/workspace/Lucene-Solr-6.x-Solaris/solr/core/src/test-files/solr/collection1'
    [junit4] 2> 2171827 INFO (TEST-TestArbitraryIndexDir.testLoadNewIndexDir-seed#[7FF6DF1CCEAE89F2]) [ ] o.a.s.c.SolrResourceLoader JNDI not configured for solr (NoInitialContextEx)
    [junit4] 2> 2171827 INFO (TEST-TestArbitraryIndexDir.testLoadNewIndexDir-seed#[7FF6DF1CCEAE89F2]) [ ] o.a.s.c.SolrResourceLoader using system property solr.solr.home: /export/home/jenkins/workspace/Lucene-Solr-6.x-Solaris/solr/core/src/test-files/solr
    [junit4] 2> 2171827 INFO (TEST-TestArbitraryIndexDir.testLoadNewIndexDir-seed#[7FF6DF1CCEAE89F2]) [ ] o.a.s.c.SolrResourceLoader Adding 'file:/export/home/jenkins/workspace/Lucene-Solr-6.x-Solaris/solr/core/src/test-files/solr/collection1/lib/classes/' to classloader
    [junit4] 2> 2171827 INFO (TEST-TestArbitraryIndexDir.testLoadNewIndexDir-seed#[7FF6DF1CCEAE89F2]) [ ] o.a.s.c.SolrResourceLoader Adding 'file:/export/home/jenkins/workspace/Lucene-Solr-6.x-Solaris/solr/core/src/test-files/solr/collection1/lib/README' to classloader
    [junit4] 2> 2171850 INFO (TEST-TestArbitraryIndexDir.testLoadNewIndexDir-seed#[7FF6DF1CCEAE89F2]) [ ] o.a.s.c.SolrConfig current version of requestparams : -1
    [junit4] 2> 2171858 INFO (TEST-TestArbitraryIndexDir.testLoadNewIndexDir-seed#[7FF6DF1CCEAE89F2]) [ ] o.a.s.c.SolrConfig Using Lucene MatchVersion: 6.2.0
    [junit4] 2> 2171943 INFO (TEST-TestArbitraryIndexDir.testLoadNewIndexDir-seed#[7FF6DF1CCEAE89F2]) [ ] o.a.s.c.SolrConfig Loaded SolrConfig: solrconfig.xml
    [junit4] 2> 2171947 INFO (TEST-TestArbitraryIndexDir.testLoadNewIndexDir-seed#[7FF6DF1CCEAE89F2]) [ ] o.a.s.s.IndexSchema [collection1] Schema name=test
    [junit4] 2> 2172016 INFO (TEST-TestArbitraryIndexDir.testLoadNewIndexDir-seed#[7FF6DF1CCEAE89F2]) [ ] o.a.s.s.IndexSchema default search field in schema is text
    [junit4] 2> 2172017 INFO (TEST-TestArbitraryIndexDir.testLoadNewIndexDir-seed#[7FF6DF1CCEAE89F2]) [ ] o.a.s.s.IndexSchema unique key field: id
    [junit4] 2> 2172018 WARN (TEST-TestArbitraryIndexDir.testLoadNewIndexDir-seed#[7FF6DF1CCEAE89F2]) [ ] o.a.s.s.IndexSchema Field text is not multivalued and destination for multiple copyFields (2)
    [junit4] 2> 2172021 INFO (TEST-TestArbitraryIndexDir.testLoadNewIndexDir-seed#[7FF6DF1CCEAE89F2]) [ ] o.a.s.s.FileExchangeRateProvider Reloading exchange rates from file currency.xml
    [junit4] 2> 2172023 INFO (TEST-TestArbitraryIndexDir.testLoadNewIndexDir-seed#[7FF6DF1CCEAE89F2]) [ ] o.a.s.s.FileExchangeRateProvider Reloading exchange rates from file currency.xml
    [junit4] 2> 2172026 INFO (TEST-TestArbitraryIndexDir.testLoadNewIndexDir-seed#[7FF6DF1CCEAE89F2]) [ ] o.a.s.c.ConfigSetProperties Did not find ConfigSet properties, assuming default properties: Can't find resource 'configsetprops.json' in classpath or '/export/home/jenkins/workspace/Lucene-Solr-6.x-Solaris/solr/core/src/test-files/solr/collection1'
    [junit4] 2> 2172026 INFO (TEST-TestArbitraryIndexDir.testLoadNewIndexDir-seed#[7FF6DF1CCEAE89F2]) [ ] o.a.s.c.CoreContainer Reloading SolrCore 'collection1' using configuration from instancedir /export/home/jenkins/workspace/Lucene-Solr-6.x-Solaris/solr/core/src/test-files/solr/collection1
    [junit4] 2> 2172026 INFO (TEST-TestArbitraryIndexDir.testLoadNewIndexDir-seed#[7FF6DF1CCEAE89F2]) [ x:collection1] o.a.s.c.SolrCore [[collection1] ] Opening new SolrCore at [/export/home/jenkins/workspace/Lucene-Solr-6.x-Solaris/solr/core/src/test-files/solr/collection1], dataDir=[/export/home/jenkins/workspace/Lucene-Solr-6.x-Solaris/solr/build/solr-core/test/J0/temp/solr.core.TestArbitraryIndexDir_7FF6DF1CCEAE89F2-001/init-core-data-001/]
    [junit4] 2> 2172026 INFO (TEST-TestArbitraryIndexDir.testLoadNewIndexDir-seed#[7FF6DF1CCEAE89F2]) [ x:collection1] o.a.s.c.JmxMonitoredMap JMX monitoring is enabled. Adding Solr mbeans to JMX Server: com.sun.jmx.mbeanserver.JmxMBeanServer@4f85cb65
    [junit4] 2> 2172026 INFO (TEST-TestArbitraryIndexDir.testLoadNewIndexDir-seed#[7FF6DF1CCEAE89F2]) [ x:collection1] o.a.s.c.SolrCore New index directory detected: old=null new=/export/home/jenkins/workspace/Lucene-Solr-6.x-Solaris/solr/build/solr-core/test/J0/temp/solr.core.TestArbitraryIndexDir_7FF6DF1CCEAE89F2-001/init-core-data-001/index_temp
    [junit4] 2> 2172028 INFO (OldIndexDirectoryCleanupThreadForCore-collection1) [ x:collection1] o.a.s.c.SolrCore Looking for old index directories to cleanup for core collection1 in /export/home/jenkins/workspace/Lucene-Solr-6.x-Solaris/solr/build/solr-core/test/J0/temp/solr.core.TestArbitraryIndexDir_7FF6DF1CCEAE89F2-001/init-core-data-001/
    [junit4] 2> 2172029 INFO (OldIndexDirectoryCleanupThreadForCore-collection1) [ x:collection1] o.a.s.c.DirectoryFactory Found 1 old index directories to clean-up under /export/home/jenkins/workspace/Lucene-Solr-6.x-Solaris/solr/build/solr-core/test/J0/temp/solr.core.TestArbitraryIndexDir_7FF6DF1CCEAE89F2-001/init-core-data-001/
    [junit4] 2> 2172029 WARN (OldIndexDirectoryCleanupThreadForCore-collection1) [ x:collection1] o.a.s.c.CachingDirectoryFactory Cannot delete directory /export/home/jenkins/workspace/Lucene-Solr-6.x-Solaris/solr/build/solr-core/test/J0/temp/solr.core.TestArbitraryIndexDir_7FF6DF1CCEAE89F2-001/init-core-data-001/index as it is still being referenced in the cache!
    [junit4] 2> 2172029 WARN (OldIndexDirectoryCleanupThreadForCore-collection1) [ x:collection1] o.a.s.c.DirectoryFactory Delete old index directory /export/home/jenkins/workspace/Lucene-Solr-6.x-Solaris/solr/build/solr-core/test/J0/temp/solr.core.TestArbitraryIndexDir_7FF6DF1CCEAE89F2-001/init-core-data-001/index failed.
    [junit4] 2> 2172032 INFO (TEST-TestArbitraryIndexDir.testLoadNewIndexDir-seed#[7FF6DF1CCEAE89F2]) [ x:collection1] o.a.s.u.p.UpdateRequestProcessorChain creating updateRequestProcessorChain "dedupe"
    [junit4] 2> 2172032 INFO (TEST-TestArbitraryIndexDir.testLoadNewIndexDir-seed#[7FF6DF1CCEAE89F2]) [ x:collection1] o.a.s.u.p.UpdateRequestProcessorChain inserting DistributedUpdateProcessorFactory into updateRequestProcessorChain "dedupe"
    [junit4] 2> 2172032 INFO (TEST-TestArbitraryIndexDir.testLoadNewIndexDir-seed#[7FF6DF1CCEAE89F2]) [ x:collection1] o.a.s.u.p.UpdateRequestProcessorChain creating updateRequestProcessorChain "dedupe-allfields"
    [junit4] 2> 2172032 INFO (TEST-TestArbitraryIndexDir.testLoadNewIndexDir-seed#[7FF6DF1CCEAE89F2]) [ x:collection1] o.a.s.u.p.UpdateRequestProcessorChain inserting DistributedUpdateProcessorFactory into updateRequestProcessorChain "dedupe-allfields"
    [junit4] 2> 2172032 INFO (TEST-TestArbitraryIndexDir.testLoadNewIndexDir-seed#[7FF6DF1CCEAE89F2]) [ x:collection1] o.a.s.u.p.UpdateRequestProcessorChain creating updateRequestProcessorChain "stored_sig"
    [junit4] 2> 2172032 INFO (TEST-TestArbitraryIndexDir.testLoadNewIndexDir-seed#[7FF6DF1CCEAE89F2]) [ x:collection1] o.a.s.u.p.UpdateRequestProcessorChain inserting DistributedUpdateProcessorFactory into updateRequestProcessorChain "stored_sig"
    [junit4] 2> 2172032 INFO (TEST-TestArbitraryIndexDir.testLoadNewIndexDir-seed#[7FF6DF1CCEAE89F2]) [ x:collection1] o.a.s.u.p.UpdateRequestProcessorChain creating updateRequestProcessorChain "uniq-fields"
    [junit4] 2> 2172032 INFO (TEST-TestArbitraryIndexDir.testLoadNewIndexDir-seed#[7FF6DF1CCEAE89F2]) [ x:collection1] o.a.s.u.p.UpdateRequestProcessorChain inserting DistributedUpdateProcessorFactory into updateRequestProcessorChain "uniq-fields"
    [junit4] 2> 2172032 INFO (TEST-TestArbitraryIndexDir.testLoadNewIndexDir-seed#[7FF6DF1CCEAE89F2]) [ x:collection1] o.a.s.u.p.UpdateRequestProcessorChain creating updateRequestProcessorChain "distrib-dup-test-chain-explicit"
    [junit4] 2> 2172032 INFO (TEST-TestArbitraryIndexDir.testLoadNewIndexDir-seed#[7FF6DF1CCEAE89F2]) [ x:collection1] o.a.s.u.p.UpdateRequestProcessorChain creating updateRequestProcessorChain "distrib-dup-test-chain-implicit"
    [junit4] 2> 2172033 INFO (TEST-TestArbitraryIndexDir.testLoadNewIndexDir-seed#[7FF6DF1CCEAE89F2]) [ x:collection1] o.a.s.u.p.UpdateRequestProcessorChain inserting DistributedUpdateProcessorFactory into updateRequestProcessorChain "distrib-dup-test-chain-implicit"
    [junit4] 2> 2172033 INFO (TEST-TestArbitraryIndexDir.testLoadNewIndexDir-seed#[7FF6DF1CCEAE89F2]) [ x:collection1] o.a.s.c.SolrCore no updateRequestProcessorChain defined as default, creating implicit default
    [junit4] 2> 2172034 INFO (TEST-TestArbitraryIndexDir.testLoadNewIndexDir-seed#[7FF6DF1CCEAE89F2]) [ x:collection1] o.a.s.h.l.XMLLoader xsltCacheLifetimeSeconds=60
    [junit4] 2> 2172035 INFO (TEST-TestArbitraryIndexDir.testLoadNewIndexDir-seed#[7FF6DF1CCEAE89F2]) [ x:collection1] o.a.s.h.l.XMLLoader xsltCacheLifetimeSeconds=60
    [junit4] 2> 2172036 INFO (TEST-TestArbitraryIndexDir.testLoadNewIndexDir-seed#[7FF6DF1CCEAE89F2]) [ x:collection1] o.a.s.h.l.XMLLoader xsltCacheLifetimeSeconds=60
    [junit4] 2> 2172037 INFO (TEST-TestArbitraryIndexDir.testLoadNewIndexDir-seed#[7FF6DF1CCEAE89F2]) [ x:collection1] o.a.s.h.l.XMLLoader xsltCacheLifetimeSeconds=60
    [junit4] 2> 2172038 INFO (TEST-TestArbitraryIndexDir.testLoadNewIndexDir-seed#[7FF6DF1CCEAE89F2]) [ x:collection1] o.a.s.c.CachingDirectoryFactory return new directory for /export/home/jenkins/workspace/Lucene-Solr-6.x-Solaris/solr/build/solr-core/test/J0/temp/solr.core.TestArbitraryIndexDir_7FF6DF1CCEAE89F2-001/init-core-data-001/index_temp
    [junit4] 2> 2172042 INFO (TEST-TestArbitraryIndexDir.testLoadNewIndexDir-seed#[7FF6DF1CCEAE89F2]) [ x:collection1] o.a.s.c.PluginBag requestHandler : 'lazy' created with startup=lazy
    [junit4] 2> 2172044 INFO (TEST-TestArbitraryIndexDir.testLoadNewIndexDir-seed#[7FF6DF1CCEAE89F2]) [ x:collection1] o.a.s.c.RequestHandlers Registered paths: /admin/mbeans,standard,spellCheckCompRH,lazy,/update/json/docs,/admin/luke,/export,spellCheckWithWordbreak_Direct,tvrh,/get,/admin/properties,/update/json,mltrh,/admin/threads,/search-facet-def,/update/csv,/sql,/graph,/search-facet-invariants,/admin/segments,spellCheckCompRH1,/mlt,/admin/system,/replication,dismax,defaults,/config,/stream,/schema,/admin/plugins,/admin/logging,spellCheckWithWordbreak,mock,/admin/ping,/update,/admin/file,/terms,spellCheckCompRH_Direct,/debug/dump
    [junit4] 2> 2172044 INFO (TEST-TestArbitraryIndexDir.testLoadNewIndexDir-seed#[7FF6DF1CCEAE89F2]) [ x:collection1] o.a.s.c.SolrCore Using default statsCache cache: org.apache.solr.search.stats.LocalStatsCache
    [junit4] 2> 2172044 INFO (TEST-TestArbitraryIndexDir.testLoadNewIndexDir-seed#[7FF6DF1CCEAE89F2]) [ x:collection1] o.a.s.u.CommitTracker Hard AutoCommit: disabled
    [junit4] 2> 2172044 INFO (TEST-TestArbitraryIndexDir.testLoadNewIndexDir-seed#[7FF6DF1CCEAE89F2]) [ x:collection1] o.a.s.u.CommitTracker Soft AutoCommit: disabled
    [junit4] 2> 2172045 INFO (TEST-TestArbitraryIndexDir.testLoadNewIndexDir-seed#[7FF6DF1CCEAE89F2]) [ x:collection1] o.a.s.s.SolrIndexSearcher Opening [Searcher@118d5258[collection1] main]
    [junit4] 2> 2172045 INFO (TEST-TestArbitraryIndexDir.testLoadNewIndexDir-seed#[7FF6DF1CCEAE89F2]) [ x:collection1] o.a.s.r.RestManager Initializing RestManager with initArgs: {storageIO=org.apache.solr.rest.ManagedResourceStorage$InMemoryStorageIO}
    [junit4] 2> 2172045 INFO (TEST-TestArbitraryIndexDir.testLoadNewIndexDir-seed#[7FF6DF1CCEAE89F2]) [ x:collection1] o.a.s.r.ManagedResourceStorage Reading _rest_managed.json using InMemoryStorage
    [junit4] 2> 2172045 INFO (TEST-TestArbitraryIndexDir.testLoadNewIndexDir-seed#[7FF6DF1CCEAE89F2]) [ x:collection1] o.a.s.r.RestManager Initializing 0 registered ManagedResources
    [junit4] 2> 2172045 INFO (TEST-TestArbitraryIndexDir.testLoadNewIndexDir-seed#[7FF6DF1CCEAE89F2]) [ x:collection1] o.a.s.h.c.SpellCheckComponent Initializing spell checkers
    [junit4] 2> 2172046 INFO (TEST-TestArbitraryIndexDir.testLoadNewIndexDir-seed#[7FF6DF1CCEAE89F2]) [ x:collection1] o.a.s.s.DirectSolrSpellChecker init: {name=direct,classname=DirectSolrSpellChecker,field=lowerfilt,minQueryLength=3}
    [junit4] 2> 2172050 INFO (TEST-TestArbitraryIndexDir.testLoadNewIndexDir-seed#[7FF6DF1CCEAE89F2]) [ x:collection1] o.a.s.h.ReplicationHandler Commits will be reserved for 10000
    [junit4] 2> 2172051 INFO (searcherExecutor-8221-thread-1-processing-x:collection1) [ x:collection1] o.a.s.h.c.SpellCheckComponent Loading spell index for spellchecker: default
    [junit4] 2> 2172051 INFO (searcherExecutor-8221-thread-1-processing-x:collection1) [ x:collection1] o.a.s.h.c.SpellCheckComponent Loading spell index for spellchecker: direct
    [junit4] 2> 2172051 INFO (searcherExecutor-8221-thread-1-processing-x:collection1) [ x:collection1] o.a.s.h.c.SpellCheckComponent Loading spell index for spellchecker: wordbreak
    [junit4] 2> 2172051 INFO (searcherExecutor-8221-thread-1-processing-x:collection1) [ x:collection1] o.a.s.h.c.SpellCheckComponent Loading spell index for spellchecker: multipleFields
    [junit4] 2> 2172052 INFO (searcherExecutor-8221-thread-1-processing-x:collection1) [ x:collection1] o.a.s.h.c.SpellCheckComponent Loading spell index for spellchecker: jarowinkler
    [junit4] 2> 2172052 INFO (searcherExecutor-8221-thread-1-processing-x:collection1) [ x:collection1] o.a.s.h.c.SpellCheckComponent Loading spell index for spellchecker: external
    [junit4] 2> 2172052 INFO (searcherExecutor-8221-thread-1-processing-x:collection1) [ x:collection1] o.a.s.h.c.SpellCheckComponent Loading spell index for spellchecker: freq
    [junit4] 2> 2172053 INFO (searcherExecutor-8221-thread-1-processing-x:collection1) [ x:collection1] o.a.s.h.c.SpellCheckComponent Loading spell index for spellchecker: fqcn
    [junit4] 2> 2172053 INFO (searcherExecutor-8221-thread-1-processing-x:collection1) [ x:collection1] o.a.s.h.c.SpellCheckComponent Loading spell index for spellchecker: perDict
    [junit4] 2> 2172054 INFO (TEST-TestArbitraryIndexDir.testLoadNewIndexDir-seed#[7FF6DF1CCEAE89F2]) [ x:collection1] o.a.s.u.DefaultSolrCoreState Closing old IndexWriter... core=collection1
    [junit4] 2> 2172055 INFO (TEST-TestArbitraryIndexDir.testLoadNewIndexDir-seed#[7FF6DF1CCEAE89F2]) [ x:collection1] o.a.s.u.RandomMergePolicy RandomMergePolicy wrapping class org.apache.lucene.index.TieredMergePolicy: [TieredMergePolicy: maxMergeAtOnce=20, maxMergeAtOnceExplicit=35, maxMergedSegmentMB=2.3837890625, floorSegmentMB=0.208984375, forceMergeDeletesPctAllowed=20.25205499848833, segmentsPerTier=31.0, maxCFSSegmentSizeMB=8.796093022207999E12, noCFSRatio=1.0
    [junit4] 2> 2172056 INFO (TEST-TestArbitraryIndexDir.testLoadNewIndexDir-seed#[7FF6DF1CCEAE89F2]) [ x:collection1] o.a.s.c.SolrDeletionPolicy SolrDeletionPolicy.onInit: commits: num=1
    [junit4] 2> commit{dir=MockDirectoryWrapper(NIOFSDirectory@/export/home/jenkins/workspace/Lucene-Solr-6.x-Solaris/solr/build/solr-core/test/J0/temp/solr.core.TestArbitraryIndexDir_7FF6DF1CCEAE89F2-001/init-core-data-001/index_temp lockFactory=org.apache.lucene.store.SingleInstanceLockFactory@531ffdf7),segFN=segments_1,generation=1}
    [junit4] 2> 2172056 INFO (TEST-TestArbitraryIndexDir.testLoadNewIndexDir-seed#[7FF6DF1CCEAE89F2]) [ x:collection1] o.a.s.c.SolrDeletionPolicy newest commit generation = 1
    [junit4] 2> 2172057 INFO (TEST-TestArbitraryIndexDir.testLoadNewIndexDir-seed#[7FF6DF1CCEAE89F2]) [ x:collection1] o.a.s.u.DefaultSolrCoreState New IndexWriter is ready to be used.
    [junit4] 2> 2172057 WARN (TEST-TestArbitraryIndexDir.testLoadNewIndexDir-seed#[7FF6DF1CCEAE89F2]) [ x:collection1] o.a.s.c.SolrCore [collection1] PERFORMANCE WARNING: Overlapping onDeckSearchers=2
    [junit4] 2> 2172058 INFO (TEST-TestArbitraryIndexDir.testLoadNewIndexDir-seed#[7FF6DF1CCEAE89F2]) [ x:collection1] o.a.s.s.SolrIndexSearcher Opening [Searcher@4d29b767[collection1] main]
    [junit4] 2> 2172058 INFO (TEST-TestArbitraryIndexDir.testLoadNewIndexDir-seed#[7FF6DF1CCEAE89F2]) [ x:collection1] o.a.s.c.CoreContainer replacing core: collection1
    [junit4] 2> 2172058 INFO (TEST-TestArbitraryIndexDir.testLoadNewIndexDir-seed#[7FF6DF1CCEAE89F2]) [ x:collection1] o.a.s.c.SolrCore [collection1] CLOSING SolrCore org.apache.solr.core.SolrCore@1625c3db
    [junit4] 2> 2172058 INFO (TEST-TestArbitraryIndexDir.testLoadNewIndexDir-seed#[7FF6DF1CCEAE89F2]) [ x:collection1] o.a.s.u.DirectUpdateHandler2 closing DirectUpdateHandler2{commits=1,autocommits=0,soft autocommits=0,optimizes=0,rollbacks=0,expungeDeletes=0,docsPending=0,adds=0,deletesById=0,deletesByQuery=0,errors=0,cumulative_adds=1,cumulative_deletesById=0,cumulative_deletesByQuery=0,cumulative_errors=0}
    [junit4] 2> 2172058 INFO (TEST-TestArbitraryIndexDir.testLoadNewIndexDir-seed#[7FF6DF1CCEAE89F2]) [ x:collection1] o.a.s.c.SolrCore [collection1] Closing main searcher on request.
    [junit4] 2> 2172060 INFO (searcherExecutor-8221-thread-1-processing-x:collection1) [ x:collection1] o.a.s.c.SolrCore [collection1] Registered new searcher Searcher@118d5258[collection1] main{ExitableDirectoryReader(UninvertingDirectoryReader(Uninverting(_0(6.2.0):c1)))}
    [junit4] 2> 2172060 INFO (searcherExecutor-8221-thread-1-processing-x:collection1) [ x:collection1] o.a.s.h.c.SpellCheckComponent Loading spell index for spellchecker: default
    [junit4] 2> 2172061 INFO (searcherExecutor-8221-thread-1-processing-x:collection1) [ x:collection1] o.a.s.h.c.SpellCheckComponent Loading spell index for spellchecker: direct
    [junit4] 2> 2172061 INFO (searcherExecutor-8221-thread-1-processing-x:collection1) [ x:collection1] o.a.s.h.c.SpellCheckComponent Loading spell index for spellchecker: wordbreak
    [junit4] 2> 2172061 INFO (searcherExecutor-8221-thread-1-processing-x:collection1) [ x:collection1] o.a.s.h.c.SpellCheckComponent Loading spell index for spellchecker: multipleFields
    [junit4] 2> 2172063 INFO (searcherExecutor-8221-thread-1-processing-x:collection1) [ x:collection1] o.a.s.h.c.SpellCheckComponent Loading spell index for spellchecker: jarowinkler
    [junit4] 2> 2172064 INFO (searcherExecutor-8221-thread-1-processing-x:collection1) [ x:collection1] o.a.s.h.c.SpellCheckComponent Loading spell index for spellchecker: external
    [junit4] 2> 2172065 INFO (searcherExecutor-8221-thread-1-processing-x:collection1) [ x:collection1] o.a.s.h.c.SpellCheckComponent Loading spell index for spellchecker: freq
    [junit4] 2> 2172068 INFO (TEST-TestArbitraryIndexDir.testLoadNewIndexDir-seed#[7FF6DF1CCEAE89F2]) [ x:collection1] o.a.s.c.S.Request [collection1] webapp=null path=null params={q=id:2&qt=standard&start=0&rows=20&version=2.2} hits=0 status=0 QTime=0
    [junit4] 2> 2172068 INFO (searcherExecutor-8221-thread-1-processing-x:collection1) [ x:collection1] o.a.s.h.c.SpellCheckComponent Loading spell index for spellchecker: fqcn
    [junit4] 2> 2172068 ERROR (TEST-TestArbitraryIndexDir.testLoadNewIndexDir-seed#[7FF6DF1CCEAE89F2]) [ x:collection1] o.a.s.SolrTestCaseJ4 REQUEST FAILED: xpath=*[count(//doc)=1]
    [junit4] 2> xml response was: <?xml version="1.0" encoding="UTF-8"?>
    [junit4] 2> <response>
    [junit4] 2> <lst name="responseHeader"><int name="status">0</int><int name="QTime">0</int></lst><result name="response" numFound="0" start="0"></result>
    [junit4] 2> </response>
    [junit4] 2>
    [junit4] 2> request was:q=id:2&qt=standard&start=0&rows=20&version=2.2
    [junit4] 2> 2172068 ERROR (TEST-TestArbitraryIndexDir.testLoadNewIndexDir-seed#[7FF6DF1CCEAE89F2]) [ x:collection1] o.a.s.SolrTestCaseJ4 REQUEST FAILED: q=id:2&qt=standard&start=0&rows=20&version=2.2:java.lang.RuntimeException: REQUEST FAILED: xpath=*[count(//doc)=1]
    [junit4] 2> xml response was: <?xml version="1.0" encoding="UTF-8"?>
    [junit4] 2> <response>
    [junit4] 2> <lst name="responseHeader"><int name="status">0</int><int name="QTime">0</int></lst><result name="response" numFound="0" start="0"></result>
    [junit4] 2> </response>
    [junit4] 2>
    [junit4] 2> request was:q=id:2&qt=standard&start=0&rows=20&version=2.2
    [junit4] 2> at org.apache.solr.SolrTestCaseJ4.assertQ(SolrTestCaseJ4.java:774)
    [junit4] 2> at org.apache.solr.core.TestArbitraryIndexDir.testLoadNewIndexDir(TestArbitraryIndexDir.java:107)
    [junit4] 2> at sun.reflect.NativeMethodAccessorImpl.invoke0(Native Method)
    [junit4] 2> at sun.reflect.NativeMethodAccessorImpl.invoke(NativeMethodAccessorImpl.java:62)
    [junit4] 2> at sun.reflect.DelegatingMethodAccessorImpl.invoke(DelegatingMethodAccessorImpl.java:43)
    [junit4] 2> at java.lang.reflect.Method.invoke(Method.java:498)
    [junit4] 2> at com.carrotsearch.randomizedtesting.RandomizedRunner.invoke(RandomizedRunner.java:1764)
    [junit4] 2> at com.carrotsearch.randomizedtesting.RandomizedRunner$8.evaluate(RandomizedRunner.java:871)
    [junit4] 2> at com.carrotsearch.randomizedtesting.RandomizedRunner$9.evaluate(RandomizedRunner.java:907)
    [junit4] 2> at com.carrotsearch.randomizedtesting.RandomizedRunner$10.evaluate(RandomizedRunner.java:921)
    [junit4] 2> at com.carrotsearch.randomizedtesting.rules.SystemPropertiesRestoreRule$1.evaluate(SystemPropertiesRestoreRule.java:57)
    [junit4] 2> at com.carrotsearch.randomizedtesting.rules.SystemPropertiesRestoreRule$1.evaluate(SystemPropertiesRestoreRule.java:57)
    [junit4] 2> at org.apache.lucene.util.TestRuleSetupTeardownChained$1.evaluate(TestRuleSetupTeardownChained.java:49)
    [junit4] 2> at org.apache.lucene.util.AbstractBeforeAfterRule$1.evaluate(AbstractBeforeAfterRule.java:45)
    [junit4] 2> at org.apache.lucene.util.TestRuleThreadAndTestName$1.evaluate(TestRuleThreadAndTestName.java:48)
    [junit4] 2> at org.apache.lucene.util.TestRuleIgnoreAfterMaxFailures$1.evaluate(TestRuleIgnoreAfterMaxFailures.java:64)
    [junit4] 2> at org.apache.lucene.util.TestRuleMarkFailure$1.evaluate(TestRuleMarkFailure.java:47)
    [junit4] 2> at com.carrotsearch.randomizedtesting.rules.StatementAdapter.evaluate(StatementAdapter.java:36)
    [junit4] 2> at com.carrotsearch.randomizedtesting.ThreadLeakControl$StatementRunner.run(ThreadLeakControl.java:367)
    [junit4] 2> at com.carrotsearch.randomizedtesting.ThreadLeakControl.forkTimeoutingTask(ThreadLeakControl.java:809)
    [junit4] 2> at com.carrotsearch.randomizedtesting.ThreadLeakControl$3.evaluate(ThreadLeakControl.java:460)
    [junit4] 2> at com.carrotsearch.randomizedtesting.RandomizedRunner.runSingleTest(RandomizedRunner.java:880)
    [junit4] 2> at com.carrotsearch.randomizedtesting.RandomizedRunner$5.evaluate(RandomizedRunner.java:781)
    [junit4] 2> at com.carrotsearch.randomizedtesting.RandomizedRunner$6.evaluate(RandomizedRunner.java:816)
    [junit4] 2> at com.carrotsearch.randomizedtesting.RandomizedRunner$7.evaluate(RandomizedRunner.java:827)
    [junit4] 2> at com.carrotsearch.randomizedtesting.rules.StatementAdapter.evaluate(StatementAdapter.java:36)
    [junit4] 2> at com.carrotsearch.randomizedtesting.rules.SystemPropertiesRestoreRule$1.evaluate(SystemPropertiesRestoreRule.java:57)
    [junit4] 2> at org.apache.lucene.util.AbstractBeforeAfterRule$1.evaluate(AbstractBeforeAfterRule.java:45)
    [junit4] 2> at com.carrotsearch.randomizedtesting.rules.StatementAdapter.evaluate(StatementAdapter.java:36)
    [junit4] 2> at org.apache.lucene.util.TestRuleStoreClassName$1.evaluate(TestRuleStoreClassName.java:41)
    [junit4] 2> at com.carrotsearch.randomizedtesting.rules.NoShadowingOrOverridesOnMethodsRule$1.evaluate(NoShadowingOrOverridesOnMethodsRule.java:40)
    [junit4] 2> at com.carrotsearch.randomizedtesting.rules.NoShadowingOrOverridesOnMethodsRule$1.evaluate(NoShadowingOrOverridesOnMethodsRule.java:40)
    [junit4] 2> at com.carrotsearch.randomizedtesting.rules.StatementAdapter.evaluate(StatementAdapter.java:36)
    [junit4] 2> at com.carrotsearch.randomizedtesting.rules.StatementAdapter.evaluate(StatementAdapter.java:36)
    [junit4] 2> at com.carrotsearch.randomizedtesting.rules.StatementAdapter.evaluate(StatementAdapter.java:36)
    [junit4] 2> at org.apache.lucene.util.TestRuleAssertionsRequired$1.evaluate(TestRuleAssertionsRequired.java:53)
    [junit4] 2> at org.apache.lucene.util.TestRuleMarkFailure$1.evaluate(TestRuleMarkFailure.java:47)
    [junit4] 2> at org.apache.lucene.util.TestRuleIgnoreAfterMaxFailures$1.evaluate(TestRuleIgnoreAfterMaxFailures.java:64)
    [junit4] 2> at org.apache.lucene.util.TestRuleIgnoreTestSuites$1.evaluate(TestRuleIgnoreTestSuites.java:54)
    [junit4] 2> at com.carrotsearch.randomizedtesting.rules.StatementAdapter.evaluate(StatementAdapter.java:36)
    [junit4] 2> at com.carrotsearch.randomizedtesting.ThreadLeakControl$StatementRunner.run(ThreadLeakControl.java:367)
    [junit4] 2> at java.lang.Thread.run(Thread.java:745)
    [junit4] 2>
    [junit4] 2> 2172069 INFO (TEST-TestArbitraryIndexDir.testLoadNewIndexDir-seed#[7FF6DF1CCEAE89F2]) [ x:collection1] o.a.s.SolrTestCaseJ4 ###Ending testLoadNewIndexDir
    [junit4] 2> 2172072 INFO (searcherExecutor-8221-thread-1-processing-x:collection1) [ x:collection1] o.a.s.h.c.SpellCheckComponent Loading spell index for spellchecker: perDict
    [junit4] 2> 2172072 INFO (searcherExecutor-8221-thread-1-processing-x:collection1) [ x:collection1] o.a.s.c.SolrCore [collection1] Registered new searcher Searcher@4d29b767[collection1] main{ExitableDirectoryReader(UninvertingDirectoryReader(Uninverting(_0(6.2.0):c1)))}
    [junit4] 2> NOTE: reproduce with: ant test -Dtestcase=TestArbitraryIndexDir -Dtests.method=testLoadNewIndexDir -Dtests.seed=7FF6DF1CCEAE89F2 -Dtests.slow=true -Dtests.locale=es-BO -Dtests.timezone=Asia/Urumqi -Dtests.asserts=true -Dtests.file.encoding=ISO-8859-1
    [junit4] ERROR 0.77s J0 | TestArbitraryIndexDir.testLoadNewIndexDir <<<
    [junit4] > Throwable #1: java.lang.RuntimeException: Exception during query
    [junit4] > at __randomizedtesting.SeedInfo.seed([7FF6DF1CCEAE89F2:96AC64245037195A]:0)
    [junit4] > at org.apache.solr.SolrTestCaseJ4.assertQ(SolrTestCaseJ4.java:781)
    [junit4] > at org.apache.solr.core.TestArbitraryIndexDir.testLoadNewIndexDir(TestArbitraryIndexDir.java:107)
    [junit4] > at java.lang.Thread.run(Thread.java:745)
    [junit4] > Caused by: java.lang.RuntimeException: REQUEST FAILED: xpath=*[count(//doc)=1]
    [junit4] > xml response was: <?xml version="1.0" encoding="UTF-8"?>
    [junit4] > <response>
    [junit4] > <lst name="responseHeader"><int name="status">0</int><int name="QTime">0</int></lst><result name="response" numFound="0" start="0"></result>
    [junit4] > </response>
    [junit4] > request was:q=id:2&qt=standard&start=0&rows=20&version=2.2
    [junit4] > at org.apache.solr.SolrTestCaseJ4.assertQ(SolrTestCaseJ4.java:774)
    [junit4] > ... 41 more
    [junit4] 2> 2172074 INFO (SUITE-TestArbitraryIndexDir-seed#[7FF6DF1CCEAE89F2]-worker) [ x:collection1] o.a.s.SolrTestCaseJ4 ###deleteCore
    [junit4] 2> 2172074 INFO (SUITE-TestArbitraryIndexDir-seed#[7FF6DF1CCEAE89F2]-worker) [ x:collection1] o.a.s.c.CoreContainer Shutting down CoreContainer instance=1926960332
    [junit4] 2> 2172074 INFO (coreCloseExecutor-8225-thread-1-processing-x:collection1) [ x:collection1] o.a.s.c.SolrCore [collection1] CLOSING SolrCore org.apache.solr.core.SolrCore@550ae9d5
    [junit4] 2> 2172074 INFO (coreCloseExecutor-8225-thread-1-processing-x:collection1) [ x:collection1] o.a.s.u.DirectUpdateHandler2 closing DirectUpdateHandler2{commits=0,autocommits=0,soft autocommits=0,optimizes=0,rollbacks=0,expungeDeletes=0,docsPending=0,adds=0,deletesById=0,deletesByQuery=0,errors=0,cumulative_adds=0,cumulative_deletesById=0,cumulative_deletesByQuery=0,cumulative_errors=0}
    [junit4] 2> 2172074 INFO (coreCloseExecutor-8225-thread-1-processing-x:collection1) [ x:collection1] o.a.s.u.SolrCoreState Closing SolrCoreState
    [junit4] 2> 2172074 INFO (coreCloseExecutor-8225-thread-1-processing-x:collection1) [ x:collection1] o.a.s.u.DefaultSolrCoreState SolrCoreState ref count has reached 0 - closing IndexWriter
    [junit4] 2> 2172074 INFO (coreCloseExecutor-8225-thread-1-processing-x:collection1) [ x:collection1] o.a.s.u.DefaultSolrCoreState closing IndexWriter with IndexWriterCloser
    [junit4] 2> 2172075 INFO (coreCloseExecutor-8225-thread-1-processing-x:collection1) [ x:collection1] o.a.s.c.SolrCore [collection1] Closing main searcher on request.
    [junit4] 2> 2172083 INFO (coreCloseExecutor-8225-thread-1-processing-x:collection1) [ x:collection1] o.a.s.c.CachingDirectoryFactory Closing MockFSDirectoryFactory - 3 directories currently being tracked
    [junit4] 2> 2172084 INFO (coreCloseExecutor-8225-thread-1-processing-x:collection1) [ x:collection1] o.a.s.c.CachingDirectoryFactory looking to close /export/home/jenkins/workspace/Lucene-Solr-6.x-Solaris/solr/build/solr-core/test/J0/temp/solr.core.TestArbitraryIndexDir_7FF6DF1CCEAE89F2-001/init-core-data-001/index_temp [CachedDir<<refCount=0;path=/export/home/jenkins/workspace/Lucene-Solr-6.x-Solaris/solr/build/solr-core/test/J0/temp/solr.core.TestArbitraryIndexDir_7FF6DF1CCEAE89F2-001/init-core-data-001/index_temp;done=false>>]
    [junit4] 2> 2172084 INFO (coreCloseExecutor-8225-thread-1-processing-x:collection1) [ x:collection1] o.a.s.c.CachingDirectoryFactory Closing directory, CoreContainer#isShutdown=true
    [junit4] 2> 2172084 INFO (coreCloseExecutor-8225-thread-1-processing-x:collection1) [ x:collection1] o.a.s.c.CachingDirectoryFactory Closing directory: /export/home/jenkins/workspace/Lucene-Solr-6.x-Solaris/solr/build/solr-core/test/J0/temp/solr.core.TestArbitraryIndexDir_7FF6DF1CCEAE89F2-001/init-core-data-001/index_temp
    [junit4] 2> 2172086 INFO (coreCloseExecutor-8225-thread-1-processing-x:collection1) [ x:collection1] o.a.s.c.CachingDirectoryFactory looking to close /export/home/jenkins/workspace/Lucene-Solr-6.x-Solaris/solr/build/solr-core/test/J0/temp/solr.core.TestArbitraryIndexDir_7FF6DF1CCEAE89F2-001/init-core-data-001/index [CachedDir<<refCount=0;path=/export/home/jenkins/workspace/Lucene-Solr-6.x-Solaris/solr/build/solr-core/test/J0/temp/solr.core.TestArbitraryIndexDir_7FF6DF1CCEAE89F2-001/init-core-data-001/index;done=false>>]
    [junit4] 2> 2172086 INFO (coreCloseExecutor-8225-thread-1-processing-x:collection1) [ x:collection1] o.a.s.c.CachingDirectoryFactory Closing directory, CoreContainer#isShutdown=true
    [junit4] 2> 2172086 INFO (coreCloseExecutor-8225-thread-1-processing-x:collection1) [ x:collection1] o.a.s.c.CachingDirectoryFactory Closing directory: /export/home/jenkins/workspace/Lucene-Solr-6.x-Solaris/solr/build/solr-core/test/J0/temp/solr.core.TestArbitraryIndexDir_7FF6DF1CCEAE89F2-001/init-core-data-001/index
    [junit4] 2> 2172087 INFO (coreCloseExecutor-8225-thread-1-processing-x:collection1) [ x:collection1] o.a.s.c.CachingDirectoryFactory looking to close /export/home/jenkins/workspace/Lucene-Solr-6.x-Solaris/solr/build/solr-core/test/J0/temp/solr.core.TestArbitraryIndexDir_7FF6DF1CCEAE89F2-001/init-core-data-001 [CachedDir<<refCount=0;path=/export/home/jenkins/workspace/Lucene-Solr-6.x-Solaris/solr/build/solr-core/test/J0/temp/solr.core.TestArbitraryIndexDir_7FF6DF1CCEAE89F2-001/init-core-data-001;done=false>>]
    [junit4] 2> 2172087 INFO (coreCloseExecutor-8225-thread-1-processing-x:collection1) [ x:collection1] o.a.s.c.CachingDirectoryFactory Closing directory, CoreContainer#isShutdown=true
    [junit4] 2> 2172087 INFO (coreCloseExecutor-8225-thread-1-processing-x:collection1) [ x:collection1] o.a.s.c.CachingDirectoryFactory Closing directory: /export/home/jenkins/workspace/Lucene-Solr-6.x-Solaris/solr/build/solr-core/test/J0/temp/solr.core.TestArbitraryIndexDir_7FF6DF1CCEAE89F2-001/init-core-data-001
    [junit4] 2> NOTE: leaving temporary files on disk at: /export/home/jenkins/workspace/Lucene-Solr-6.x-Solaris/solr/build/solr-core/test/J0/temp/solr.core.TestArbitraryIndexDir_7FF6DF1CCEAE89F2-001
    [junit4] 2> NOTE: test params are: codec=CheapBastard, sim=RandomSimilarity(queryNorm=true,coord=crazy): {}, locale=es-BO, timezone=Asia/Urumqi
    [junit4] 2> NOTE: SunOS 5.11 amd64/Oracle Corporation 1.8.0_92 (64-bit)/cpus=3,threads=1,free=145769248,total=536870912
    [junit4] 2> NOTE: All tests run in this JVM: [RulesTest, DisMaxRequestHandlerTest, StressHdfsTest, TestSolrDynamicMBean, TestXIncludeConfig, FullHLLTest, TestMinMaxOnMultiValuedField, AddBlockUpdateTest, SampleTest, TestAuthorizationFramework, DistributedSuggestComponentTest, BlockDirectoryTest, TestCryptoKeys, TestMaxScoreQueryParser, TestDefaultSearchFieldResource, SolrIndexConfigTest, ParsingFieldUpdateProcessorsTest, BasicDistributedZkTest, SyncSliceTest, CursorPagingTest, TestSweetSpotSimilarityFactory, SchemaVersionSpecificBehaviorTest, AsyncMigrateRouteKeyTest, PeerSyncTest, TestSolrQueryResponse, XsltUpdateRequestHandlerTest, TestReplicationHandler, HLLUtilTest, OverseerStatusTest, ZkCLITest, HdfsUnloadDistributedZkTest, TestBulkSchemaConcurrent, ClusterStateTest, TestLFUCache, TriLevelCompositeIdRoutingTest, IndexBasedSpellCheckerTest, TestSortByMinMaxFunction, ZkStateReaderTest, TestMiniSolrCloudClusterBase, TestGeoJSONResponseWriter, MoreLikeThisHandlerTest, PrimitiveFieldTypeTest, LeaderElectionTest, TestUniqueKeyFieldResource, HdfsThreadLeakTest, DistributedVersionInfoTest, RequiredFieldsTest, TestShardHandlerFactory, TestJsonRequest, CursorMarkTest, TestDocBasedVersionConstraints, CdcrUpdateLogTest, TestNoOpRegenerator, TestStressReorder, EnumFieldTest, HdfsCollectionsAPIDistributedZkTest, TestNamedUpdateProcessors, DocExpirationUpdateProcessorFactoryTest, HdfsChaosMonkeyNothingIsSafeTest, TestObjectReleaseTracker, TestFunctionQuery, TestSolrCloudWithKerberosAlt, HdfsRestartWhileUpdatingTest, DistributedQueryElevationComponentTest, RegexBoostProcessorTest, AddSchemaFieldsUpdateProcessorFactoryTest, TestLMDirichletSimilarityFactory, OutOfBoxZkACLAndCredentialsProvidersTest, TestRestManager, TestTolerantSearch, CustomCollectionTest, HdfsDirectoryFactoryTest, CloudExitableDirectoryReaderTest, TestManagedSchemaAPI, TestMacros, DocumentBuilderTest, ConnectionManagerTest, ShardRoutingTest, WrapperMergePolicyFactoryTest, TestDocTermOrds, TestLeaderElectionZkExpiry, HighlighterTest, TestGroupingSearch, TestPseudoReturnFields, TestFilteredDocIdSet, TestShortCircuitedRequests, LeaderInitiatedRecoveryOnCommitTest, SimpleCollectionCreateDeleteTest, ActionThrottleTest, BadComponentTest, TestWordDelimiterFilterFactory, PreAnalyzedFieldTest, DistributedQueryComponentCustomSortTest, TestHdfsUpdateLog, DirectUpdateHandlerTest, SolrCoreTest, TestSolrFieldCacheMBean, PathHierarchyTokenizerFactoryTest, OverseerTest, ExternalFileFieldSortTest, TestScoreJoinQPNoScore, StatelessScriptUpdateProcessorFactoryTest, TestExactStatsCache, FastVectorHighlighterTest, ScriptEngineTest, TestExpandComponent, ReturnFieldsTest, TestFieldTypeResource, PingRequestHandlerTest, OverseerCollectionConfigSetProcessorTest, TestCSVLoader, TestConfig, TestSolrQueryParserDefaultOperatorResource, TestHashQParserPlugin, DateRangeFieldTest, UUIDUpdateProcessorFallbackTest, TestCollectionAPI, QueryElevationComponentTest, DeleteLastCustomShardedReplicaTest, TestUseDocValuesAsStored, TestPhraseSuggestions, DistributedExpandComponentTest, TestMergePolicyConfig, TestSchemaVersionResource, TestRecoveryHdfs, AnalyticsMergeStrategyTest, DOMUtilTest, TestManagedSynonymFilterFactory, SolrRequestParserTest, TestLRUCache, TestXmlQParser, BitVectorTest, TestFieldResource, ReplicationFactorTest, TestDistribIDF, SoftAutoCommitTest, TestRuleBasedAuthorizationPlugin, TestManagedResource, TestSQLHandler, CdcrRequestHandlerTest, TestReplicaProperties, TestUpdate, TestStressVersions, TestDocumentBuilder, CoreAdminRequestStatusTest, ChaosMonkeySafeLeaderTest, BasicDistributedZk2Test, CollectionsAPIDistributedZkTest, TestDistributedGrouping, TestFaceting, TestRecovery, TestHashPartitioner, TermVectorComponentDistributedTest, TestRealTimeGet, DistributedTermsComponentTest, TestSolr4Spatial, SpellCheckComponentTest, BadIndexSchemaTest, ConvertedLegacyTest, TestFiltering, BasicFunctionalityTest, TestBadConfig, ShowFileRequestHandlerTest, TestCoreDiscovery, TestExtendedDismaxParser, SuggesterTest, TestStressLucene, TestTrie, SpatialFilterTest, SuggesterWFSTTest, PolyFieldTest, NoCacheHeaderTest, FieldMutatingUpdateProcessorTest, QueryEqualityTest, DirectUpdateHandlerOptimizeTest, DefaultValueUpdateProcessorTest, TestRemoteStreaming, TestSolrDeletionPolicy1, DebugComponentTest, TestSurroundQueryParser, TestQueryUtils, StandardRequestHandlerTest, DirectSolrSpellCheckerTest, TestQueryTypes, TermsComponentTest, TermVectorComponentTest, TestSolrQueryParser, TestArbitraryIndexDir]
    [junit4] Completed [383/615 (1!)] on J0 in 0.79s, 1 test, 1 error <<< FAILURES!

[...truncated 753 lines...]
BUILD FAILED
/export/home/jenkins/workspace/Lucene-Solr-6.x-Solaris/build.xml:740: The following error occurred while executing this line:
/export/home/jenkins/workspace/Lucene-Solr-6.x-Solaris/build.xml:684: The following error occurred while executing this line:
/export/home/jenkins/workspace/Lucene-Solr-6.x-Solaris/build.xml:59: The following error occurred while executing this line:
/export/home/jenkins/workspace/Lucene-Solr-6.x-Solaris/solr/build.xml:233: The following error occurred while executing this line:
/export/home/jenkins/workspace/Lucene-Solr-6.x-Solaris/solr/common-build.xml:531: The following error occurred while executing this line:
/export/home/jenkins/workspace/Lucene-Solr-6.x-Solaris/lucene/common-build.xml:1427: The following error occurred while executing this line:
/export/home/jenkins/workspace/Lucene-Solr-6.x-Solaris/lucene/common-build.xml:984: There were test failures: 615 suites (10 ignored), 2591 tests, 1 error, 87 ignored (72 assumptions) [seed: 7FF6DF1CCEAE89F2]

Total time: 80 minutes 53 seconds
Build step 'Invoke Ant' marked build as failure
Archiving artifacts
[WARNINGS] Skipping publisher since build result is FAILURE
Recording test results
Email was triggered for: Failure - Any
Sending email for trigger: Failure - Any

Search Discussions

Discussion Posts

Previous

Follow ups

Related Discussions

Discussion Navigation
viewthread | post
posts ‹ prev | 3 of 4 | next ›
Discussion Overview
groupdev @
categorieslucene
postedJun 15, '16 at 1:54p
activeJun 16, '16 at 10:24p
posts4
users1
websitelucene.apache.org

1 user in discussion

Policeman Jenkins Server: 4 posts

People

Translate

site design / logo © 2017 Grokbase