Grokbase Groups Lucene dev June 2016
FAQ
Build: http://jenkins.thetaphi.de/job/Lucene-Solr-master-Windows/5914/
Java: 32bit/jdk1.8.0_92 -server -XX:+UseConcMarkSweepGC

14 tests failed.
FAILED: org.apache.solr.cloud.ChaosMonkeySafeLeaderTest.test

Error Message:
java.util.concurrent.TimeoutException: Could not connect to ZooKeeper 127.0.0.1:60800/solr within 10000 ms

Stack Trace:
org.apache.solr.common.SolrException: java.util.concurrent.TimeoutException: Could not connect to ZooKeeper 127.0.0.1:60800/solr within 10000 ms
  at org.apache.solr.common.cloud.SolrZkClient.(SolrZkClient.java:114)
  at org.apache.solr.common.cloud.SolrZkClient.(ZkStateReader.java:227)
  at org.apache.solr.client.solrj.impl.CloudSolrClient.connect(CloudSolrClient.java:502)
  at org.apache.solr.client.solrj.impl.CloudSolrClient.requestWithRetryOnStaleState(CloudSolrClient.java:951)
  at org.apache.solr.client.solrj.impl.CloudSolrClient.request(CloudSolrClient.java:934)
  at org.apache.solr.client.solrj.SolrClient.request(SolrClient.java:1219)
  at org.apache.solr.cloud.AbstractFullDistribZkTestBase.createCollection(AbstractFullDistribZkTestBase.java:1599)
  at org.apache.solr.cloud.AbstractFullDistribZkTestBase.createCollection(AbstractFullDistribZkTestBase.java:1620)
  at org.apache.solr.cloud.ChaosMonkeySafeLeaderTest.test(ChaosMonkeySafeLeaderTest.java:176)
  at sun.reflect.NativeMethodAccessorImpl.invoke0(Native Method)
  at sun.reflect.NativeMethodAccessorImpl.invoke(NativeMethodAccessorImpl.java:62)
  at sun.reflect.DelegatingMethodAccessorImpl.invoke(DelegatingMethodAccessorImpl.java:43)
  at java.lang.reflect.Method.invoke(Method.java:498)
  at com.carrotsearch.randomizedtesting.RandomizedRunner.invoke(RandomizedRunner.java:1764)
  at com.carrotsearch.randomizedtesting.RandomizedRunner$8.evaluate(RandomizedRunner.java:871)
  at com.carrotsearch.randomizedtesting.RandomizedRunner$9.evaluate(RandomizedRunner.java:907)
  at com.carrotsearch.randomizedtesting.RandomizedRunner$10.evaluate(RandomizedRunner.java:921)
  at org.apache.solr.BaseDistributedSearchTestCase$ShardsRepeatRule$ShardsFixedStatement.callStatement(BaseDistributedSearchTestCase.java:985)
  at org.apache.solr.BaseDistributedSearchTestCase$ShardsRepeatRule$ShardsStatement.evaluate(BaseDistributedSearchTestCase.java:960)
  at com.carrotsearch.randomizedtesting.rules.SystemPropertiesRestoreRule$1.evaluate(SystemPropertiesRestoreRule.java:57)
  at org.apache.lucene.util.TestRuleSetupTeardownChained$1.evaluate(TestRuleSetupTeardownChained.java:49)
  at org.apache.lucene.util.AbstractBeforeAfterRule$1.evaluate(AbstractBeforeAfterRule.java:45)
  at org.apache.lucene.util.TestRuleThreadAndTestName$1.evaluate(TestRuleThreadAndTestName.java:48)
  at org.apache.lucene.util.TestRuleIgnoreAfterMaxFailures$1.evaluate(TestRuleIgnoreAfterMaxFailures.java:64)
  at org.apache.lucene.util.TestRuleMarkFailure$1.evaluate(TestRuleMarkFailure.java:47)
  at com.carrotsearch.randomizedtesting.rules.StatementAdapter.evaluate(StatementAdapter.java:36)
  at com.carrotsearch.randomizedtesting.ThreadLeakControl$StatementRunner.run(ThreadLeakControl.java:367)
  at com.carrotsearch.randomizedtesting.ThreadLeakControl.forkTimeoutingTask(ThreadLeakControl.java:809)
  at com.carrotsearch.randomizedtesting.ThreadLeakControl$3.evaluate(ThreadLeakControl.java:460)
  at com.carrotsearch.randomizedtesting.RandomizedRunner.runSingleTest(RandomizedRunner.java:880)
  at com.carrotsearch.randomizedtesting.RandomizedRunner$5.evaluate(RandomizedRunner.java:781)
  at com.carrotsearch.randomizedtesting.RandomizedRunner$6.evaluate(RandomizedRunner.java:816)
  at com.carrotsearch.randomizedtesting.RandomizedRunner$7.evaluate(RandomizedRunner.java:827)
  at com.carrotsearch.randomizedtesting.rules.StatementAdapter.evaluate(StatementAdapter.java:36)
  at com.carrotsearch.randomizedtesting.rules.SystemPropertiesRestoreRule$1.evaluate(SystemPropertiesRestoreRule.java:57)
  at org.apache.lucene.util.AbstractBeforeAfterRule$1.evaluate(AbstractBeforeAfterRule.java:45)
  at com.carrotsearch.randomizedtesting.rules.StatementAdapter.evaluate(StatementAdapter.java:36)
  at org.apache.lucene.util.TestRuleStoreClassName$1.evaluate(TestRuleStoreClassName.java:41)
  at com.carrotsearch.randomizedtesting.rules.NoShadowingOrOverridesOnMethodsRule$1.evaluate(NoShadowingOrOverridesOnMethodsRule.java:40)
  at com.carrotsearch.randomizedtesting.rules.NoShadowingOrOverridesOnMethodsRule$1.evaluate(NoShadowingOrOverridesOnMethodsRule.java:40)
  at com.carrotsearch.randomizedtesting.rules.StatementAdapter.evaluate(StatementAdapter.java:36)
  at com.carrotsearch.randomizedtesting.rules.StatementAdapter.evaluate(StatementAdapter.java:36)
  at com.carrotsearch.randomizedtesting.rules.StatementAdapter.evaluate(StatementAdapter.java:36)
  at org.apache.lucene.util.TestRuleAssertionsRequired$1.evaluate(TestRuleAssertionsRequired.java:53)
  at org.apache.lucene.util.TestRuleMarkFailure$1.evaluate(TestRuleMarkFailure.java:47)
  at org.apache.lucene.util.TestRuleIgnoreAfterMaxFailures$1.evaluate(TestRuleIgnoreAfterMaxFailures.java:64)
  at org.apache.lucene.util.TestRuleIgnoreTestSuites$1.evaluate(TestRuleIgnoreTestSuites.java:54)
  at com.carrotsearch.randomizedtesting.rules.StatementAdapter.evaluate(StatementAdapter.java:36)
  at com.carrotsearch.randomizedtesting.ThreadLeakControl$StatementRunner.run(ThreadLeakControl.java:367)
  at java.lang.Thread.run(Thread.java:745)
Caused by: java.util.concurrent.TimeoutException: Could not connect to ZooKeeper 127.0.0.1:60800/solr within 10000 ms
  at org.apache.solr.common.cloud.ConnectionManager.waitForConnected(ConnectionManager.java:228)
  at org.apache.solr.common.cloud.SolrZkClient.<init>(SolrZkClient.java:172)
  ... 51 more


FAILED: org.apache.solr.cloud.TestAuthenticationFramework.testErrorsInStartup

Error Message:
Captured an uncaught exception in thread: Thread[id=11177, name=SyncThread:0, state=RUNNABLE, group=TGRP-TestAuthenticationFramework]

Stack Trace:
com.carrotsearch.randomizedtesting.UncaughtExceptionError: Captured an uncaught exception in thread: Thread[id=11177, name=SyncThread:0, state=RUNNABLE, group=TGRP-TestAuthenticationFramework]
Caused by: java.lang.SecurityException: java.lang.System#exit(11) calls are not allowed because they terminate the test runner's JVM.
  at __randomizedtesting.SeedInfo.seed([F816F89A14095103]:0)
  at org.apache.lucene.util.TestSecurityManager$1.run(TestSecurityManager.java:85)
  at org.apache.lucene.util.TestSecurityManager$1.run(TestSecurityManager.java:52)
  at java.security.AccessController.doPrivileged(Native Method)
  at org.apache.lucene.util.TestSecurityManager.checkExit(TestSecurityManager.java:52)
  at java.lang.Runtime.exit(Runtime.java:107)
  at java.lang.System.exit(System.java:971)
  at org.apache.zookeeper.server.SyncRequestProcessor.run(SyncRequestProcessor.java:185)


FAILED: org.apache.solr.cloud.TestAuthenticationFramework.testSegmentTerminateEarly

Error Message:
java.util.concurrent.TimeoutException: Could not connect to ZooKeeper 127.0.0.1:61232 within 30000 ms

Stack Trace:
org.apache.solr.common.SolrException: java.util.concurrent.TimeoutException: Could not connect to ZooKeeper 127.0.0.1:61232 within 30000 ms
  at org.apache.solr.common.cloud.SolrZkClient.(SolrZkClient.java:114)
  at org.apache.solr.common.cloud.SolrZkClient.(SolrZkClient.java:96)
  at org.apache.solr.cloud.MiniSolrCloudCluster.(MiniSolrCloudCluster.java:113)
  at org.apache.solr.cloud.TestMiniSolrCloudCluster.createMiniSolrCloudCluster(TestMiniSolrCloudCluster.java:93)
  at org.apache.solr.cloud.TestMiniSolrCloudCluster.testSegmentTerminateEarly(TestMiniSolrCloudCluster.java:477)
  at sun.reflect.NativeMethodAccessorImpl.invoke0(Native Method)
  at sun.reflect.NativeMethodAccessorImpl.invoke(NativeMethodAccessorImpl.java:62)
  at sun.reflect.DelegatingMethodAccessorImpl.invoke(DelegatingMethodAccessorImpl.java:43)
  at java.lang.reflect.Method.invoke(Method.java:498)
  at com.carrotsearch.randomizedtesting.RandomizedRunner.invoke(RandomizedRunner.java:1764)
  at com.carrotsearch.randomizedtesting.RandomizedRunner$8.evaluate(RandomizedRunner.java:871)
  at com.carrotsearch.randomizedtesting.RandomizedRunner$9.evaluate(RandomizedRunner.java:907)
  at com.carrotsearch.randomizedtesting.RandomizedRunner$10.evaluate(RandomizedRunner.java:921)
  at com.carrotsearch.randomizedtesting.rules.SystemPropertiesRestoreRule$1.evaluate(SystemPropertiesRestoreRule.java:57)
  at org.apache.lucene.util.TestRuleSetupTeardownChained$1.evaluate(TestRuleSetupTeardownChained.java:49)
  at org.apache.lucene.util.AbstractBeforeAfterRule$1.evaluate(AbstractBeforeAfterRule.java:45)
  at org.apache.lucene.util.TestRuleThreadAndTestName$1.evaluate(TestRuleThreadAndTestName.java:48)
  at org.apache.lucene.util.TestRuleIgnoreAfterMaxFailures$1.evaluate(TestRuleIgnoreAfterMaxFailures.java:64)
  at org.apache.lucene.util.TestRuleMarkFailure$1.evaluate(TestRuleMarkFailure.java:47)
  at com.carrotsearch.randomizedtesting.rules.StatementAdapter.evaluate(StatementAdapter.java:36)
  at com.carrotsearch.randomizedtesting.ThreadLeakControl$StatementRunner.run(ThreadLeakControl.java:367)
  at com.carrotsearch.randomizedtesting.ThreadLeakControl.forkTimeoutingTask(ThreadLeakControl.java:809)
  at com.carrotsearch.randomizedtesting.ThreadLeakControl$3.evaluate(ThreadLeakControl.java:460)
  at com.carrotsearch.randomizedtesting.RandomizedRunner.runSingleTest(RandomizedRunner.java:880)
  at com.carrotsearch.randomizedtesting.RandomizedRunner$5.evaluate(RandomizedRunner.java:781)
  at com.carrotsearch.randomizedtesting.RandomizedRunner$6.evaluate(RandomizedRunner.java:816)
  at com.carrotsearch.randomizedtesting.RandomizedRunner$7.evaluate(RandomizedRunner.java:827)
  at com.carrotsearch.randomizedtesting.rules.StatementAdapter.evaluate(StatementAdapter.java:36)
  at com.carrotsearch.randomizedtesting.rules.SystemPropertiesRestoreRule$1.evaluate(SystemPropertiesRestoreRule.java:57)
  at org.apache.lucene.util.AbstractBeforeAfterRule$1.evaluate(AbstractBeforeAfterRule.java:45)
  at com.carrotsearch.randomizedtesting.rules.StatementAdapter.evaluate(StatementAdapter.java:36)
  at org.apache.lucene.util.TestRuleStoreClassName$1.evaluate(TestRuleStoreClassName.java:41)
  at com.carrotsearch.randomizedtesting.rules.NoShadowingOrOverridesOnMethodsRule$1.evaluate(NoShadowingOrOverridesOnMethodsRule.java:40)
  at com.carrotsearch.randomizedtesting.rules.NoShadowingOrOverridesOnMethodsRule$1.evaluate(NoShadowingOrOverridesOnMethodsRule.java:40)
  at com.carrotsearch.randomizedtesting.rules.StatementAdapter.evaluate(StatementAdapter.java:36)
  at com.carrotsearch.randomizedtesting.rules.StatementAdapter.evaluate(StatementAdapter.java:36)
  at com.carrotsearch.randomizedtesting.rules.StatementAdapter.evaluate(StatementAdapter.java:36)
  at org.apache.lucene.util.TestRuleAssertionsRequired$1.evaluate(TestRuleAssertionsRequired.java:53)
  at org.apache.lucene.util.TestRuleMarkFailure$1.evaluate(TestRuleMarkFailure.java:47)
  at org.apache.lucene.util.TestRuleIgnoreAfterMaxFailures$1.evaluate(TestRuleIgnoreAfterMaxFailures.java:64)
  at org.apache.lucene.util.TestRuleIgnoreTestSuites$1.evaluate(TestRuleIgnoreTestSuites.java:54)
  at com.carrotsearch.randomizedtesting.rules.StatementAdapter.evaluate(StatementAdapter.java:36)
  at com.carrotsearch.randomizedtesting.ThreadLeakControl$StatementRunner.run(ThreadLeakControl.java:367)
  at java.lang.Thread.run(Thread.java:745)
Caused by: java.util.concurrent.TimeoutException: Could not connect to ZooKeeper 127.0.0.1:61232 within 30000 ms
  at org.apache.solr.common.cloud.ConnectionManager.waitForConnected(ConnectionManager.java:228)
  at org.apache.solr.common.cloud.SolrZkClient.<init>(SolrZkClient.java:172)
  ... 46 more


FAILED: org.apache.solr.cloud.TestAuthenticationFramework.testBasics

Error Message:
java.util.concurrent.TimeoutException: Could not connect to ZooKeeper 127.0.0.1:61238 within 30000 ms

Stack Trace:
org.apache.solr.common.SolrException: java.util.concurrent.TimeoutException: Could not connect to ZooKeeper 127.0.0.1:61238 within 30000 ms
  at org.apache.solr.common.cloud.SolrZkClient.(SolrZkClient.java:114)
  at org.apache.solr.common.cloud.SolrZkClient.(SolrZkClient.java:96)
  at org.apache.solr.cloud.MiniSolrCloudCluster.(MiniSolrCloudCluster.java:113)
  at org.apache.solr.cloud.TestMiniSolrCloudCluster.createMiniSolrCloudCluster(TestMiniSolrCloudCluster.java:93)
  at org.apache.solr.cloud.TestMiniSolrCloudCluster.testCollectionCreateSearchDelete(TestMiniSolrCloudCluster.java:129)
  at org.apache.solr.cloud.TestAuthenticationFramework.testBasics(TestAuthenticationFramework.java:94)
  at sun.reflect.NativeMethodAccessorImpl.invoke0(Native Method)
  at sun.reflect.NativeMethodAccessorImpl.invoke(NativeMethodAccessorImpl.java:62)
  at sun.reflect.DelegatingMethodAccessorImpl.invoke(DelegatingMethodAccessorImpl.java:43)
  at java.lang.reflect.Method.invoke(Method.java:498)
  at com.carrotsearch.randomizedtesting.RandomizedRunner.invoke(RandomizedRunner.java:1764)
  at com.carrotsearch.randomizedtesting.RandomizedRunner$8.evaluate(RandomizedRunner.java:871)
  at com.carrotsearch.randomizedtesting.RandomizedRunner$9.evaluate(RandomizedRunner.java:907)
  at com.carrotsearch.randomizedtesting.RandomizedRunner$10.evaluate(RandomizedRunner.java:921)
  at com.carrotsearch.randomizedtesting.rules.SystemPropertiesRestoreRule$1.evaluate(SystemPropertiesRestoreRule.java:57)
  at org.apache.lucene.util.TestRuleSetupTeardownChained$1.evaluate(TestRuleSetupTeardownChained.java:49)
  at org.apache.lucene.util.AbstractBeforeAfterRule$1.evaluate(AbstractBeforeAfterRule.java:45)
  at org.apache.lucene.util.TestRuleThreadAndTestName$1.evaluate(TestRuleThreadAndTestName.java:48)
  at org.apache.lucene.util.TestRuleIgnoreAfterMaxFailures$1.evaluate(TestRuleIgnoreAfterMaxFailures.java:64)
  at org.apache.lucene.util.TestRuleMarkFailure$1.evaluate(TestRuleMarkFailure.java:47)
  at com.carrotsearch.randomizedtesting.rules.StatementAdapter.evaluate(StatementAdapter.java:36)
  at com.carrotsearch.randomizedtesting.ThreadLeakControl$StatementRunner.run(ThreadLeakControl.java:367)
  at com.carrotsearch.randomizedtesting.ThreadLeakControl.forkTimeoutingTask(ThreadLeakControl.java:809)
  at com.carrotsearch.randomizedtesting.ThreadLeakControl$3.evaluate(ThreadLeakControl.java:460)
  at com.carrotsearch.randomizedtesting.RandomizedRunner.runSingleTest(RandomizedRunner.java:880)
  at com.carrotsearch.randomizedtesting.RandomizedRunner$5.evaluate(RandomizedRunner.java:781)
  at com.carrotsearch.randomizedtesting.RandomizedRunner$6.evaluate(RandomizedRunner.java:816)
  at com.carrotsearch.randomizedtesting.RandomizedRunner$7.evaluate(RandomizedRunner.java:827)
  at com.carrotsearch.randomizedtesting.rules.StatementAdapter.evaluate(StatementAdapter.java:36)
  at com.carrotsearch.randomizedtesting.rules.SystemPropertiesRestoreRule$1.evaluate(SystemPropertiesRestoreRule.java:57)
  at org.apache.lucene.util.AbstractBeforeAfterRule$1.evaluate(AbstractBeforeAfterRule.java:45)
  at com.carrotsearch.randomizedtesting.rules.StatementAdapter.evaluate(StatementAdapter.java:36)
  at org.apache.lucene.util.TestRuleStoreClassName$1.evaluate(TestRuleStoreClassName.java:41)
  at com.carrotsearch.randomizedtesting.rules.NoShadowingOrOverridesOnMethodsRule$1.evaluate(NoShadowingOrOverridesOnMethodsRule.java:40)
  at com.carrotsearch.randomizedtesting.rules.NoShadowingOrOverridesOnMethodsRule$1.evaluate(NoShadowingOrOverridesOnMethodsRule.java:40)
  at com.carrotsearch.randomizedtesting.rules.StatementAdapter.evaluate(StatementAdapter.java:36)
  at com.carrotsearch.randomizedtesting.rules.StatementAdapter.evaluate(StatementAdapter.java:36)
  at com.carrotsearch.randomizedtesting.rules.StatementAdapter.evaluate(StatementAdapter.java:36)
  at org.apache.lucene.util.TestRuleAssertionsRequired$1.evaluate(TestRuleAssertionsRequired.java:53)
  at org.apache.lucene.util.TestRuleMarkFailure$1.evaluate(TestRuleMarkFailure.java:47)
  at org.apache.lucene.util.TestRuleIgnoreAfterMaxFailures$1.evaluate(TestRuleIgnoreAfterMaxFailures.java:64)
  at org.apache.lucene.util.TestRuleIgnoreTestSuites$1.evaluate(TestRuleIgnoreTestSuites.java:54)
  at com.carrotsearch.randomizedtesting.rules.StatementAdapter.evaluate(StatementAdapter.java:36)
  at com.carrotsearch.randomizedtesting.ThreadLeakControl$StatementRunner.run(ThreadLeakControl.java:367)
  at java.lang.Thread.run(Thread.java:745)
Caused by: java.util.concurrent.TimeoutException: Could not connect to ZooKeeper 127.0.0.1:61238 within 30000 ms
  at org.apache.solr.common.cloud.ConnectionManager.waitForConnected(ConnectionManager.java:228)
  at org.apache.solr.common.cloud.SolrZkClient.<init>(SolrZkClient.java:172)
  ... 47 more


FAILED: org.apache.solr.cloud.TestAuthenticationFramework.testCollectionCreateSearchDelete

Error Message:
java.util.concurrent.TimeoutException: Could not connect to ZooKeeper 127.0.0.1:61244 within 30000 ms

Stack Trace:
org.apache.solr.common.SolrException: java.util.concurrent.TimeoutException: Could not connect to ZooKeeper 127.0.0.1:61244 within 30000 ms
  at org.apache.solr.common.cloud.SolrZkClient.(SolrZkClient.java:114)
  at org.apache.solr.common.cloud.SolrZkClient.(SolrZkClient.java:96)
  at org.apache.solr.cloud.MiniSolrCloudCluster.(MiniSolrCloudCluster.java:113)
  at org.apache.solr.cloud.TestMiniSolrCloudCluster.createMiniSolrCloudCluster(TestMiniSolrCloudCluster.java:93)
  at org.apache.solr.cloud.TestMiniSolrCloudCluster.testCollectionCreateSearchDelete(TestMiniSolrCloudCluster.java:129)
  at sun.reflect.NativeMethodAccessorImpl.invoke0(Native Method)
  at sun.reflect.NativeMethodAccessorImpl.invoke(NativeMethodAccessorImpl.java:62)
  at sun.reflect.DelegatingMethodAccessorImpl.invoke(DelegatingMethodAccessorImpl.java:43)
  at java.lang.reflect.Method.invoke(Method.java:498)
  at com.carrotsearch.randomizedtesting.RandomizedRunner.invoke(RandomizedRunner.java:1764)
  at com.carrotsearch.randomizedtesting.RandomizedRunner$8.evaluate(RandomizedRunner.java:871)
  at com.carrotsearch.randomizedtesting.RandomizedRunner$9.evaluate(RandomizedRunner.java:907)
  at com.carrotsearch.randomizedtesting.RandomizedRunner$10.evaluate(RandomizedRunner.java:921)
  at com.carrotsearch.randomizedtesting.rules.SystemPropertiesRestoreRule$1.evaluate(SystemPropertiesRestoreRule.java:57)
  at org.apache.lucene.util.TestRuleSetupTeardownChained$1.evaluate(TestRuleSetupTeardownChained.java:49)
  at org.apache.lucene.util.AbstractBeforeAfterRule$1.evaluate(AbstractBeforeAfterRule.java:45)
  at org.apache.lucene.util.TestRuleThreadAndTestName$1.evaluate(TestRuleThreadAndTestName.java:48)
  at org.apache.lucene.util.TestRuleIgnoreAfterMaxFailures$1.evaluate(TestRuleIgnoreAfterMaxFailures.java:64)
  at org.apache.lucene.util.TestRuleMarkFailure$1.evaluate(TestRuleMarkFailure.java:47)
  at com.carrotsearch.randomizedtesting.rules.StatementAdapter.evaluate(StatementAdapter.java:36)
  at com.carrotsearch.randomizedtesting.ThreadLeakControl$StatementRunner.run(ThreadLeakControl.java:367)
  at com.carrotsearch.randomizedtesting.ThreadLeakControl.forkTimeoutingTask(ThreadLeakControl.java:809)
  at com.carrotsearch.randomizedtesting.ThreadLeakControl$3.evaluate(ThreadLeakControl.java:460)
  at com.carrotsearch.randomizedtesting.RandomizedRunner.runSingleTest(RandomizedRunner.java:880)
  at com.carrotsearch.randomizedtesting.RandomizedRunner$5.evaluate(RandomizedRunner.java:781)
  at com.carrotsearch.randomizedtesting.RandomizedRunner$6.evaluate(RandomizedRunner.java:816)
  at com.carrotsearch.randomizedtesting.RandomizedRunner$7.evaluate(RandomizedRunner.java:827)
  at com.carrotsearch.randomizedtesting.rules.StatementAdapter.evaluate(StatementAdapter.java:36)
  at com.carrotsearch.randomizedtesting.rules.SystemPropertiesRestoreRule$1.evaluate(SystemPropertiesRestoreRule.java:57)
  at org.apache.lucene.util.AbstractBeforeAfterRule$1.evaluate(AbstractBeforeAfterRule.java:45)
  at com.carrotsearch.randomizedtesting.rules.StatementAdapter.evaluate(StatementAdapter.java:36)
  at org.apache.lucene.util.TestRuleStoreClassName$1.evaluate(TestRuleStoreClassName.java:41)
  at com.carrotsearch.randomizedtesting.rules.NoShadowingOrOverridesOnMethodsRule$1.evaluate(NoShadowingOrOverridesOnMethodsRule.java:40)
  at com.carrotsearch.randomizedtesting.rules.NoShadowingOrOverridesOnMethodsRule$1.evaluate(NoShadowingOrOverridesOnMethodsRule.java:40)
  at com.carrotsearch.randomizedtesting.rules.StatementAdapter.evaluate(StatementAdapter.java:36)
  at com.carrotsearch.randomizedtesting.rules.StatementAdapter.evaluate(StatementAdapter.java:36)
  at com.carrotsearch.randomizedtesting.rules.StatementAdapter.evaluate(StatementAdapter.java:36)
  at org.apache.lucene.util.TestRuleAssertionsRequired$1.evaluate(TestRuleAssertionsRequired.java:53)
  at org.apache.lucene.util.TestRuleMarkFailure$1.evaluate(TestRuleMarkFailure.java:47)
  at org.apache.lucene.util.TestRuleIgnoreAfterMaxFailures$1.evaluate(TestRuleIgnoreAfterMaxFailures.java:64)
  at org.apache.lucene.util.TestRuleIgnoreTestSuites$1.evaluate(TestRuleIgnoreTestSuites.java:54)
  at com.carrotsearch.randomizedtesting.rules.StatementAdapter.evaluate(StatementAdapter.java:36)
  at com.carrotsearch.randomizedtesting.ThreadLeakControl$StatementRunner.run(ThreadLeakControl.java:367)
  at java.lang.Thread.run(Thread.java:745)
Caused by: java.util.concurrent.TimeoutException: Could not connect to ZooKeeper 127.0.0.1:61244 within 30000 ms
  at org.apache.solr.common.cloud.ConnectionManager.waitForConnected(ConnectionManager.java:228)
  at org.apache.solr.common.cloud.SolrZkClient.<init>(SolrZkClient.java:172)
  ... 46 more


FAILED: org.apache.solr.cloud.TestAuthenticationFramework.testStopAllStartAll

Error Message:
java.util.concurrent.TimeoutException: Could not connect to ZooKeeper 127.0.0.1:61250 within 30000 ms

Stack Trace:
org.apache.solr.common.SolrException: java.util.concurrent.TimeoutException: Could not connect to ZooKeeper 127.0.0.1:61250 within 30000 ms
  at org.apache.solr.common.cloud.SolrZkClient.(SolrZkClient.java:114)
  at org.apache.solr.common.cloud.SolrZkClient.(SolrZkClient.java:96)
  at org.apache.solr.cloud.MiniSolrCloudCluster.(MiniSolrCloudCluster.java:113)
  at org.apache.solr.cloud.TestMiniSolrCloudCluster.createMiniSolrCloudCluster(TestMiniSolrCloudCluster.java:93)
  at org.apache.solr.cloud.TestMiniSolrCloudCluster.testStopAllStartAll(TestMiniSolrCloudCluster.java:353)
  at sun.reflect.NativeMethodAccessorImpl.invoke0(Native Method)
  at sun.reflect.NativeMethodAccessorImpl.invoke(NativeMethodAccessorImpl.java:62)
  at sun.reflect.DelegatingMethodAccessorImpl.invoke(DelegatingMethodAccessorImpl.java:43)
  at java.lang.reflect.Method.invoke(Method.java:498)
  at com.carrotsearch.randomizedtesting.RandomizedRunner.invoke(RandomizedRunner.java:1764)
  at com.carrotsearch.randomizedtesting.RandomizedRunner$8.evaluate(RandomizedRunner.java:871)
  at com.carrotsearch.randomizedtesting.RandomizedRunner$9.evaluate(RandomizedRunner.java:907)
  at com.carrotsearch.randomizedtesting.RandomizedRunner$10.evaluate(RandomizedRunner.java:921)
  at com.carrotsearch.randomizedtesting.rules.SystemPropertiesRestoreRule$1.evaluate(SystemPropertiesRestoreRule.java:57)
  at org.apache.lucene.util.TestRuleSetupTeardownChained$1.evaluate(TestRuleSetupTeardownChained.java:49)
  at org.apache.lucene.util.AbstractBeforeAfterRule$1.evaluate(AbstractBeforeAfterRule.java:45)
  at org.apache.lucene.util.TestRuleThreadAndTestName$1.evaluate(TestRuleThreadAndTestName.java:48)
  at org.apache.lucene.util.TestRuleIgnoreAfterMaxFailures$1.evaluate(TestRuleIgnoreAfterMaxFailures.java:64)
  at org.apache.lucene.util.TestRuleMarkFailure$1.evaluate(TestRuleMarkFailure.java:47)
  at com.carrotsearch.randomizedtesting.rules.StatementAdapter.evaluate(StatementAdapter.java:36)
  at com.carrotsearch.randomizedtesting.ThreadLeakControl$StatementRunner.run(ThreadLeakControl.java:367)
  at com.carrotsearch.randomizedtesting.ThreadLeakControl.forkTimeoutingTask(ThreadLeakControl.java:809)
  at com.carrotsearch.randomizedtesting.ThreadLeakControl$3.evaluate(ThreadLeakControl.java:460)
  at com.carrotsearch.randomizedtesting.RandomizedRunner.runSingleTest(RandomizedRunner.java:880)
  at com.carrotsearch.randomizedtesting.RandomizedRunner$5.evaluate(RandomizedRunner.java:781)
  at com.carrotsearch.randomizedtesting.RandomizedRunner$6.evaluate(RandomizedRunner.java:816)
  at com.carrotsearch.randomizedtesting.RandomizedRunner$7.evaluate(RandomizedRunner.java:827)
  at com.carrotsearch.randomizedtesting.rules.StatementAdapter.evaluate(StatementAdapter.java:36)
  at com.carrotsearch.randomizedtesting.rules.SystemPropertiesRestoreRule$1.evaluate(SystemPropertiesRestoreRule.java:57)
  at org.apache.lucene.util.AbstractBeforeAfterRule$1.evaluate(AbstractBeforeAfterRule.java:45)
  at com.carrotsearch.randomizedtesting.rules.StatementAdapter.evaluate(StatementAdapter.java:36)
  at org.apache.lucene.util.TestRuleStoreClassName$1.evaluate(TestRuleStoreClassName.java:41)
  at com.carrotsearch.randomizedtesting.rules.NoShadowingOrOverridesOnMethodsRule$1.evaluate(NoShadowingOrOverridesOnMethodsRule.java:40)
  at com.carrotsearch.randomizedtesting.rules.NoShadowingOrOverridesOnMethodsRule$1.evaluate(NoShadowingOrOverridesOnMethodsRule.java:40)
  at com.carrotsearch.randomizedtesting.rules.StatementAdapter.evaluate(StatementAdapter.java:36)
  at com.carrotsearch.randomizedtesting.rules.StatementAdapter.evaluate(StatementAdapter.java:36)
  at com.carrotsearch.randomizedtesting.rules.StatementAdapter.evaluate(StatementAdapter.java:36)
  at org.apache.lucene.util.TestRuleAssertionsRequired$1.evaluate(TestRuleAssertionsRequired.java:53)
  at org.apache.lucene.util.TestRuleMarkFailure$1.evaluate(TestRuleMarkFailure.java:47)
  at org.apache.lucene.util.TestRuleIgnoreAfterMaxFailures$1.evaluate(TestRuleIgnoreAfterMaxFailures.java:64)
  at org.apache.lucene.util.TestRuleIgnoreTestSuites$1.evaluate(TestRuleIgnoreTestSuites.java:54)
  at com.carrotsearch.randomizedtesting.rules.StatementAdapter.evaluate(StatementAdapter.java:36)
  at com.carrotsearch.randomizedtesting.ThreadLeakControl$StatementRunner.run(ThreadLeakControl.java:367)
  at java.lang.Thread.run(Thread.java:745)
Caused by: java.util.concurrent.TimeoutException: Could not connect to ZooKeeper 127.0.0.1:61250 within 30000 ms
  at org.apache.solr.common.cloud.ConnectionManager.waitForConnected(ConnectionManager.java:228)
  at org.apache.solr.common.cloud.SolrZkClient.<init>(SolrZkClient.java:172)
  ... 46 more


FAILED: org.apache.solr.cloud.TestAuthenticationFramework.testExtraFilters

Error Message:
java.util.concurrent.TimeoutException: Could not connect to ZooKeeper 127.0.0.1:61256 within 30000 ms

Stack Trace:
org.apache.solr.common.SolrException: java.util.concurrent.TimeoutException: Could not connect to ZooKeeper 127.0.0.1:61256 within 30000 ms
  at org.apache.solr.common.cloud.SolrZkClient.(SolrZkClient.java:114)
  at org.apache.solr.common.cloud.SolrZkClient.(SolrZkClient.java:96)
  at org.apache.solr.cloud.MiniSolrCloudCluster.(MiniSolrCloudCluster.java:113)
  at org.apache.solr.cloud.TestMiniSolrCloudCluster.testExtraFilters(TestMiniSolrCloudCluster.java:298)
  at sun.reflect.NativeMethodAccessorImpl.invoke0(Native Method)
  at sun.reflect.NativeMethodAccessorImpl.invoke(NativeMethodAccessorImpl.java:62)
  at sun.reflect.DelegatingMethodAccessorImpl.invoke(DelegatingMethodAccessorImpl.java:43)
  at java.lang.reflect.Method.invoke(Method.java:498)
  at com.carrotsearch.randomizedtesting.RandomizedRunner.invoke(RandomizedRunner.java:1764)
  at com.carrotsearch.randomizedtesting.RandomizedRunner$8.evaluate(RandomizedRunner.java:871)
  at com.carrotsearch.randomizedtesting.RandomizedRunner$9.evaluate(RandomizedRunner.java:907)
  at com.carrotsearch.randomizedtesting.RandomizedRunner$10.evaluate(RandomizedRunner.java:921)
  at com.carrotsearch.randomizedtesting.rules.SystemPropertiesRestoreRule$1.evaluate(SystemPropertiesRestoreRule.java:57)
  at org.apache.lucene.util.TestRuleSetupTeardownChained$1.evaluate(TestRuleSetupTeardownChained.java:49)
  at org.apache.lucene.util.AbstractBeforeAfterRule$1.evaluate(AbstractBeforeAfterRule.java:45)
  at org.apache.lucene.util.TestRuleThreadAndTestName$1.evaluate(TestRuleThreadAndTestName.java:48)
  at org.apache.lucene.util.TestRuleIgnoreAfterMaxFailures$1.evaluate(TestRuleIgnoreAfterMaxFailures.java:64)
  at org.apache.lucene.util.TestRuleMarkFailure$1.evaluate(TestRuleMarkFailure.java:47)
  at com.carrotsearch.randomizedtesting.rules.StatementAdapter.evaluate(StatementAdapter.java:36)
  at com.carrotsearch.randomizedtesting.ThreadLeakControl$StatementRunner.run(ThreadLeakControl.java:367)
  at com.carrotsearch.randomizedtesting.ThreadLeakControl.forkTimeoutingTask(ThreadLeakControl.java:809)
  at com.carrotsearch.randomizedtesting.ThreadLeakControl$3.evaluate(ThreadLeakControl.java:460)
  at com.carrotsearch.randomizedtesting.RandomizedRunner.runSingleTest(RandomizedRunner.java:880)
  at com.carrotsearch.randomizedtesting.RandomizedRunner$5.evaluate(RandomizedRunner.java:781)
  at com.carrotsearch.randomizedtesting.RandomizedRunner$6.evaluate(RandomizedRunner.java:816)
  at com.carrotsearch.randomizedtesting.RandomizedRunner$7.evaluate(RandomizedRunner.java:827)
  at com.carrotsearch.randomizedtesting.rules.StatementAdapter.evaluate(StatementAdapter.java:36)
  at com.carrotsearch.randomizedtesting.rules.SystemPropertiesRestoreRule$1.evaluate(SystemPropertiesRestoreRule.java:57)
  at org.apache.lucene.util.AbstractBeforeAfterRule$1.evaluate(AbstractBeforeAfterRule.java:45)
  at com.carrotsearch.randomizedtesting.rules.StatementAdapter.evaluate(StatementAdapter.java:36)
  at org.apache.lucene.util.TestRuleStoreClassName$1.evaluate(TestRuleStoreClassName.java:41)
  at com.carrotsearch.randomizedtesting.rules.NoShadowingOrOverridesOnMethodsRule$1.evaluate(NoShadowingOrOverridesOnMethodsRule.java:40)
  at com.carrotsearch.randomizedtesting.rules.NoShadowingOrOverridesOnMethodsRule$1.evaluate(NoShadowingOrOverridesOnMethodsRule.java:40)
  at com.carrotsearch.randomizedtesting.rules.StatementAdapter.evaluate(StatementAdapter.java:36)
  at com.carrotsearch.randomizedtesting.rules.StatementAdapter.evaluate(StatementAdapter.java:36)
  at com.carrotsearch.randomizedtesting.rules.StatementAdapter.evaluate(StatementAdapter.java:36)
  at org.apache.lucene.util.TestRuleAssertionsRequired$1.evaluate(TestRuleAssertionsRequired.java:53)
  at org.apache.lucene.util.TestRuleMarkFailure$1.evaluate(TestRuleMarkFailure.java:47)
  at org.apache.lucene.util.TestRuleIgnoreAfterMaxFailures$1.evaluate(TestRuleIgnoreAfterMaxFailures.java:64)
  at org.apache.lucene.util.TestRuleIgnoreTestSuites$1.evaluate(TestRuleIgnoreTestSuites.java:54)
  at com.carrotsearch.randomizedtesting.rules.StatementAdapter.evaluate(StatementAdapter.java:36)
  at com.carrotsearch.randomizedtesting.ThreadLeakControl$StatementRunner.run(ThreadLeakControl.java:367)
  at java.lang.Thread.run(Thread.java:745)
Caused by: java.util.concurrent.TimeoutException: Could not connect to ZooKeeper 127.0.0.1:61256 within 30000 ms
  at org.apache.solr.common.cloud.ConnectionManager.waitForConnected(ConnectionManager.java:228)
  at org.apache.solr.common.cloud.SolrZkClient.<init>(SolrZkClient.java:172)
  ... 45 more


FAILED: org.apache.solr.cloud.TestAuthenticationFramework.testCollectionCreateWithoutCoresThenDelete

Error Message:
java.util.concurrent.TimeoutException: Could not connect to ZooKeeper 127.0.0.1:61264 within 30000 ms

Stack Trace:
org.apache.solr.common.SolrException: java.util.concurrent.TimeoutException: Could not connect to ZooKeeper 127.0.0.1:61264 within 30000 ms
  at org.apache.solr.common.cloud.SolrZkClient.(SolrZkClient.java:114)
  at org.apache.solr.common.cloud.SolrZkClient.(SolrZkClient.java:96)
  at org.apache.solr.cloud.MiniSolrCloudCluster.(MiniSolrCloudCluster.java:113)
  at org.apache.solr.cloud.TestMiniSolrCloudCluster.createMiniSolrCloudCluster(TestMiniSolrCloudCluster.java:93)
  at org.apache.solr.cloud.TestMiniSolrCloudCluster.testCollectionCreateWithoutCoresThenDelete(TestMiniSolrCloudCluster.java:306)
  at sun.reflect.NativeMethodAccessorImpl.invoke0(Native Method)
  at sun.reflect.NativeMethodAccessorImpl.invoke(NativeMethodAccessorImpl.java:62)
  at sun.reflect.DelegatingMethodAccessorImpl.invoke(DelegatingMethodAccessorImpl.java:43)
  at java.lang.reflect.Method.invoke(Method.java:498)
  at com.carrotsearch.randomizedtesting.RandomizedRunner.invoke(RandomizedRunner.java:1764)
  at com.carrotsearch.randomizedtesting.RandomizedRunner$8.evaluate(RandomizedRunner.java:871)
  at com.carrotsearch.randomizedtesting.RandomizedRunner$9.evaluate(RandomizedRunner.java:907)
  at com.carrotsearch.randomizedtesting.RandomizedRunner$10.evaluate(RandomizedRunner.java:921)
  at com.carrotsearch.randomizedtesting.rules.SystemPropertiesRestoreRule$1.evaluate(SystemPropertiesRestoreRule.java:57)
  at org.apache.lucene.util.TestRuleSetupTeardownChained$1.evaluate(TestRuleSetupTeardownChained.java:49)
  at org.apache.lucene.util.AbstractBeforeAfterRule$1.evaluate(AbstractBeforeAfterRule.java:45)
  at org.apache.lucene.util.TestRuleThreadAndTestName$1.evaluate(TestRuleThreadAndTestName.java:48)
  at org.apache.lucene.util.TestRuleIgnoreAfterMaxFailures$1.evaluate(TestRuleIgnoreAfterMaxFailures.java:64)
  at org.apache.lucene.util.TestRuleMarkFailure$1.evaluate(TestRuleMarkFailure.java:47)
  at com.carrotsearch.randomizedtesting.rules.StatementAdapter.evaluate(StatementAdapter.java:36)
  at com.carrotsearch.randomizedtesting.ThreadLeakControl$StatementRunner.run(ThreadLeakControl.java:367)
  at com.carrotsearch.randomizedtesting.ThreadLeakControl.forkTimeoutingTask(ThreadLeakControl.java:809)
  at com.carrotsearch.randomizedtesting.ThreadLeakControl$3.evaluate(ThreadLeakControl.java:460)
  at com.carrotsearch.randomizedtesting.RandomizedRunner.runSingleTest(RandomizedRunner.java:880)
  at com.carrotsearch.randomizedtesting.RandomizedRunner$5.evaluate(RandomizedRunner.java:781)
  at com.carrotsearch.randomizedtesting.RandomizedRunner$6.evaluate(RandomizedRunner.java:816)
  at com.carrotsearch.randomizedtesting.RandomizedRunner$7.evaluate(RandomizedRunner.java:827)
  at com.carrotsearch.randomizedtesting.rules.StatementAdapter.evaluate(StatementAdapter.java:36)
  at com.carrotsearch.randomizedtesting.rules.SystemPropertiesRestoreRule$1.evaluate(SystemPropertiesRestoreRule.java:57)
  at org.apache.lucene.util.AbstractBeforeAfterRule$1.evaluate(AbstractBeforeAfterRule.java:45)
  at com.carrotsearch.randomizedtesting.rules.StatementAdapter.evaluate(StatementAdapter.java:36)
  at org.apache.lucene.util.TestRuleStoreClassName$1.evaluate(TestRuleStoreClassName.java:41)
  at com.carrotsearch.randomizedtesting.rules.NoShadowingOrOverridesOnMethodsRule$1.evaluate(NoShadowingOrOverridesOnMethodsRule.java:40)
  at com.carrotsearch.randomizedtesting.rules.NoShadowingOrOverridesOnMethodsRule$1.evaluate(NoShadowingOrOverridesOnMethodsRule.java:40)
  at com.carrotsearch.randomizedtesting.rules.StatementAdapter.evaluate(StatementAdapter.java:36)
  at com.carrotsearch.randomizedtesting.rules.StatementAdapter.evaluate(StatementAdapter.java:36)
  at com.carrotsearch.randomizedtesting.rules.StatementAdapter.evaluate(StatementAdapter.java:36)
  at org.apache.lucene.util.TestRuleAssertionsRequired$1.evaluate(TestRuleAssertionsRequired.java:53)
  at org.apache.lucene.util.TestRuleMarkFailure$1.evaluate(TestRuleMarkFailure.java:47)
  at org.apache.lucene.util.TestRuleIgnoreAfterMaxFailures$1.evaluate(TestRuleIgnoreAfterMaxFailures.java:64)
  at org.apache.lucene.util.TestRuleIgnoreTestSuites$1.evaluate(TestRuleIgnoreTestSuites.java:54)
  at com.carrotsearch.randomizedtesting.rules.StatementAdapter.evaluate(StatementAdapter.java:36)
  at com.carrotsearch.randomizedtesting.ThreadLeakControl$StatementRunner.run(ThreadLeakControl.java:367)
  at java.lang.Thread.run(Thread.java:745)
Caused by: java.util.concurrent.TimeoutException: Could not connect to ZooKeeper 127.0.0.1:61264 within 30000 ms
  at org.apache.solr.common.cloud.ConnectionManager.waitForConnected(ConnectionManager.java:228)
  at org.apache.solr.common.cloud.SolrZkClient.<init>(SolrZkClient.java:172)
  ... 46 more


FAILED: junit.framework.TestSuite.org.apache.solr.cloud.TestAuthenticationFramework

Error Message:
28 threads leaked from SUITE scope at org.apache.solr.cloud.TestAuthenticationFramework: 1) Thread[id=11197, name=SessionTracker, state=TIMED_WAITING, group=TGRP-TestAuthenticationFramework] at java.lang.Object.wait(Native Method) at org.apache.zookeeper.server.SessionTrackerImpl.run(SessionTrackerImpl.java:146) 2) Thread[id=11190, name=SessionTracker, state=TIMED_WAITING, group=TGRP-TestAuthenticationFramework] at java.lang.Object.wait(Native Method) at org.apache.zookeeper.server.SessionTrackerImpl.run(SessionTrackerImpl.java:146) 3) Thread[id=11192, name=ProcessThread(sid:0 cport:-1):, state=WAITING, group=TGRP-TestAuthenticationFramework] at sun.misc.Unsafe.park(Native Method) at java.util.concurrent.locks.LockSupport.park(LockSupport.java:175) at java.util.concurrent.locks.AbstractQueuedSynchronizer$ConditionObject.await(AbstractQueuedSynchronizer.java:2039) at java.util.concurrent.LinkedBlockingQueue.take(LinkedBlockingQueue.java:442) at org.apache.zookeeper.server.PrepRequestProcessor.run(PrepRequestProcessor.java:120) 4) Thread[id=11178, name=ProcessThread(sid:0 cport:-1):, state=WAITING, group=TGRP-TestAuthenticationFramework] at sun.misc.Unsafe.park(Native Method) at java.util.concurrent.locks.LockSupport.park(LockSupport.java:175) at java.util.concurrent.locks.AbstractQueuedSynchronizer$ConditionObject.await(AbstractQueuedSynchronizer.java:2039) at java.util.concurrent.LinkedBlockingQueue.take(LinkedBlockingQueue.java:442) at org.apache.zookeeper.server.PrepRequestProcessor.run(PrepRequestProcessor.java:120) 5) Thread[id=11213, name=ProcessThread(sid:0 cport:-1):, state=WAITING, group=TGRP-TestAuthenticationFramework] at sun.misc.Unsafe.park(Native Method) at java.util.concurrent.locks.LockSupport.park(LockSupport.java:175) at java.util.concurrent.locks.AbstractQueuedSynchronizer$ConditionObject.await(AbstractQueuedSynchronizer.java:2039) at java.util.concurrent.LinkedBlockingQueue.take(LinkedBlockingQueue.java:442) at org.apache.zookeeper.server.PrepRequestProcessor.run(PrepRequestProcessor.java:120) 6) Thread[id=11195, name=Thread-3470, state=WAITING, group=TGRP-TestAuthenticationFramework] at java.lang.Object.wait(Native Method) at java.lang.Thread.join(Thread.java:1245) at java.lang.Thread.join(Thread.java:1319) at org.apache.zookeeper.server.NIOServerCnxnFactory.join(NIOServerCnxnFactory.java:302) at org.apache.solr.cloud.ZkTestServer$ZKServerMain.runFromConfig(ZkTestServer.java:310) at org.apache.solr.cloud.ZkTestServer$2.run(ZkTestServer.java:491) 7) Thread[id=11217, name=NIOServerCxn.Factory:0.0.0.0/0.0.0.0:0, state=RUNNABLE, group=TGRP-TestAuthenticationFramework] at sun.nio.ch.WindowsSelectorImpl$SubSelector.poll0(Native Method) at sun.nio.ch.WindowsSelectorImpl$SubSelector.poll(WindowsSelectorImpl.java:296) at sun.nio.ch.WindowsSelectorImpl$SubSelector.access$400(WindowsSelectorImpl.java:278) at sun.nio.ch.WindowsSelectorImpl.doSelect(WindowsSelectorImpl.java:159) at sun.nio.ch.SelectorImpl.lockAndDoSelect(SelectorImpl.java:86) at sun.nio.ch.SelectorImpl.select(SelectorImpl.java:97) at org.apache.zookeeper.server.NIOServerCnxnFactory.run(NIOServerCnxnFactory.java:178) at java.lang.Thread.run(Thread.java:745) 8) Thread[id=11216, name=Thread-3473, state=WAITING, group=TGRP-TestAuthenticationFramework] at java.lang.Object.wait(Native Method) at java.lang.Thread.join(Thread.java:1245) at java.lang.Thread.join(Thread.java:1319) at org.apache.zookeeper.server.NIOServerCnxnFactory.join(NIOServerCnxnFactory.java:302) at org.apache.solr.cloud.ZkTestServer$ZKServerMain.runFromConfig(ZkTestServer.java:310) at org.apache.solr.cloud.ZkTestServer$2.run(ZkTestServer.java:491) 9) Thread[id=11175, name=NIOServerCxn.Factory:0.0.0.0/0.0.0.0:0, state=RUNNABLE, group=TGRP-TestAuthenticationFramework] at sun.nio.ch.WindowsSelectorImpl$SubSelector.poll0(Native Method) at sun.nio.ch.WindowsSelectorImpl$SubSelector.poll(WindowsSelectorImpl.java:296) at sun.nio.ch.WindowsSelectorImpl$SubSelector.access$400(WindowsSelectorImpl.java:278) at sun.nio.ch.WindowsSelectorImpl.doSelect(WindowsSelectorImpl.java:159) at sun.nio.ch.SelectorImpl.lockAndDoSelect(SelectorImpl.java:86) at sun.nio.ch.SelectorImpl.select(SelectorImpl.java:97) at org.apache.zookeeper.server.NIOServerCnxnFactory.run(NIOServerCnxnFactory.java:178) at java.lang.Thread.run(Thread.java:745) 10) Thread[id=11181, name=Thread-3468, state=WAITING, group=TGRP-TestAuthenticationFramework] at java.lang.Object.wait(Native Method) at java.lang.Thread.join(Thread.java:1245) at java.lang.Thread.join(Thread.java:1319) at org.apache.zookeeper.server.NIOServerCnxnFactory.join(NIOServerCnxnFactory.java:302) at org.apache.solr.cloud.ZkTestServer$ZKServerMain.runFromConfig(ZkTestServer.java:310) at org.apache.solr.cloud.ZkTestServer$2.run(ZkTestServer.java:491) 11) Thread[id=11202, name=Thread-3471, state=WAITING, group=TGRP-TestAuthenticationFramework] at java.lang.Object.wait(Native Method) at java.lang.Thread.join(Thread.java:1245) at java.lang.Thread.join(Thread.java:1319) at org.apache.zookeeper.server.NIOServerCnxnFactory.join(NIOServerCnxnFactory.java:302) at org.apache.solr.cloud.ZkTestServer$ZKServerMain.runFromConfig(ZkTestServer.java:310) at org.apache.solr.cloud.ZkTestServer$2.run(ZkTestServer.java:491) 12) Thread[id=11189, name=NIOServerCxn.Factory:0.0.0.0/0.0.0.0:0, state=RUNNABLE, group=TGRP-TestAuthenticationFramework] at sun.nio.ch.WindowsSelectorImpl$SubSelector.poll0(Native Method) at sun.nio.ch.WindowsSelectorImpl$SubSelector.poll(WindowsSelectorImpl.java:296) at sun.nio.ch.WindowsSelectorImpl$SubSelector.access$400(WindowsSelectorImpl.java:278) at sun.nio.ch.WindowsSelectorImpl.doSelect(WindowsSelectorImpl.java:159) at sun.nio.ch.SelectorImpl.lockAndDoSelect(SelectorImpl.java:86) at sun.nio.ch.SelectorImpl.select(SelectorImpl.java:97) at org.apache.zookeeper.server.NIOServerCnxnFactory.run(NIOServerCnxnFactory.java:178) at java.lang.Thread.run(Thread.java:745) 13) Thread[id=11176, name=SessionTracker, state=TIMED_WAITING, group=TGRP-TestAuthenticationFramework] at java.lang.Object.wait(Native Method) at org.apache.zookeeper.server.SessionTrackerImpl.run(SessionTrackerImpl.java:146) 14) Thread[id=11218, name=SessionTracker, state=TIMED_WAITING, group=TGRP-TestAuthenticationFramework] at java.lang.Object.wait(Native Method) at org.apache.zookeeper.server.SessionTrackerImpl.run(SessionTrackerImpl.java:146) 15) Thread[id=11211, name=SessionTracker, state=TIMED_WAITING, group=TGRP-TestAuthenticationFramework] at java.lang.Object.wait(Native Method) at org.apache.zookeeper.server.SessionTrackerImpl.run(SessionTrackerImpl.java:146) 16) Thread[id=11210, name=NIOServerCxn.Factory:0.0.0.0/0.0.0.0:0, state=RUNNABLE, group=TGRP-TestAuthenticationFramework] at sun.nio.ch.WindowsSelectorImpl$SubSelector.poll0(Native Method) at sun.nio.ch.WindowsSelectorImpl$SubSelector.poll(WindowsSelectorImpl.java:296) at sun.nio.ch.WindowsSelectorImpl$SubSelector.access$400(WindowsSelectorImpl.java:278) at sun.nio.ch.WindowsSelectorImpl.doSelect(WindowsSelectorImpl.java:159) at sun.nio.ch.SelectorImpl.lockAndDoSelect(SelectorImpl.java:86) at sun.nio.ch.SelectorImpl.select(SelectorImpl.java:97) at org.apache.zookeeper.server.NIOServerCnxnFactory.run(NIOServerCnxnFactory.java:178) at java.lang.Thread.run(Thread.java:745) 17) Thread[id=11199, name=ProcessThread(sid:0 cport:-1):, state=WAITING, group=TGRP-TestAuthenticationFramework] at sun.misc.Unsafe.park(Native Method) at java.util.concurrent.locks.LockSupport.park(LockSupport.java:175) at java.util.concurrent.locks.AbstractQueuedSynchronizer$ConditionObject.await(AbstractQueuedSynchronizer.java:2039) at java.util.concurrent.LinkedBlockingQueue.take(LinkedBlockingQueue.java:442) at org.apache.zookeeper.server.PrepRequestProcessor.run(PrepRequestProcessor.java:120) 18) Thread[id=11188, name=Thread-3469, state=WAITING, group=TGRP-TestAuthenticationFramework] at java.lang.Object.wait(Native Method) at java.lang.Thread.join(Thread.java:1245) at java.lang.Thread.join(Thread.java:1319) at org.apache.zookeeper.server.NIOServerCnxnFactory.join(NIOServerCnxnFactory.java:302) at org.apache.solr.cloud.ZkTestServer$ZKServerMain.runFromConfig(ZkTestServer.java:310) at org.apache.solr.cloud.ZkTestServer$2.run(ZkTestServer.java:491) 19) Thread[id=11185, name=ProcessThread(sid:0 cport:-1):, state=WAITING, group=TGRP-TestAuthenticationFramework] at sun.misc.Unsafe.park(Native Method) at java.util.concurrent.locks.LockSupport.park(LockSupport.java:175) at java.util.concurrent.locks.AbstractQueuedSynchronizer$ConditionObject.await(AbstractQueuedSynchronizer.java:2039) at java.util.concurrent.LinkedBlockingQueue.take(LinkedBlockingQueue.java:442) at org.apache.zookeeper.server.PrepRequestProcessor.run(PrepRequestProcessor.java:120) 20) Thread[id=11203, name=NIOServerCxn.Factory:0.0.0.0/0.0.0.0:0, state=RUNNABLE, group=TGRP-TestAuthenticationFramework] at sun.nio.ch.WindowsSelectorImpl$SubSelector.poll0(Native Method) at sun.nio.ch.WindowsSelectorImpl$SubSelector.poll(WindowsSelectorImpl.java:296) at sun.nio.ch.WindowsSelectorImpl$SubSelector.access$400(WindowsSelectorImpl.java:278) at sun.nio.ch.WindowsSelectorImpl.doSelect(WindowsSelectorImpl.java:159) at sun.nio.ch.SelectorImpl.lockAndDoSelect(SelectorImpl.java:86) at sun.nio.ch.SelectorImpl.select(SelectorImpl.java:97) at org.apache.zookeeper.server.NIOServerCnxnFactory.run(NIOServerCnxnFactory.java:178) at java.lang.Thread.run(Thread.java:745) 21) Thread[id=11196, name=NIOServerCxn.Factory:0.0.0.0/0.0.0.0:0, state=RUNNABLE, group=TGRP-TestAuthenticationFramework] at sun.nio.ch.WindowsSelectorImpl$SubSelector.poll0(Native Method) at sun.nio.ch.WindowsSelectorImpl$SubSelector.poll(WindowsSelectorImpl.java:296) at sun.nio.ch.WindowsSelectorImpl$SubSelector.access$400(WindowsSelectorImpl.java:278) at sun.nio.ch.WindowsSelectorImpl.doSelect(WindowsSelectorImpl.java:159) at sun.nio.ch.SelectorImpl.lockAndDoSelect(SelectorImpl.java:86) at sun.nio.ch.SelectorImpl.select(SelectorImpl.java:97) at org.apache.zookeeper.server.NIOServerCnxnFactory.run(NIOServerCnxnFactory.java:178) at java.lang.Thread.run(Thread.java:745) 22) Thread[id=11182, name=NIOServerCxn.Factory:0.0.0.0/0.0.0.0:0, state=RUNNABLE, group=TGRP-TestAuthenticationFramework] at sun.nio.ch.WindowsSelectorImpl$SubSelector.poll0(Native Method) at sun.nio.ch.WindowsSelectorImpl$SubSelector.poll(WindowsSelectorImpl.java:296) at sun.nio.ch.WindowsSelectorImpl$SubSelector.access$400(WindowsSelectorImpl.java:278) at sun.nio.ch.WindowsSelectorImpl.doSelect(WindowsSelectorImpl.java:159) at sun.nio.ch.SelectorImpl.lockAndDoSelect(SelectorImpl.java:86) at sun.nio.ch.SelectorImpl.select(SelectorImpl.java:97) at org.apache.zookeeper.server.NIOServerCnxnFactory.run(NIOServerCnxnFactory.java:178) at java.lang.Thread.run(Thread.java:745) 23) Thread[id=11174, name=Thread-3467, state=WAITING, group=TGRP-TestAuthenticationFramework] at java.lang.Object.wait(Native Method) at java.lang.Thread.join(Thread.java:1245) at java.lang.Thread.join(Thread.java:1319) at org.apache.zookeeper.server.NIOServerCnxnFactory.join(NIOServerCnxnFactory.java:302) at org.apache.solr.cloud.ZkTestServer$ZKServerMain.runFromConfig(ZkTestServer.java:310) at org.apache.solr.cloud.ZkTestServer$2.run(ZkTestServer.java:491) 24) Thread[id=11206, name=ProcessThread(sid:0 cport:-1):, state=WAITING, group=TGRP-TestAuthenticationFramework] at sun.misc.Unsafe.park(Native Method) at java.util.concurrent.locks.LockSupport.park(LockSupport.java:175) at java.util.concurrent.locks.AbstractQueuedSynchronizer$ConditionObject.await(AbstractQueuedSynchronizer.java:2039) at java.util.concurrent.LinkedBlockingQueue.take(LinkedBlockingQueue.java:442) at org.apache.zookeeper.server.PrepRequestProcessor.run(PrepRequestProcessor.java:120) 25) Thread[id=11220, name=ProcessThread(sid:0 cport:-1):, state=WAITING, group=TGRP-TestAuthenticationFramework] at sun.misc.Unsafe.park(Native Method) at java.util.concurrent.locks.LockSupport.park(LockSupport.java:175) at java.util.concurrent.locks.AbstractQueuedSynchronizer$ConditionObject.await(AbstractQueuedSynchronizer.java:2039) at java.util.concurrent.LinkedBlockingQueue.take(LinkedBlockingQueue.java:442) at org.apache.zookeeper.server.PrepRequestProcessor.run(PrepRequestProcessor.java:120) 26) Thread[id=11204, name=SessionTracker, state=TIMED_WAITING, group=TGRP-TestAuthenticationFramework] at java.lang.Object.wait(Native Method) at org.apache.zookeeper.server.SessionTrackerImpl.run(SessionTrackerImpl.java:146) 27) Thread[id=11209, name=Thread-3472, state=WAITING, group=TGRP-TestAuthenticationFramework] at java.lang.Object.wait(Native Method) at java.lang.Thread.join(Thread.java:1245) at java.lang.Thread.join(Thread.java:1319) at org.apache.zookeeper.server.NIOServerCnxnFactory.join(NIOServerCnxnFactory.java:302) at org.apache.solr.cloud.ZkTestServer$ZKServerMain.runFromConfig(ZkTestServer.java:310) at org.apache.solr.cloud.ZkTestServer$2.run(ZkTestServer.java:491) 28) Thread[id=11183, name=SessionTracker, state=TIMED_WAITING, group=TGRP-TestAuthenticationFramework] at java.lang.Object.wait(Native Method) at org.apache.zookeeper.server.SessionTrackerImpl.run(SessionTrackerImpl.java:146)

Stack Trace:
com.carrotsearch.randomizedtesting.ThreadLeakError: 28 threads leaked from SUITE scope at org.apache.solr.cloud.TestAuthenticationFramework:
    1) Thread[id=11197, name=SessionTracker, state=TIMED_WAITING, group=TGRP-TestAuthenticationFramework]
         at java.lang.Object.wait(Native Method)
         at org.apache.zookeeper.server.SessionTrackerImpl.run(SessionTrackerImpl.java:146)
    2) Thread[id=11190, name=SessionTracker, state=TIMED_WAITING, group=TGRP-TestAuthenticationFramework]
         at java.lang.Object.wait(Native Method)
         at org.apache.zookeeper.server.SessionTrackerImpl.run(SessionTrackerImpl.java:146)
    3) Thread[id=11192, name=ProcessThread(sid:0 cport:-1):, state=WAITING, group=TGRP-TestAuthenticationFramework]
         at sun.misc.Unsafe.park(Native Method)
         at java.util.concurrent.locks.LockSupport.park(LockSupport.java:175)
         at java.util.concurrent.locks.AbstractQueuedSynchronizer$ConditionObject.await(AbstractQueuedSynchronizer.java:2039)
         at java.util.concurrent.LinkedBlockingQueue.take(LinkedBlockingQueue.java:442)
         at org.apache.zookeeper.server.PrepRequestProcessor.run(PrepRequestProcessor.java:120)
    4) Thread[id=11178, name=ProcessThread(sid:0 cport:-1):, state=WAITING, group=TGRP-TestAuthenticationFramework]
         at sun.misc.Unsafe.park(Native Method)
         at java.util.concurrent.locks.LockSupport.park(LockSupport.java:175)
         at java.util.concurrent.locks.AbstractQueuedSynchronizer$ConditionObject.await(AbstractQueuedSynchronizer.java:2039)
         at java.util.concurrent.LinkedBlockingQueue.take(LinkedBlockingQueue.java:442)
         at org.apache.zookeeper.server.PrepRequestProcessor.run(PrepRequestProcessor.java:120)
    5) Thread[id=11213, name=ProcessThread(sid:0 cport:-1):, state=WAITING, group=TGRP-TestAuthenticationFramework]
         at sun.misc.Unsafe.park(Native Method)
         at java.util.concurrent.locks.LockSupport.park(LockSupport.java:175)
         at java.util.concurrent.locks.AbstractQueuedSynchronizer$ConditionObject.await(AbstractQueuedSynchronizer.java:2039)
         at java.util.concurrent.LinkedBlockingQueue.take(LinkedBlockingQueue.java:442)
         at org.apache.zookeeper.server.PrepRequestProcessor.run(PrepRequestProcessor.java:120)
    6) Thread[id=11195, name=Thread-3470, state=WAITING, group=TGRP-TestAuthenticationFramework]
         at java.lang.Object.wait(Native Method)
         at java.lang.Thread.join(Thread.java:1245)
         at java.lang.Thread.join(Thread.java:1319)
         at org.apache.zookeeper.server.NIOServerCnxnFactory.join(NIOServerCnxnFactory.java:302)
         at org.apache.solr.cloud.ZkTestServer$ZKServerMain.runFromConfig(ZkTestServer.java:310)
         at org.apache.solr.cloud.ZkTestServer$2.run(ZkTestServer.java:491)
    7) Thread[id=11217, name=NIOServerCxn.Factory:0.0.0.0/0.0.0.0:0, state=RUNNABLE, group=TGRP-TestAuthenticationFramework]
         at sun.nio.ch.WindowsSelectorImpl$SubSelector.poll0(Native Method)
         at sun.nio.ch.WindowsSelectorImpl$SubSelector.poll(WindowsSelectorImpl.java:296)
         at sun.nio.ch.WindowsSelectorImpl$SubSelector.access$400(WindowsSelectorImpl.java:278)
         at sun.nio.ch.WindowsSelectorImpl.doSelect(WindowsSelectorImpl.java:159)
         at sun.nio.ch.SelectorImpl.lockAndDoSelect(SelectorImpl.java:86)
         at sun.nio.ch.SelectorImpl.select(SelectorImpl.java:97)
         at org.apache.zookeeper.server.NIOServerCnxnFactory.run(NIOServerCnxnFactory.java:178)
         at java.lang.Thread.run(Thread.java:745)
    8) Thread[id=11216, name=Thread-3473, state=WAITING, group=TGRP-TestAuthenticationFramework]
         at java.lang.Object.wait(Native Method)
         at java.lang.Thread.join(Thread.java:1245)
         at java.lang.Thread.join(Thread.java:1319)
         at org.apache.zookeeper.server.NIOServerCnxnFactory.join(NIOServerCnxnFactory.java:302)
         at org.apache.solr.cloud.ZkTestServer$ZKServerMain.runFromConfig(ZkTestServer.java:310)
         at org.apache.solr.cloud.ZkTestServer$2.run(ZkTestServer.java:491)
    9) Thread[id=11175, name=NIOServerCxn.Factory:0.0.0.0/0.0.0.0:0, state=RUNNABLE, group=TGRP-TestAuthenticationFramework]
         at sun.nio.ch.WindowsSelectorImpl$SubSelector.poll0(Native Method)
         at sun.nio.ch.WindowsSelectorImpl$SubSelector.poll(WindowsSelectorImpl.java:296)
         at sun.nio.ch.WindowsSelectorImpl$SubSelector.access$400(WindowsSelectorImpl.java:278)
         at sun.nio.ch.WindowsSelectorImpl.doSelect(WindowsSelectorImpl.java:159)
         at sun.nio.ch.SelectorImpl.lockAndDoSelect(SelectorImpl.java:86)
         at sun.nio.ch.SelectorImpl.select(SelectorImpl.java:97)
         at org.apache.zookeeper.server.NIOServerCnxnFactory.run(NIOServerCnxnFactory.java:178)
         at java.lang.Thread.run(Thread.java:745)
   10) Thread[id=11181, name=Thread-3468, state=WAITING, group=TGRP-TestAuthenticationFramework]
         at java.lang.Object.wait(Native Method)
         at java.lang.Thread.join(Thread.java:1245)
         at java.lang.Thread.join(Thread.java:1319)
         at org.apache.zookeeper.server.NIOServerCnxnFactory.join(NIOServerCnxnFactory.java:302)
         at org.apache.solr.cloud.ZkTestServer$ZKServerMain.runFromConfig(ZkTestServer.java:310)
         at org.apache.solr.cloud.ZkTestServer$2.run(ZkTestServer.java:491)
   11) Thread[id=11202, name=Thread-3471, state=WAITING, group=TGRP-TestAuthenticationFramework]
         at java.lang.Object.wait(Native Method)
         at java.lang.Thread.join(Thread.java:1245)
         at java.lang.Thread.join(Thread.java:1319)
         at org.apache.zookeeper.server.NIOServerCnxnFactory.join(NIOServerCnxnFactory.java:302)
         at org.apache.solr.cloud.ZkTestServer$ZKServerMain.runFromConfig(ZkTestServer.java:310)
         at org.apache.solr.cloud.ZkTestServer$2.run(ZkTestServer.java:491)
   12) Thread[id=11189, name=NIOServerCxn.Factory:0.0.0.0/0.0.0.0:0, state=RUNNABLE, group=TGRP-TestAuthenticationFramework]
         at sun.nio.ch.WindowsSelectorImpl$SubSelector.poll0(Native Method)
         at sun.nio.ch.WindowsSelectorImpl$SubSelector.poll(WindowsSelectorImpl.java:296)
         at sun.nio.ch.WindowsSelectorImpl$SubSelector.access$400(WindowsSelectorImpl.java:278)
         at sun.nio.ch.WindowsSelectorImpl.doSelect(WindowsSelectorImpl.java:159)
         at sun.nio.ch.SelectorImpl.lockAndDoSelect(SelectorImpl.java:86)
         at sun.nio.ch.SelectorImpl.select(SelectorImpl.java:97)
         at org.apache.zookeeper.server.NIOServerCnxnFactory.run(NIOServerCnxnFactory.java:178)
         at java.lang.Thread.run(Thread.java:745)
   13) Thread[id=11176, name=SessionTracker, state=TIMED_WAITING, group=TGRP-TestAuthenticationFramework]
         at java.lang.Object.wait(Native Method)
         at org.apache.zookeeper.server.SessionTrackerImpl.run(SessionTrackerImpl.java:146)
   14) Thread[id=11218, name=SessionTracker, state=TIMED_WAITING, group=TGRP-TestAuthenticationFramework]
         at java.lang.Object.wait(Native Method)
         at org.apache.zookeeper.server.SessionTrackerImpl.run(SessionTrackerImpl.java:146)
   15) Thread[id=11211, name=SessionTracker, state=TIMED_WAITING, group=TGRP-TestAuthenticationFramework]
         at java.lang.Object.wait(Native Method)
         at org.apache.zookeeper.server.SessionTrackerImpl.run(SessionTrackerImpl.java:146)
   16) Thread[id=11210, name=NIOServerCxn.Factory:0.0.0.0/0.0.0.0:0, state=RUNNABLE, group=TGRP-TestAuthenticationFramework]
         at sun.nio.ch.WindowsSelectorImpl$SubSelector.poll0(Native Method)
         at sun.nio.ch.WindowsSelectorImpl$SubSelector.poll(WindowsSelectorImpl.java:296)
         at sun.nio.ch.WindowsSelectorImpl$SubSelector.access$400(WindowsSelectorImpl.java:278)
         at sun.nio.ch.WindowsSelectorImpl.doSelect(WindowsSelectorImpl.java:159)
         at sun.nio.ch.SelectorImpl.lockAndDoSelect(SelectorImpl.java:86)
         at sun.nio.ch.SelectorImpl.select(SelectorImpl.java:97)
         at org.apache.zookeeper.server.NIOServerCnxnFactory.run(NIOServerCnxnFactory.java:178)
         at java.lang.Thread.run(Thread.java:745)
   17) Thread[id=11199, name=ProcessThread(sid:0 cport:-1):, state=WAITING, group=TGRP-TestAuthenticationFramework]
         at sun.misc.Unsafe.park(Native Method)
         at java.util.concurrent.locks.LockSupport.park(LockSupport.java:175)
         at java.util.concurrent.locks.AbstractQueuedSynchronizer$ConditionObject.await(AbstractQueuedSynchronizer.java:2039)
         at java.util.concurrent.LinkedBlockingQueue.take(LinkedBlockingQueue.java:442)
         at org.apache.zookeeper.server.PrepRequestProcessor.run(PrepRequestProcessor.java:120)
   18) Thread[id=11188, name=Thread-3469, state=WAITING, group=TGRP-TestAuthenticationFramework]
         at java.lang.Object.wait(Native Method)
         at java.lang.Thread.join(Thread.java:1245)
         at java.lang.Thread.join(Thread.java:1319)
         at org.apache.zookeeper.server.NIOServerCnxnFactory.join(NIOServerCnxnFactory.java:302)
         at org.apache.solr.cloud.ZkTestServer$ZKServerMain.runFromConfig(ZkTestServer.java:310)
         at org.apache.solr.cloud.ZkTestServer$2.run(ZkTestServer.java:491)
   19) Thread[id=11185, name=ProcessThread(sid:0 cport:-1):, state=WAITING, group=TGRP-TestAuthenticationFramework]
         at sun.misc.Unsafe.park(Native Method)
         at java.util.concurrent.locks.LockSupport.park(LockSupport.java:175)
         at java.util.concurrent.locks.AbstractQueuedSynchronizer$ConditionObject.await(AbstractQueuedSynchronizer.java:2039)
         at java.util.concurrent.LinkedBlockingQueue.take(LinkedBlockingQueue.java:442)
         at org.apache.zookeeper.server.PrepRequestProcessor.run(PrepRequestProcessor.java:120)
   20) Thread[id=11203, name=NIOServerCxn.Factory:0.0.0.0/0.0.0.0:0, state=RUNNABLE, group=TGRP-TestAuthenticationFramework]
         at sun.nio.ch.WindowsSelectorImpl$SubSelector.poll0(Native Method)
         at sun.nio.ch.WindowsSelectorImpl$SubSelector.poll(WindowsSelectorImpl.java:296)
         at sun.nio.ch.WindowsSelectorImpl$SubSelector.access$400(WindowsSelectorImpl.java:278)
         at sun.nio.ch.WindowsSelectorImpl.doSelect(WindowsSelectorImpl.java:159)
         at sun.nio.ch.SelectorImpl.lockAndDoSelect(SelectorImpl.java:86)
         at sun.nio.ch.SelectorImpl.select(SelectorImpl.java:97)
         at org.apache.zookeeper.server.NIOServerCnxnFactory.run(NIOServerCnxnFactory.java:178)
         at java.lang.Thread.run(Thread.java:745)
   21) Thread[id=11196, name=NIOServerCxn.Factory:0.0.0.0/0.0.0.0:0, state=RUNNABLE, group=TGRP-TestAuthenticationFramework]
         at sun.nio.ch.WindowsSelectorImpl$SubSelector.poll0(Native Method)
         at sun.nio.ch.WindowsSelectorImpl$SubSelector.poll(WindowsSelectorImpl.java:296)
         at sun.nio.ch.WindowsSelectorImpl$SubSelector.access$400(WindowsSelectorImpl.java:278)
         at sun.nio.ch.WindowsSelectorImpl.doSelect(WindowsSelectorImpl.java:159)
         at sun.nio.ch.SelectorImpl.lockAndDoSelect(SelectorImpl.java:86)
         at sun.nio.ch.SelectorImpl.select(SelectorImpl.java:97)
         at org.apache.zookeeper.server.NIOServerCnxnFactory.run(NIOServerCnxnFactory.java:178)
         at java.lang.Thread.run(Thread.java:745)
   22) Thread[id=11182, name=NIOServerCxn.Factory:0.0.0.0/0.0.0.0:0, state=RUNNABLE, group=TGRP-TestAuthenticationFramework]
         at sun.nio.ch.WindowsSelectorImpl$SubSelector.poll0(Native Method)
         at sun.nio.ch.WindowsSelectorImpl$SubSelector.poll(WindowsSelectorImpl.java:296)
         at sun.nio.ch.WindowsSelectorImpl$SubSelector.access$400(WindowsSelectorImpl.java:278)
         at sun.nio.ch.WindowsSelectorImpl.doSelect(WindowsSelectorImpl.java:159)
         at sun.nio.ch.SelectorImpl.lockAndDoSelect(SelectorImpl.java:86)
         at sun.nio.ch.SelectorImpl.select(SelectorImpl.java:97)
         at org.apache.zookeeper.server.NIOServerCnxnFactory.run(NIOServerCnxnFactory.java:178)
         at java.lang.Thread.run(Thread.java:745)
   23) Thread[id=11174, name=Thread-3467, state=WAITING, group=TGRP-TestAuthenticationFramework]
         at java.lang.Object.wait(Native Method)
         at java.lang.Thread.join(Thread.java:1245)
         at java.lang.Thread.join(Thread.java:1319)
         at org.apache.zookeeper.server.NIOServerCnxnFactory.join(NIOServerCnxnFactory.java:302)
         at org.apache.solr.cloud.ZkTestServer$ZKServerMain.runFromConfig(ZkTestServer.java:310)
         at org.apache.solr.cloud.ZkTestServer$2.run(ZkTestServer.java:491)
   24) Thread[id=11206, name=ProcessThread(sid:0 cport:-1):, state=WAITING, group=TGRP-TestAuthenticationFramework]
         at sun.misc.Unsafe.park(Native Method)
         at java.util.concurrent.locks.LockSupport.park(LockSupport.java:175)
         at java.util.concurrent.locks.AbstractQueuedSynchronizer$ConditionObject.await(AbstractQueuedSynchronizer.java:2039)
         at java.util.concurrent.LinkedBlockingQueue.take(LinkedBlockingQueue.java:442)
         at org.apache.zookeeper.server.PrepRequestProcessor.run(PrepRequestProcessor.java:120)
   25) Thread[id=11220, name=ProcessThread(sid:0 cport:-1):, state=WAITING, group=TGRP-TestAuthenticationFramework]
         at sun.misc.Unsafe.park(Native Method)
         at java.util.concurrent.locks.LockSupport.park(LockSupport.java:175)
         at java.util.concurrent.locks.AbstractQueuedSynchronizer$ConditionObject.await(AbstractQueuedSynchronizer.java:2039)
         at java.util.concurrent.LinkedBlockingQueue.take(LinkedBlockingQueue.java:442)
         at org.apache.zookeeper.server.PrepRequestProcessor.run(PrepRequestProcessor.java:120)
   26) Thread[id=11204, name=SessionTracker, state=TIMED_WAITING, group=TGRP-TestAuthenticationFramework]
         at java.lang.Object.wait(Native Method)
         at org.apache.zookeeper.server.SessionTrackerImpl.run(SessionTrackerImpl.java:146)
   27) Thread[id=11209, name=Thread-3472, state=WAITING, group=TGRP-TestAuthenticationFramework]
         at java.lang.Object.wait(Native Method)
         at java.lang.Thread.join(Thread.java:1245)
         at java.lang.Thread.join(Thread.java:1319)
         at org.apache.zookeeper.server.NIOServerCnxnFactory.join(NIOServerCnxnFactory.java:302)
         at org.apache.solr.cloud.ZkTestServer$ZKServerMain.runFromConfig(ZkTestServer.java:310)
         at org.apache.solr.cloud.ZkTestServer$2.run(ZkTestServer.java:491)
   28) Thread[id=11183, name=SessionTracker, state=TIMED_WAITING, group=TGRP-TestAuthenticationFramework]
         at java.lang.Object.wait(Native Method)
         at org.apache.zookeeper.server.SessionTrackerImpl.run(SessionTrackerImpl.java:146)
  at __randomizedtesting.SeedInfo.seed([F816F89A14095103]:0)


FAILED: junit.framework.TestSuite.org.apache.solr.cloud.TestAuthenticationFramework

Error Message:
There are still zombie threads that couldn't be terminated: 1) Thread[id=11203, name=NIOServerCxn.Factory:0.0.0.0/0.0.0.0:0, state=RUNNABLE, group=TGRP-TestAuthenticationFramework] at sun.nio.ch.WindowsSelectorImpl$SubSelector.poll0(Native Method) at sun.nio.ch.WindowsSelectorImpl$SubSelector.poll(WindowsSelectorImpl.java:296) at sun.nio.ch.WindowsSelectorImpl$SubSelector.access$400(WindowsSelectorImpl.java:278) at sun.nio.ch.WindowsSelectorImpl.doSelect(WindowsSelectorImpl.java:159) at sun.nio.ch.SelectorImpl.lockAndDoSelect(SelectorImpl.java:86) at sun.nio.ch.SelectorImpl.select(SelectorImpl.java:97) at org.apache.zookeeper.server.NIOServerCnxnFactory.run(NIOServerCnxnFactory.java:178) at java.lang.Thread.run(Thread.java:745) 2) Thread[id=11196, name=NIOServerCxn.Factory:0.0.0.0/0.0.0.0:0, state=RUNNABLE, group=TGRP-TestAuthenticationFramework] at sun.nio.ch.WindowsSelectorImpl$SubSelector.poll0(Native Method) at sun.nio.ch.WindowsSelectorImpl$SubSelector.poll(WindowsSelectorImpl.java:296) at sun.nio.ch.WindowsSelectorImpl$SubSelector.access$400(WindowsSelectorImpl.java:278) at sun.nio.ch.WindowsSelectorImpl.doSelect(WindowsSelectorImpl.java:159) at sun.nio.ch.SelectorImpl.lockAndDoSelect(SelectorImpl.java:86) at sun.nio.ch.SelectorImpl.select(SelectorImpl.java:97) at org.apache.zookeeper.server.NIOServerCnxnFactory.run(NIOServerCnxnFactory.java:178) at java.lang.Thread.run(Thread.java:745) 3) Thread[id=11189, name=NIOServerCxn.Factory:0.0.0.0/0.0.0.0:0, state=RUNNABLE, group=TGRP-TestAuthenticationFramework] at sun.nio.ch.WindowsSelectorImpl$SubSelector.poll0(Native Method) at sun.nio.ch.WindowsSelectorImpl$SubSelector.poll(WindowsSelectorImpl.java:296) at sun.nio.ch.WindowsSelectorImpl$SubSelector.access$400(WindowsSelectorImpl.java:278) at sun.nio.ch.WindowsSelectorImpl.doSelect(WindowsSelectorImpl.java:159) at sun.nio.ch.SelectorImpl.lockAndDoSelect(SelectorImpl.java:86) at sun.nio.ch.SelectorImpl.select(SelectorImpl.java:97) at org.apache.zookeeper.server.NIOServerCnxnFactory.run(NIOServerCnxnFactory.java:178) at java.lang.Thread.run(Thread.java:745) 4) Thread[id=11182, name=NIOServerCxn.Factory:0.0.0.0/0.0.0.0:0, state=RUNNABLE, group=TGRP-TestAuthenticationFramework] at sun.nio.ch.WindowsSelectorImpl$SubSelector.poll0(Native Method) at sun.nio.ch.WindowsSelectorImpl$SubSelector.poll(WindowsSelectorImpl.java:296) at sun.nio.ch.WindowsSelectorImpl$SubSelector.access$400(WindowsSelectorImpl.java:278) at sun.nio.ch.WindowsSelectorImpl.doSelect(WindowsSelectorImpl.java:159) at sun.nio.ch.SelectorImpl.lockAndDoSelect(SelectorImpl.java:86) at sun.nio.ch.SelectorImpl.select(SelectorImpl.java:97) at org.apache.zookeeper.server.NIOServerCnxnFactory.run(NIOServerCnxnFactory.java:178) at java.lang.Thread.run(Thread.java:745) 5) Thread[id=11217, name=NIOServerCxn.Factory:0.0.0.0/0.0.0.0:0, state=RUNNABLE, group=TGRP-TestAuthenticationFramework] at java.lang.Object.notifyAll(Native Method) at sun.nio.ch.WindowsSelectorImpl$StartLock.startThreads(WindowsSelectorImpl.java:189) at sun.nio.ch.WindowsSelectorImpl$StartLock.access$300(WindowsSelectorImpl.java:181) at sun.nio.ch.WindowsSelectorImpl.doSelect(WindowsSelectorImpl.java:153) at sun.nio.ch.SelectorImpl.lockAndDoSelect(SelectorImpl.java:86) at sun.nio.ch.SelectorImpl.select(SelectorImpl.java:97) at org.apache.zookeeper.server.NIOServerCnxnFactory.run(NIOServerCnxnFactory.java:178) at java.lang.Thread.run(Thread.java:745) 6) Thread[id=11210, name=NIOServerCxn.Factory:0.0.0.0/0.0.0.0:0, state=RUNNABLE, group=TGRP-TestAuthenticationFramework] at sun.nio.ch.WindowsSelectorImpl$SubSelector.poll0(Native Method) at sun.nio.ch.WindowsSelectorImpl$SubSelector.poll(WindowsSelectorImpl.java:296) at sun.nio.ch.WindowsSelectorImpl$SubSelector.access$400(WindowsSelectorImpl.java:278) at sun.nio.ch.WindowsSelectorImpl.doSelect(WindowsSelectorImpl.java:159) at sun.nio.ch.SelectorImpl.lockAndDoSelect(SelectorImpl.java:86) at sun.nio.ch.SelectorImpl.select(SelectorImpl.java:97) at org.apache.zookeeper.server.NIOServerCnxnFactory.run(NIOServerCnxnFactory.java:178) at java.lang.Thread.run(Thread.java:745) 7) Thread[id=11175, name=NIOServerCxn.Factory:0.0.0.0/0.0.0.0:0, state=RUNNABLE, group=TGRP-TestAuthenticationFramework] at sun.nio.ch.WindowsSelectorImpl$SubSelector.poll0(Native Method) at sun.nio.ch.WindowsSelectorImpl$SubSelector.poll(WindowsSelectorImpl.java:296) at sun.nio.ch.WindowsSelectorImpl$SubSelector.access$400(WindowsSelectorImpl.java:278) at sun.nio.ch.WindowsSelectorImpl.doSelect(WindowsSelectorImpl.java:159) at sun.nio.ch.SelectorImpl.lockAndDoSelect(SelectorImpl.java:86) at sun.nio.ch.SelectorImpl.select(SelectorImpl.java:97) at org.apache.zookeeper.server.NIOServerCnxnFactory.run(NIOServerCnxnFactory.java:178) at java.lang.Thread.run(Thread.java:745)

Stack Trace:
com.carrotsearch.randomizedtesting.ThreadLeakError: There are still zombie threads that couldn't be terminated:
    1) Thread[id=11203, name=NIOServerCxn.Factory:0.0.0.0/0.0.0.0:0, state=RUNNABLE, group=TGRP-TestAuthenticationFramework]
         at sun.nio.ch.WindowsSelectorImpl$SubSelector.poll0(Native Method)
         at sun.nio.ch.WindowsSelectorImpl$SubSelector.poll(WindowsSelectorImpl.java:296)
         at sun.nio.ch.WindowsSelectorImpl$SubSelector.access$400(WindowsSelectorImpl.java:278)
         at sun.nio.ch.WindowsSelectorImpl.doSelect(WindowsSelectorImpl.java:159)
         at sun.nio.ch.SelectorImpl.lockAndDoSelect(SelectorImpl.java:86)
         at sun.nio.ch.SelectorImpl.select(SelectorImpl.java:97)
         at org.apache.zookeeper.server.NIOServerCnxnFactory.run(NIOServerCnxnFactory.java:178)
         at java.lang.Thread.run(Thread.java:745)
    2) Thread[id=11196, name=NIOServerCxn.Factory:0.0.0.0/0.0.0.0:0, state=RUNNABLE, group=TGRP-TestAuthenticationFramework]
         at sun.nio.ch.WindowsSelectorImpl$SubSelector.poll0(Native Method)
         at sun.nio.ch.WindowsSelectorImpl$SubSelector.poll(WindowsSelectorImpl.java:296)
         at sun.nio.ch.WindowsSelectorImpl$SubSelector.access$400(WindowsSelectorImpl.java:278)
         at sun.nio.ch.WindowsSelectorImpl.doSelect(WindowsSelectorImpl.java:159)
         at sun.nio.ch.SelectorImpl.lockAndDoSelect(SelectorImpl.java:86)
         at sun.nio.ch.SelectorImpl.select(SelectorImpl.java:97)
         at org.apache.zookeeper.server.NIOServerCnxnFactory.run(NIOServerCnxnFactory.java:178)
         at java.lang.Thread.run(Thread.java:745)
    3) Thread[id=11189, name=NIOServerCxn.Factory:0.0.0.0/0.0.0.0:0, state=RUNNABLE, group=TGRP-TestAuthenticationFramework]
         at sun.nio.ch.WindowsSelectorImpl$SubSelector.poll0(Native Method)
         at sun.nio.ch.WindowsSelectorImpl$SubSelector.poll(WindowsSelectorImpl.java:296)
         at sun.nio.ch.WindowsSelectorImpl$SubSelector.access$400(WindowsSelectorImpl.java:278)
         at sun.nio.ch.WindowsSelectorImpl.doSelect(WindowsSelectorImpl.java:159)
         at sun.nio.ch.SelectorImpl.lockAndDoSelect(SelectorImpl.java:86)
         at sun.nio.ch.SelectorImpl.select(SelectorImpl.java:97)
         at org.apache.zookeeper.server.NIOServerCnxnFactory.run(NIOServerCnxnFactory.java:178)
         at java.lang.Thread.run(Thread.java:745)
    4) Thread[id=11182, name=NIOServerCxn.Factory:0.0.0.0/0.0.0.0:0, state=RUNNABLE, group=TGRP-TestAuthenticationFramework]
         at sun.nio.ch.WindowsSelectorImpl$SubSelector.poll0(Native Method)
         at sun.nio.ch.WindowsSelectorImpl$SubSelector.poll(WindowsSelectorImpl.java:296)
         at sun.nio.ch.WindowsSelectorImpl$SubSelector.access$400(WindowsSelectorImpl.java:278)
         at sun.nio.ch.WindowsSelectorImpl.doSelect(WindowsSelectorImpl.java:159)
         at sun.nio.ch.SelectorImpl.lockAndDoSelect(SelectorImpl.java:86)
         at sun.nio.ch.SelectorImpl.select(SelectorImpl.java:97)
         at org.apache.zookeeper.server.NIOServerCnxnFactory.run(NIOServerCnxnFactory.java:178)
         at java.lang.Thread.run(Thread.java:745)
    5) Thread[id=11217, name=NIOServerCxn.Factory:0.0.0.0/0.0.0.0:0, state=RUNNABLE, group=TGRP-TestAuthenticationFramework]
         at java.lang.Object.notifyAll(Native Method)
         at sun.nio.ch.WindowsSelectorImpl$StartLock.startThreads(WindowsSelectorImpl.java:189)
         at sun.nio.ch.WindowsSelectorImpl$StartLock.access$300(WindowsSelectorImpl.java:181)
         at sun.nio.ch.WindowsSelectorImpl.doSelect(WindowsSelectorImpl.java:153)
         at sun.nio.ch.SelectorImpl.lockAndDoSelect(SelectorImpl.java:86)
         at sun.nio.ch.SelectorImpl.select(SelectorImpl.java:97)
         at org.apache.zookeeper.server.NIOServerCnxnFactory.run(NIOServerCnxnFactory.java:178)
         at java.lang.Thread.run(Thread.java:745)
    6) Thread[id=11210, name=NIOServerCxn.Factory:0.0.0.0/0.0.0.0:0, state=RUNNABLE, group=TGRP-TestAuthenticationFramework]
         at sun.nio.ch.WindowsSelectorImpl$SubSelector.poll0(Native Method)
         at sun.nio.ch.WindowsSelectorImpl$SubSelector.poll(WindowsSelectorImpl.java:296)
         at sun.nio.ch.WindowsSelectorImpl$SubSelector.access$400(WindowsSelectorImpl.java:278)
         at sun.nio.ch.WindowsSelectorImpl.doSelect(WindowsSelectorImpl.java:159)
         at sun.nio.ch.SelectorImpl.lockAndDoSelect(SelectorImpl.java:86)
         at sun.nio.ch.SelectorImpl.select(SelectorImpl.java:97)
         at org.apache.zookeeper.server.NIOServerCnxnFactory.run(NIOServerCnxnFactory.java:178)
         at java.lang.Thread.run(Thread.java:745)
    7) Thread[id=11175, name=NIOServerCxn.Factory:0.0.0.0/0.0.0.0:0, state=RUNNABLE, group=TGRP-TestAuthenticationFramework]
         at sun.nio.ch.WindowsSelectorImpl$SubSelector.poll0(Native Method)
         at sun.nio.ch.WindowsSelectorImpl$SubSelector.poll(WindowsSelectorImpl.java:296)
         at sun.nio.ch.WindowsSelectorImpl$SubSelector.access$400(WindowsSelectorImpl.java:278)
         at sun.nio.ch.WindowsSelectorImpl.doSelect(WindowsSelectorImpl.java:159)
         at sun.nio.ch.SelectorImpl.lockAndDoSelect(SelectorImpl.java:86)
         at sun.nio.ch.SelectorImpl.select(SelectorImpl.java:97)
         at org.apache.zookeeper.server.NIOServerCnxnFactory.run(NIOServerCnxnFactory.java:178)
         at java.lang.Thread.run(Thread.java:745)
  at __randomizedtesting.SeedInfo.seed([F816F89A14095103]:0)


FAILED: org.apache.solr.cloud.ZkCLITest.testGetFileNotExists

Error Message:
java.util.concurrent.TimeoutException: Could not connect to ZooKeeper 127.0.0.1:61026 within 30000 ms

Stack Trace:
org.apache.solr.common.SolrException: java.util.concurrent.TimeoutException: Could not connect to ZooKeeper 127.0.0.1:61026 within 30000 ms
  at org.apache.solr.common.cloud.SolrZkClient.(SolrZkClient.java:114)
  at org.apache.solr.common.cloud.SolrZkClient.(SolrZkClient.java:96)
  at org.apache.solr.cloud.ZkCLITest.setUp(ZkCLITest.java:93)
  at sun.reflect.GeneratedMethodAccessor5.invoke(Unknown Source)
  at sun.reflect.DelegatingMethodAccessorImpl.invoke(DelegatingMethodAccessorImpl.java:43)
  at java.lang.reflect.Method.invoke(Method.java:498)
  at com.carrotsearch.randomizedtesting.RandomizedRunner.invoke(RandomizedRunner.java:1764)
  at com.carrotsearch.randomizedtesting.RandomizedRunner$9.evaluate(RandomizedRunner.java:905)
  at com.carrotsearch.randomizedtesting.RandomizedRunner$10.evaluate(RandomizedRunner.java:921)
  at com.carrotsearch.randomizedtesting.rules.SystemPropertiesRestoreRule$1.evaluate(SystemPropertiesRestoreRule.java:57)
  at org.apache.lucene.util.TestRuleSetupTeardownChained$1.evaluate(TestRuleSetupTeardownChained.java:49)
  at org.apache.lucene.util.AbstractBeforeAfterRule$1.evaluate(AbstractBeforeAfterRule.java:45)
  at org.apache.lucene.util.TestRuleThreadAndTestName$1.evaluate(TestRuleThreadAndTestName.java:48)
  at org.apache.lucene.util.TestRuleIgnoreAfterMaxFailures$1.evaluate(TestRuleIgnoreAfterMaxFailures.java:64)
  at org.apache.lucene.util.TestRuleMarkFailure$1.evaluate(TestRuleMarkFailure.java:47)
  at com.carrotsearch.randomizedtesting.rules.StatementAdapter.evaluate(StatementAdapter.java:36)
  at com.carrotsearch.randomizedtesting.ThreadLeakControl$StatementRunner.run(ThreadLeakControl.java:367)
  at com.carrotsearch.randomizedtesting.ThreadLeakControl.forkTimeoutingTask(ThreadLeakControl.java:809)
  at com.carrotsearch.randomizedtesting.ThreadLeakControl$3.evaluate(ThreadLeakControl.java:460)
  at com.carrotsearch.randomizedtesting.RandomizedRunner.runSingleTest(RandomizedRunner.java:880)
  at com.carrotsearch.randomizedtesting.RandomizedRunner$5.evaluate(RandomizedRunner.java:781)
  at com.carrotsearch.randomizedtesting.RandomizedRunner$6.evaluate(RandomizedRunner.java:816)
  at com.carrotsearch.randomizedtesting.RandomizedRunner$7.evaluate(RandomizedRunner.java:827)
  at com.carrotsearch.randomizedtesting.rules.StatementAdapter.evaluate(StatementAdapter.java:36)
  at com.carrotsearch.randomizedtesting.rules.SystemPropertiesRestoreRule$1.evaluate(SystemPropertiesRestoreRule.java:57)
  at org.apache.lucene.util.AbstractBeforeAfterRule$1.evaluate(AbstractBeforeAfterRule.java:45)
  at com.carrotsearch.randomizedtesting.rules.StatementAdapter.evaluate(StatementAdapter.java:36)
  at org.apache.lucene.util.TestRuleStoreClassName$1.evaluate(TestRuleStoreClassName.java:41)
  at com.carrotsearch.randomizedtesting.rules.NoShadowingOrOverridesOnMethodsRule$1.evaluate(NoShadowingOrOverridesOnMethodsRule.java:40)
  at com.carrotsearch.randomizedtesting.rules.NoShadowingOrOverridesOnMethodsRule$1.evaluate(NoShadowingOrOverridesOnMethodsRule.java:40)
  at com.carrotsearch.randomizedtesting.rules.StatementAdapter.evaluate(StatementAdapter.java:36)
  at com.carrotsearch.randomizedtesting.rules.StatementAdapter.evaluate(StatementAdapter.java:36)
  at com.carrotsearch.randomizedtesting.rules.StatementAdapter.evaluate(StatementAdapter.java:36)
  at org.apache.lucene.util.TestRuleAssertionsRequired$1.evaluate(TestRuleAssertionsRequired.java:53)
  at org.apache.lucene.util.TestRuleMarkFailure$1.evaluate(TestRuleMarkFailure.java:47)
  at org.apache.lucene.util.TestRuleIgnoreAfterMaxFailures$1.evaluate(TestRuleIgnoreAfterMaxFailures.java:64)
  at org.apache.lucene.util.TestRuleIgnoreTestSuites$1.evaluate(TestRuleIgnoreTestSuites.java:54)
  at com.carrotsearch.randomizedtesting.rules.StatementAdapter.evaluate(StatementAdapter.java:36)
  at com.carrotsearch.randomizedtesting.ThreadLeakControl$StatementRunner.run(ThreadLeakControl.java:367)
  at java.lang.Thread.run(Thread.java:745)
Caused by: java.util.concurrent.TimeoutException: Could not connect to ZooKeeper 127.0.0.1:61026 within 30000 ms
  at org.apache.solr.common.cloud.ConnectionManager.waitForConnected(ConnectionManager.java:228)
  at org.apache.solr.common.cloud.SolrZkClient.<init>(SolrZkClient.java:172)
  ... 41 more


FAILED: org.apache.solr.cloud.ZkCLITest.testInvalidZKAddress

Error Message:
java.util.concurrent.TimeoutException: Could not connect to ZooKeeper 127.0.0.1:61048 within 30000 ms

Stack Trace:
org.apache.solr.common.SolrException: java.util.concurrent.TimeoutException: Could not connect to ZooKeeper 127.0.0.1:61048 within 30000 ms
  at org.apache.solr.common.cloud.SolrZkClient.(SolrZkClient.java:114)
  at org.apache.solr.common.cloud.SolrZkClient.(SolrZkClient.java:96)
  at org.apache.solr.cloud.ZkCLITest.setUp(ZkCLITest.java:93)
  at sun.reflect.GeneratedMethodAccessor5.invoke(Unknown Source)
  at sun.reflect.DelegatingMethodAccessorImpl.invoke(DelegatingMethodAccessorImpl.java:43)
  at java.lang.reflect.Method.invoke(Method.java:498)
  at com.carrotsearch.randomizedtesting.RandomizedRunner.invoke(RandomizedRunner.java:1764)
  at com.carrotsearch.randomizedtesting.RandomizedRunner$9.evaluate(RandomizedRunner.java:905)
  at com.carrotsearch.randomizedtesting.RandomizedRunner$10.evaluate(RandomizedRunner.java:921)
  at com.carrotsearch.randomizedtesting.rules.SystemPropertiesRestoreRule$1.evaluate(SystemPropertiesRestoreRule.java:57)
  at org.apache.lucene.util.TestRuleSetupTeardownChained$1.evaluate(TestRuleSetupTeardownChained.java:49)
  at org.apache.lucene.util.AbstractBeforeAfterRule$1.evaluate(AbstractBeforeAfterRule.java:45)
  at org.apache.lucene.util.TestRuleThreadAndTestName$1.evaluate(TestRuleThreadAndTestName.java:48)
  at org.apache.lucene.util.TestRuleIgnoreAfterMaxFailures$1.evaluate(TestRuleIgnoreAfterMaxFailures.java:64)
  at org.apache.lucene.util.TestRuleMarkFailure$1.evaluate(TestRuleMarkFailure.java:47)
  at com.carrotsearch.randomizedtesting.rules.StatementAdapter.evaluate(StatementAdapter.java:36)
  at com.carrotsearch.randomizedtesting.ThreadLeakControl$StatementRunner.run(ThreadLeakControl.java:367)
  at com.carrotsearch.randomizedtesting.ThreadLeakControl.forkTimeoutingTask(ThreadLeakControl.java:809)
  at com.carrotsearch.randomizedtesting.ThreadLeakControl$3.evaluate(ThreadLeakControl.java:460)
  at com.carrotsearch.randomizedtesting.RandomizedRunner.runSingleTest(RandomizedRunner.java:880)
  at com.carrotsearch.randomizedtesting.RandomizedRunner$5.evaluate(RandomizedRunner.java:781)
  at com.carrotsearch.randomizedtesting.RandomizedRunner$6.evaluate(RandomizedRunner.java:816)
  at com.carrotsearch.randomizedtesting.RandomizedRunner$7.evaluate(RandomizedRunner.java:827)
  at com.carrotsearch.randomizedtesting.rules.StatementAdapter.evaluate(StatementAdapter.java:36)
  at com.carrotsearch.randomizedtesting.rules.SystemPropertiesRestoreRule$1.evaluate(SystemPropertiesRestoreRule.java:57)
  at org.apache.lucene.util.AbstractBeforeAfterRule$1.evaluate(AbstractBeforeAfterRule.java:45)
  at com.carrotsearch.randomizedtesting.rules.StatementAdapter.evaluate(StatementAdapter.java:36)
  at org.apache.lucene.util.TestRuleStoreClassName$1.evaluate(TestRuleStoreClassName.java:41)
  at com.carrotsearch.randomizedtesting.rules.NoShadowingOrOverridesOnMethodsRule$1.evaluate(NoShadowingOrOverridesOnMethodsRule.java:40)
  at com.carrotsearch.randomizedtesting.rules.NoShadowingOrOverridesOnMethodsRule$1.evaluate(NoShadowingOrOverridesOnMethodsRule.java:40)
  at com.carrotsearch.randomizedtesting.rules.StatementAdapter.evaluate(StatementAdapter.java:36)
  at com.carrotsearch.randomizedtesting.rules.StatementAdapter.evaluate(StatementAdapter.java:36)
  at com.carrotsearch.randomizedtesting.rules.StatementAdapter.evaluate(StatementAdapter.java:36)
  at org.apache.lucene.util.TestRuleAssertionsRequired$1.evaluate(TestRuleAssertionsRequired.java:53)
  at org.apache.lucene.util.TestRuleMarkFailure$1.evaluate(TestRuleMarkFailure.java:47)
  at org.apache.lucene.util.TestRuleIgnoreAfterMaxFailures$1.evaluate(TestRuleIgnoreAfterMaxFailures.java:64)
  at org.apache.lucene.util.TestRuleIgnoreTestSuites$1.evaluate(TestRuleIgnoreTestSuites.java:54)
  at com.carrotsearch.randomizedtesting.rules.StatementAdapter.evaluate(StatementAdapter.java:36)
  at com.carrotsearch.randomizedtesting.ThreadLeakControl$StatementRunner.run(ThreadLeakControl.java:367)
  at java.lang.Thread.run(Thread.java:745)
Caused by: java.util.concurrent.TimeoutException: Could not connect to ZooKeeper 127.0.0.1:61048 within 30000 ms
  at org.apache.solr.common.cloud.ConnectionManager.waitForConnected(ConnectionManager.java:228)
  at org.apache.solr.common.cloud.SolrZkClient.<init>(SolrZkClient.java:172)
  ... 41 more


FAILED: junit.framework.TestSuite.org.apache.solr.cloud.ZkCLITest

Error Message:
8 threads leaked from SUITE scope at org.apache.solr.cloud.ZkCLITest: 1) Thread[id=9872, name=NIOServerCxn.Factory:0.0.0.0/0.0.0.0:0, state=RUNNABLE, group=TGRP-ZkCLITest] at sun.nio.ch.WindowsSelectorImpl$SubSelector.poll0(Native Method) at sun.nio.ch.WindowsSelectorImpl$SubSelector.poll(WindowsSelectorImpl.java:296) at sun.nio.ch.WindowsSelectorImpl$SubSelector.access$400(WindowsSelectorImpl.java:278) at sun.nio.ch.WindowsSelectorImpl.doSelect(WindowsSelectorImpl.java:159) at sun.nio.ch.SelectorImpl.lockAndDoSelect(SelectorImpl.java:86) at sun.nio.ch.SelectorImpl.select(SelectorImpl.java:97) at org.apache.zookeeper.server.NIOServerCnxnFactory.run(NIOServerCnxnFactory.java:178) at java.lang.Thread.run(Thread.java:745) 2) Thread[id=9880, name=SessionTracker, state=TIMED_WAITING, group=TGRP-ZkCLITest] at java.lang.Object.wait(Native Method) at org.apache.zookeeper.server.SessionTrackerImpl.run(SessionTrackerImpl.java:146) 3) Thread[id=9879, name=NIOServerCxn.Factory:0.0.0.0/0.0.0.0:0, state=RUNNABLE, group=TGRP-ZkCLITest] at sun.nio.ch.WindowsSelectorImpl$SubSelector.poll0(Native Method) at sun.nio.ch.WindowsSelectorImpl$SubSelector.poll(WindowsSelectorImpl.java:296) at sun.nio.ch.WindowsSelectorImpl$SubSelector.access$400(WindowsSelectorImpl.java:278) at sun.nio.ch.WindowsSelectorImpl.doSelect(WindowsSelectorImpl.java:159) at sun.nio.ch.SelectorImpl.lockAndDoSelect(SelectorImpl.java:86) at sun.nio.ch.SelectorImpl.select(SelectorImpl.java:97) at org.apache.zookeeper.server.NIOServerCnxnFactory.run(NIOServerCnxnFactory.java:178) at java.lang.Thread.run(Thread.java:745) 4) Thread[id=9882, name=ProcessThread(sid:0 cport:-1):, state=WAITING, group=TGRP-ZkCLITest] at sun.misc.Unsafe.park(Native Method) at java.util.concurrent.locks.LockSupport.park(LockSupport.java:175) at java.util.concurrent.locks.AbstractQueuedSynchronizer$ConditionObject.await(AbstractQueuedSynchronizer.java:2039) at java.util.concurrent.LinkedBlockingQueue.take(LinkedBlockingQueue.java:442) at org.apache.zookeeper.server.PrepRequestProcessor.run(PrepRequestProcessor.java:120) 5) Thread[id=9878, name=Thread-3018, state=WAITING, group=TGRP-ZkCLITest] at java.lang.Object.wait(Native Method) at java.lang.Thread.join(Thread.java:1245) at java.lang.Thread.join(Thread.java:1319) at org.apache.zookeeper.server.NIOServerCnxnFactory.join(NIOServerCnxnFactory.java:302) at org.apache.solr.cloud.ZkTestServer$ZKServerMain.runFromConfig(ZkTestServer.java:310) at org.apache.solr.cloud.ZkTestServer$2.run(ZkTestServer.java:491) 6) Thread[id=9873, name=SessionTracker, state=TIMED_WAITING, group=TGRP-ZkCLITest] at java.lang.Object.wait(Native Method) at org.apache.zookeeper.server.SessionTrackerImpl.run(SessionTrackerImpl.java:146) 7) Thread[id=9875, name=ProcessThread(sid:0 cport:-1):, state=WAITING, group=TGRP-ZkCLITest] at sun.misc.Unsafe.park(Native Method) at java.util.concurrent.locks.LockSupport.park(LockSupport.java:175) at java.util.concurrent.locks.A

[...truncated too long message...]

che.zookeeper.server.PrepRequestProcessor.run(PrepRequestProcessor.java:120)
    [junit4] > 25) Thread[id=11220, name=ProcessThread(sid:0 cport:-1):, state=WAITING, group=TGRP-TestAuthenticationFramework]
    [junit4] > at sun.misc.Unsafe.park(Native Method)
    [junit4] > at java.util.concurrent.locks.LockSupport.park(LockSupport.java:175)
    [junit4] > at java.util.concurrent.locks.AbstractQueuedSynchronizer$ConditionObject.await(AbstractQueuedSynchronizer.java:2039)
    [junit4] > at java.util.concurrent.LinkedBlockingQueue.take(LinkedBlockingQueue.java:442)
    [junit4] > at org.apache.zookeeper.server.PrepRequestProcessor.run(PrepRequestProcessor.java:120)
    [junit4] > 26) Thread[id=11204, name=SessionTracker, state=TIMED_WAITING, group=TGRP-TestAuthenticationFramework]
    [junit4] > at java.lang.Object.wait(Native Method)
    [junit4] > at org.apache.zookeeper.server.SessionTrackerImpl.run(SessionTrackerImpl.java:146)
    [junit4] > 27) Thread[id=11209, name=Thread-3472, state=WAITING, group=TGRP-TestAuthenticationFramework]
    [junit4] > at java.lang.Object.wait(Native Method)
    [junit4] > at java.lang.Thread.join(Thread.java:1245)
    [junit4] > at java.lang.Thread.join(Thread.java:1319)
    [junit4] > at org.apache.zookeeper.server.NIOServerCnxnFactory.join(NIOServerCnxnFactory.java:302)
    [junit4] > at org.apache.solr.cloud.ZkTestServer$ZKServerMain.runFromConfig(ZkTestServer.java:310)
    [junit4] > at org.apache.solr.cloud.ZkTestServer$2.run(ZkTestServer.java:491)
    [junit4] > 28) Thread[id=11183, name=SessionTracker, state=TIMED_WAITING, group=TGRP-TestAuthenticationFramework]
    [junit4] > at java.lang.Object.wait(Native Method)
    [junit4] > at org.apache.zookeeper.server.SessionTrackerImpl.run(SessionTrackerImpl.java:146)
    [junit4] > at __randomizedtesting.SeedInfo.seed([F816F89A14095103]:0)Throwable #2: com.carrotsearch.randomizedtesting.ThreadLeakError: There are still zombie threads that couldn't be terminated:
    [junit4] > 1) Thread[id=11203, name=NIOServerCxn.Factory:0.0.0.0/0.0.0.0:0, state=RUNNABLE, group=TGRP-TestAuthenticationFramework]
    [junit4] > at sun.nio.ch.WindowsSelectorImpl$SubSelector.poll0(Native Method)
    [junit4] > at sun.nio.ch.WindowsSelectorImpl$SubSelector.poll(WindowsSelectorImpl.java:296)
    [junit4] > at sun.nio.ch.WindowsSelectorImpl$SubSelector.access$400(WindowsSelectorImpl.java:278)
    [junit4] > at sun.nio.ch.WindowsSelectorImpl.doSelect(WindowsSelectorImpl.java:159)
    [junit4] > at sun.nio.ch.SelectorImpl.lockAndDoSelect(SelectorImpl.java:86)
    [junit4] > at sun.nio.ch.SelectorImpl.select(SelectorImpl.java:97)
    [junit4] > at org.apache.zookeeper.server.NIOServerCnxnFactory.run(NIOServerCnxnFactory.java:178)
    [junit4] > at java.lang.Thread.run(Thread.java:745)
    [junit4] > 2) Thread[id=11196, name=NIOServerCxn.Factory:0.0.0.0/0.0.0.0:0, state=RUNNABLE, group=TGRP-TestAuthenticationFramework]
    [junit4] > at sun.nio.ch.WindowsSelectorImpl$SubSelector.poll0(Native Method)
    [junit4] > at sun.nio.ch.WindowsSelectorImpl$SubSelector.poll(WindowsSelectorImpl.java:296)
    [junit4] > at sun.nio.ch.WindowsSelectorImpl$SubSelector.access$400(WindowsSelectorImpl.java:278)
    [junit4] > at sun.nio.ch.WindowsSelectorImpl.doSelect(WindowsSelectorImpl.java:159)
    [junit4] > at sun.nio.ch.SelectorImpl.lockAndDoSelect(SelectorImpl.java:86)
    [junit4] > at sun.nio.ch.SelectorImpl.select(SelectorImpl.java:97)
    [junit4] > at org.apache.zookeeper.server.NIOServerCnxnFactory.run(NIOServerCnxnFactory.java:178)
    [junit4] > at java.lang.Thread.run(Thread.java:745)
    [junit4] > 3) Thread[id=11189, name=NIOServerCxn.Factory:0.0.0.0/0.0.0.0:0, state=RUNNABLE, group=TGRP-TestAuthenticationFramework]
    [junit4] > at sun.nio.ch.WindowsSelectorImpl$SubSelector.poll0(Native Method)
    [junit4] > at sun.nio.ch.WindowsSelectorImpl$SubSelector.poll(WindowsSelectorImpl.java:296)
    [junit4] > at sun.nio.ch.WindowsSelectorImpl$SubSelector.access$400(WindowsSelectorImpl.java:278)
    [junit4] > at sun.nio.ch.WindowsSelectorImpl.doSelect(WindowsSelectorImpl.java:159)
    [junit4] > at sun.nio.ch.SelectorImpl.lockAndDoSelect(SelectorImpl.java:86)
    [junit4] > at sun.nio.ch.SelectorImpl.select(SelectorImpl.java:97)
    [junit4] > at org.apache.zookeeper.server.NIOServerCnxnFactory.run(NIOServerCnxnFactory.java:178)
    [junit4] > at java.lang.Thread.run(Thread.java:745)
    [junit4] > 4) Thread[id=11182, name=NIOServerCxn.Factory:0.0.0.0/0.0.0.0:0, state=RUNNABLE, group=TGRP-TestAuthenticationFramework]
    [junit4] > at sun.nio.ch.WindowsSelectorImpl$SubSelector.poll0(Native Method)
    [junit4] > at sun.nio.ch.WindowsSelectorImpl$SubSelector.poll(WindowsSelectorImpl.java:296)
    [junit4] > at sun.nio.ch.WindowsSelectorImpl$SubSelector.access$400(WindowsSelectorImpl.java:278)
    [junit4] > at sun.nio.ch.WindowsSelectorImpl.doSelect(WindowsSelectorImpl.java:159)
    [junit4] > at sun.nio.ch.SelectorImpl.lockAndDoSelect(SelectorImpl.java:86)
    [junit4] > at sun.nio.ch.SelectorImpl.select(SelectorImpl.java:97)
    [junit4] > at org.apache.zookeeper.server.NIOServerCnxnFactory.run(NIOServerCnxnFactory.java:178)
    [junit4] > at java.lang.Thread.run(Thread.java:745)
    [junit4] > 5) Thread[id=11217, name=NIOServerCxn.Factory:0.0.0.0/0.0.0.0:0, state=RUNNABLE, group=TGRP-TestAuthenticationFramework]
    [junit4] > at java.lang.Object.notifyAll(Native Method)
    [junit4] > at sun.nio.ch.WindowsSelectorImpl$StartLock.startThreads(WindowsSelectorImpl.java:189)
    [junit4] > at sun.nio.ch.WindowsSelectorImpl$StartLock.access$300(WindowsSelectorImpl.java:181)
    [junit4] > at sun.nio.ch.WindowsSelectorImpl.doSelect(WindowsSelectorImpl.java:153)
    [junit4] > at sun.nio.ch.SelectorImpl.lockAndDoSelect(SelectorImpl.java:86)
    [junit4] > at sun.nio.ch.SelectorImpl.select(SelectorImpl.java:97)
    [junit4] > at org.apache.zookeeper.server.NIOServerCnxnFactory.run(NIOServerCnxnFactory.java:178)
    [junit4] > at java.lang.Thread.run(Thread.java:745)
    [junit4] > 6) Thread[id=11210, name=NIOServerCxn.Factory:0.0.0.0/0.0.0.0:0, state=RUNNABLE, group=TGRP-TestAuthenticationFramework]
    [junit4] > at sun.nio.ch.WindowsSelectorImpl$SubSelector.poll0(Native Method)
    [junit4] > at sun.nio.ch.WindowsSelectorImpl$SubSelector.poll(WindowsSelectorImpl.java:296)
    [junit4] > at sun.nio.ch.WindowsSelectorImpl$SubSelector.access$400(WindowsSelectorImpl.java:278)
    [junit4] > at sun.nio.ch.WindowsSelectorImpl.doSelect(WindowsSelectorImpl.java:159)
    [junit4] > at sun.nio.ch.SelectorImpl.lockAndDoSelect(SelectorImpl.java:86)
    [junit4] > at sun.nio.ch.SelectorImpl.select(SelectorImpl.java:97)
    [junit4] > at org.apache.zookeeper.server.NIOServerCnxnFactory.run(NIOServerCnxnFactory.java:178)
    [junit4] > at java.lang.Thread.run(Thread.java:745)
    [junit4] > 7) Thread[id=11175, name=NIOServerCxn.Factory:0.0.0.0/0.0.0.0:0, state=RUNNABLE, group=TGRP-TestAuthenticationFramework]
    [junit4] > at sun.nio.ch.WindowsSelectorImpl$SubSelector.poll0(Native Method)
    [junit4] > at sun.nio.ch.WindowsSelectorImpl$SubSelector.poll(WindowsSelectorImpl.java:296)
    [junit4] > at sun.nio.ch.WindowsSelectorImpl$SubSelector.access$400(WindowsSelectorImpl.java:278)
    [junit4] > at sun.nio.ch.WindowsSelectorImpl.doSelect(WindowsSelectorImpl.java:159)
    [junit4] > at sun.nio.ch.SelectorImpl.lockAndDoSelect(SelectorImpl.java:86)
    [junit4] > at sun.nio.ch.SelectorImpl.select(SelectorImpl.java:97)
    [junit4] > at org.apache.zookeeper.server.NIOServerCnxnFactory.run(NIOServerCnxnFactory.java:178)
    [junit4] > at java.lang.Thread.run(Thread.java:745)
    [junit4] > at __randomizedtesting.SeedInfo.seed([F816F89A14095103]:0)
    [junit4] Completed [581/614 (3!)] on J1 in 344.48s, 8 tests, 9 errors <<< FAILURES!

[...truncated 118 lines...]
BUILD FAILED
C:\Users\jenkins\workspace\Lucene-Solr-master-Windows\build.xml:740: The following error occurred while executing this line:
C:\Users\jenkins\workspace\Lucene-Solr-master-Windows\build.xml:684: The following error occurred while executing this line:
C:\Users\jenkins\workspace\Lucene-Solr-master-Windows\build.xml:59: The following error occurred while executing this line:
C:\Users\jenkins\workspace\Lucene-Solr-master-Windows\solr\build.xml:233: The following error occurred while executing this line:
C:\Users\jenkins\workspace\Lucene-Solr-master-Windows\solr\common-build.xml:531: The following error occurred while executing this line:
C:\Users\jenkins\workspace\Lucene-Solr-master-Windows\lucene\common-build.xml:1427: The following error occurred while executing this line:
C:\Users\jenkins\workspace\Lucene-Solr-master-Windows\lucene\common-build.xml:984: There were test failures: 614 suites (10 ignored), 2584 tests, 4 suite-level errors, 10 errors, 1652 ignored (61 assumptions) [seed: F816F89A14095103]

Total time: 60 minutes 6 seconds
Build step 'Invoke Ant' marked build as failure
Archiving artifacts
[WARNINGS] Skipping publisher since build result is FAILURE
Recording test results
Email was triggered for: Failure - Any
Sending email for trigger: Failure - Any

Search Discussions

Related Discussions

Discussion Navigation
viewthread | post
posts ‹ prev | 1 of 1 | next ›
Discussion Overview
groupdev @
categorieslucene
postedJun 16, '16 at 2:11p
activeJun 16, '16 at 2:11p
posts1
users1
websitelucene.apache.org

1 user in discussion

Policeman Jenkins Server: 1 post

People

Translate

site design / logo © 2017 Grokbase