Grokbase Groups Lucene dev June 2016
FAQ
Build: http://jenkins.thetaphi.de/job/Lucene-Solr-6.1-Windows/14/
Java: 32bit/jdk1.8.0_92 -server -XX:+UseSerialGC

1 tests failed.
FAILED: junit.framework.TestSuite.org.apache.solr.schema.TestManagedSchemaAPI

Error Message:
ObjectTracker found 2 object(s) that were not released!!! [MockDirectoryWrapper, MockDirectoryWrapper]

Stack Trace:
java.lang.AssertionError: ObjectTracker found 2 object(s) that were not released!!! [MockDirectoryWrapper, MockDirectoryWrapper]
  at __randomizedtesting.SeedInfo.seed([D9B7FAB906BB7F1A]:0)
  at org.junit.Assert.fail(Assert.java:93)
  at org.junit.Assert.assertTrue(Assert.java:43)
  at org.junit.Assert.assertNull(Assert.java:551)
  at org.apache.solr.SolrTestCaseJ4.teardownTestCases(SolrTestCaseJ4.java:257)
  at sun.reflect.GeneratedMethodAccessor17.invoke(Unknown Source)
  at sun.reflect.DelegatingMethodAccessorImpl.invoke(DelegatingMethodAccessorImpl.java:43)
  at java.lang.reflect.Method.invoke(Method.java:498)
  at com.carrotsearch.randomizedtesting.RandomizedRunner.invoke(RandomizedRunner.java:1764)
  at com.carrotsearch.randomizedtesting.RandomizedRunner$7.evaluate(RandomizedRunner.java:834)
  at com.carrotsearch.randomizedtesting.rules.StatementAdapter.evaluate(StatementAdapter.java:36)
  at com.carrotsearch.randomizedtesting.rules.SystemPropertiesRestoreRule$1.evaluate(SystemPropertiesRestoreRule.java:57)
  at org.apache.lucene.util.AbstractBeforeAfterRule$1.evaluate(AbstractBeforeAfterRule.java:45)
  at com.carrotsearch.randomizedtesting.rules.StatementAdapter.evaluate(StatementAdapter.java:36)
  at org.apache.lucene.util.TestRuleStoreClassName$1.evaluate(TestRuleStoreClassName.java:41)
  at com.carrotsearch.randomizedtesting.rules.NoShadowingOrOverridesOnMethodsRule$1.evaluate(NoShadowingOrOverridesOnMethodsRule.java:40)
  at com.carrotsearch.randomizedtesting.rules.NoShadowingOrOverridesOnMethodsRule$1.evaluate(NoShadowingOrOverridesOnMethodsRule.java:40)
  at com.carrotsearch.randomizedtesting.rules.StatementAdapter.evaluate(StatementAdapter.java:36)
  at com.carrotsearch.randomizedtesting.rules.StatementAdapter.evaluate(StatementAdapter.java:36)
  at com.carrotsearch.randomizedtesting.rules.StatementAdapter.evaluate(StatementAdapter.java:36)
  at org.apache.lucene.util.TestRuleAssertionsRequired$1.evaluate(TestRuleAssertionsRequired.java:53)
  at org.apache.lucene.util.TestRuleMarkFailure$1.evaluate(TestRuleMarkFailure.java:47)
  at org.apache.lucene.util.TestRuleIgnoreAfterMaxFailures$1.evaluate(TestRuleIgnoreAfterMaxFailures.java:64)
  at org.apache.lucene.util.TestRuleIgnoreTestSuites$1.evaluate(TestRuleIgnoreTestSuites.java:54)
  at com.carrotsearch.randomizedtesting.rules.StatementAdapter.evaluate(StatementAdapter.java:36)
  at com.carrotsearch.randomizedtesting.ThreadLeakControl$StatementRunner.run(ThreadLeakControl.java:367)
  at java.lang.Thread.run(Thread.java:745)




Build Log:
[...truncated 12344 lines...]
    [junit4] Suite: org.apache.solr.schema.TestManagedSchemaAPI
    [junit4] 2> Creating dataDir: C:\Users\jenkins\workspace\Lucene-Solr-6.1-Windows\solr\build\solr-core\test\J0\temp\solr.schema.TestManagedSchemaAPI_D9B7FAB906BB7F1A-001\init-core-data-001
    [junit4] 2> 2855783 INFO (SUITE-TestManagedSchemaAPI-seed#[D9B7FAB906BB7F1A]-worker) [ ] o.a.s.SolrTestCaseJ4 Randomized ssl (false) and clientAuth (true) via: @org.apache.solr.util.RandomizeSSL(reason=, value=NaN, ssl=NaN, clientAuth=NaN)
    [junit4] 2> 2855785 INFO (SUITE-TestManagedSchemaAPI-seed#[D9B7FAB906BB7F1A]-worker) [ ] o.a.s.c.ZkTestServer STARTING ZK TEST SERVER
    [junit4] 2> 2855786 INFO (Thread-6680) [ ] o.a.s.c.ZkTestServer client port:0.0.0.0/0.0.0.0:0
    [junit4] 2> 2855786 INFO (Thread-6680) [ ] o.a.s.c.ZkTestServer Starting server
    [junit4] 2> 2855887 INFO (SUITE-TestManagedSchemaAPI-seed#[D9B7FAB906BB7F1A]-worker) [ ] o.a.s.c.ZkTestServer start zk server on port:60662
    [junit4] 2> 2855887 INFO (SUITE-TestManagedSchemaAPI-seed#[D9B7FAB906BB7F1A]-worker) [ ] o.a.s.c.c.SolrZkClient Using default ZkCredentialsProvider
    [junit4] 2> 2855887 INFO (SUITE-TestManagedSchemaAPI-seed#[D9B7FAB906BB7F1A]-worker) [ ] o.a.s.c.c.ConnectionManager Waiting for client to connect to ZooKeeper
    [junit4] 2> 2855892 INFO (zkCallback-9321-thread-1) [ ] o.a.s.c.c.ConnectionManager Watcher org.apache.solr.common.cloud.ConnectionManager@bba904 name:ZooKeeperConnection Watcher:127.0.0.1:60662 got event WatchedEvent state:SyncConnected type:None path:null path:null type:None
    [junit4] 2> 2855892 INFO (SUITE-TestManagedSchemaAPI-seed#[D9B7FAB906BB7F1A]-worker) [ ] o.a.s.c.c.ConnectionManager Client is connected to ZooKeeper
    [junit4] 2> 2855892 INFO (SUITE-TestManagedSchemaAPI-seed#[D9B7FAB906BB7F1A]-worker) [ ] o.a.s.c.c.SolrZkClient Using default ZkACLProvider
    [junit4] 2> 2855892 INFO (SUITE-TestManagedSchemaAPI-seed#[D9B7FAB906BB7F1A]-worker) [ ] o.a.s.c.c.SolrZkClient makePath: /solr/solr.xml
    [junit4] 2> 2855898 INFO (jetty-launcher-9320-thread-2) [ ] o.e.j.s.Server jetty-9.3.8.v20160314
    [junit4] 2> 2855899 INFO (jetty-launcher-9320-thread-2) [ ] o.e.j.s.h.ContextHandler Started o.e.j.s.ServletContextHandler@441703{/solr,null,AVAILABLE}
    [junit4] 2> 2855900 INFO (jetty-launcher-9320-thread-1) [ ] o.e.j.s.Server jetty-9.3.8.v20160314
    [junit4] 2> 2855900 INFO (jetty-launcher-9320-thread-2) [ ] o.e.j.s.ServerConnector Started ServerConnector@14c057d{HTTP/1.1,[http/1.1]}{127.0.0.1:60666}
    [junit4] 2> 2855900 INFO (jetty-launcher-9320-thread-2) [ ] o.e.j.s.Server Started @2860321ms
    [junit4] 2> 2855900 INFO (jetty-launcher-9320-thread-2) [ ] o.a.s.c.s.e.JettySolrRunner Jetty properties: {hostContext=/solr, hostPort=60666}
    [junit4] 2> 2855900 INFO (jetty-launcher-9320-thread-2) [ ] o.a.s.s.SolrDispatchFilter SolrDispatchFilter.init(): sun.misc.Launcher$AppClassLoader@1d16e93
    [junit4] 2> 2855900 INFO (jetty-launcher-9320-thread-2) [ ] o.a.s.c.SolrResourceLoader new SolrResourceLoader for directory: 'C:\Users\jenkins\workspace\Lucene-Solr-6.1-Windows\solr\build\solr-core\test\J0\temp\solr.schema.TestManagedSchemaAPI_D9B7FAB906BB7F1A-001\tempDir-001\node2'
    [junit4] 2> 2855902 INFO (jetty-launcher-9320-thread-2) [ ] o.a.s.c.SolrResourceLoader JNDI not configured for solr (NoInitialContextEx)
    [junit4] 2> 2855902 INFO (jetty-launcher-9320-thread-2) [ ] o.a.s.c.SolrResourceLoader solr home defaulted to 'solr/' (could not find system property or JNDI)
    [junit4] 2> 2855902 INFO (jetty-launcher-9320-thread-1) [ ] o.e.j.s.h.ContextHandler Started o.e.j.s.ServletContextHandler@18622b0{/solr,null,AVAILABLE}
    [junit4] 2> 2855902 INFO (jetty-launcher-9320-thread-2) [ ] o.a.s.c.c.SolrZkClient Using default ZkCredentialsProvider
    [junit4] 2> 2855902 INFO (jetty-launcher-9320-thread-1) [ ] o.e.j.s.ServerConnector Started ServerConnector@1799bcd{HTTP/1.1,[http/1.1]}{127.0.0.1:60669}
    [junit4] 2> 2855902 INFO (jetty-launcher-9320-thread-1) [ ] o.e.j.s.Server Started @2860323ms
    [junit4] 2> 2855902 INFO (jetty-launcher-9320-thread-1) [ ] o.a.s.c.s.e.JettySolrRunner Jetty properties: {hostContext=/solr, hostPort=60669}
    [junit4] 2> 2855902 INFO (jetty-launcher-9320-thread-1) [ ] o.a.s.s.SolrDispatchFilter SolrDispatchFilter.init(): sun.misc.Launcher$AppClassLoader@1d16e93
    [junit4] 2> 2855902 INFO (jetty-launcher-9320-thread-1) [ ] o.a.s.c.SolrResourceLoader new SolrResourceLoader for directory: 'C:\Users\jenkins\workspace\Lucene-Solr-6.1-Windows\solr\build\solr-core\test\J0\temp\solr.schema.TestManagedSchemaAPI_D9B7FAB906BB7F1A-001\tempDir-001\node1'
    [junit4] 2> 2855902 INFO (jetty-launcher-9320-thread-1) [ ] o.a.s.c.SolrResourceLoader JNDI not configured for solr (NoInitialContextEx)
    [junit4] 2> 2855902 INFO (jetty-launcher-9320-thread-1) [ ] o.a.s.c.SolrResourceLoader solr home defaulted to 'solr/' (could not find system property or JNDI)
    [junit4] 2> 2855903 INFO (jetty-launcher-9320-thread-2) [ ] o.a.s.c.c.ConnectionManager Waiting for client to connect to ZooKeeper
    [junit4] 2> 2855903 INFO (jetty-launcher-9320-thread-1) [ ] o.a.s.c.c.SolrZkClient Using default ZkCredentialsProvider
    [junit4] 2> 2855903 INFO (jetty-launcher-9320-thread-1) [ ] o.a.s.c.c.ConnectionManager Waiting for client to connect to ZooKeeper
    [junit4] 2> 2855912 INFO (zkCallback-9323-thread-1) [ ] o.a.s.c.c.ConnectionManager Watcher org.apache.solr.common.cloud.ConnectionManager@c07864 name:ZooKeeperConnection Watcher:127.0.0.1:60662/solr got event WatchedEvent state:SyncConnected type:None path:null path:null type:None
    [junit4] 2> 2855912 INFO (zkCallback-9322-thread-1) [ ] o.a.s.c.c.ConnectionManager Watcher org.apache.solr.common.cloud.ConnectionManager@40d247 name:ZooKeeperConnection Watcher:127.0.0.1:60662/solr got event WatchedEvent state:SyncConnected type:None path:null path:null type:None
    [junit4] 2> 2855912 INFO (jetty-launcher-9320-thread-1) [ ] o.a.s.c.c.ConnectionManager Client is connected to ZooKeeper
    [junit4] 2> 2855913 INFO (jetty-launcher-9320-thread-2) [ ] o.a.s.c.c.ConnectionManager Client is connected to ZooKeeper
    [junit4] 2> 2855913 INFO (jetty-launcher-9320-thread-2) [ ] o.a.s.c.c.SolrZkClient Using default ZkACLProvider
    [junit4] 2> 2855913 INFO (jetty-launcher-9320-thread-1) [ ] o.a.s.c.c.SolrZkClient Using default ZkACLProvider
    [junit4] 2> 2855914 INFO (jetty-launcher-9320-thread-1) [ ] o.a.s.s.SolrDispatchFilter solr.xml found in ZooKeeper. Loading...
    [junit4] 2> 2855914 INFO (jetty-launcher-9320-thread-2) [ ] o.a.s.s.SolrDispatchFilter solr.xml found in ZooKeeper. Loading...
    [junit4] 2> 2855918 INFO (jetty-launcher-9320-thread-2) [ ] o.a.s.c.CorePropertiesLocator Config-defined core root directory: C:\Users\jenkins\workspace\Lucene-Solr-6.1-Windows\solr\build\solr-core\test\J0\temp\solr.schema.TestManagedSchemaAPI_D9B7FAB906BB7F1A-001\tempDir-001\node2\.
    [junit4] 2> 2855918 INFO (jetty-launcher-9320-thread-2) [ ] o.a.s.c.CoreContainer New CoreContainer 21987262
    [junit4] 2> 2855918 INFO (jetty-launcher-9320-thread-2) [ ] o.a.s.c.CoreContainer Loading cores into CoreContainer [instanceDir=C:\Users\jenkins\workspace\Lucene-Solr-6.1-Windows\solr\build\solr-core\test\J0\temp\solr.schema.TestManagedSchemaAPI_D9B7FAB906BB7F1A-001\tempDir-001\node2]
    [junit4] 2> 2855918 WARN (jetty-launcher-9320-thread-2) [ ] o.a.s.c.CoreContainer Couldn't add files from C:\Users\jenkins\workspace\Lucene-Solr-6.1-Windows\solr\build\solr-core\test\J0\temp\solr.schema.TestManagedSchemaAPI_D9B7FAB906BB7F1A-001\tempDir-001\node2\lib to classpath: C:\Users\jenkins\workspace\Lucene-Solr-6.1-Windows\solr\build\solr-core\test\J0\temp\solr.schema.TestManagedSchemaAPI_D9B7FAB906BB7F1A-001\tempDir-001\node2\lib
    [junit4] 2> 2855920 WARN (NIOServerCxn.Factory:0.0.0.0/0.0.0.0:0) [ ] o.a.z.s.NIOServerCnxn caught end of stream exception
    [junit4] 2> EndOfStreamException: Unable to read additional data from client sessionid 0x155572848c90001, likely client has closed socket
    [junit4] 2> at org.apache.zookeeper.server.NIOServerCnxn.doIO(NIOServerCnxn.java:228)
    [junit4] 2> at org.apache.zookeeper.server.NIOServerCnxnFactory.run(NIOServerCnxnFactory.java:208)
    [junit4] 2> at java.lang.Thread.run(Thread.java:745)
    [junit4] 2> 2855920 INFO (jetty-launcher-9320-thread-2) [ ] o.a.s.h.c.HttpShardHandlerFactory created with socketTimeout : 90000,urlScheme : ,connTimeout : 15000,maxConnectionsPerHost : 20,maxConnections : 10000,corePoolSize : 0,maximumPoolSize : 2147483647,maxThreadIdleTime : 5,sizeOfQueue : -1,fairnessPolicy : false,useRetries : false,
    [junit4] 2> 2855920 INFO (jetty-launcher-9320-thread-1) [ ] o.a.s.c.CorePropertiesLocator Config-defined core root directory: C:\Users\jenkins\workspace\Lucene-Solr-6.1-Windows\solr\build\solr-core\test\J0\temp\solr.schema.TestManagedSchemaAPI_D9B7FAB906BB7F1A-001\tempDir-001\node1\.
    [junit4] 2> 2855920 INFO (jetty-launcher-9320-thread-1) [ ] o.a.s.c.CoreContainer New CoreContainer 16200424
    [junit4] 2> 2855920 INFO (jetty-launcher-9320-thread-1) [ ] o.a.s.c.CoreContainer Loading cores into CoreContainer [instanceDir=C:\Users\jenkins\workspace\Lucene-Solr-6.1-Windows\solr\build\solr-core\test\J0\temp\solr.schema.TestManagedSchemaAPI_D9B7FAB906BB7F1A-001\tempDir-001\node1]
    [junit4] 2> 2855920 WARN (jetty-launcher-9320-thread-1) [ ] o.a.s.c.CoreContainer Couldn't add files from C:\Users\jenkins\workspace\Lucene-Solr-6.1-Windows\solr\build\solr-core\test\J0\temp\solr.schema.TestManagedSchemaAPI_D9B7FAB906BB7F1A-001\tempDir-001\node1\lib to classpath: C:\Users\jenkins\workspace\Lucene-Solr-6.1-Windows\solr\build\solr-core\test\J0\temp\solr.schema.TestManagedSchemaAPI_D9B7FAB906BB7F1A-001\tempDir-001\node1\lib
    [junit4] 2> 2855920 INFO (jetty-launcher-9320-thread-1) [ ] o.a.s.h.c.HttpShardHandlerFactory created with socketTimeout : 90000,urlScheme : ,connTimeout : 15000,maxConnectionsPerHost : 20,maxConnections : 10000,corePoolSize : 0,maximumPoolSize : 2147483647,maxThreadIdleTime : 5,sizeOfQueue : -1,fairnessPolicy : false,useRetries : false,
    [junit4] 2> 2855920 INFO (jetty-launcher-9320-thread-2) [ ] o.a.s.u.UpdateShardHandler Creating UpdateShardHandler HTTP client with params: socketTimeout=340000&connTimeout=45000&retry=true
    [junit4] 2> 2855921 INFO (jetty-launcher-9320-thread-2) [ ] o.a.s.l.LogWatcher SLF4J impl is org.slf4j.impl.Log4jLoggerFactory
    [junit4] 2> 2855921 INFO (jetty-launcher-9320-thread-2) [ ] o.a.s.l.LogWatcher Registering Log Listener [Log4j (org.slf4j.impl.Log4jLoggerFactory)]
    [junit4] 2> 2855921 INFO (jetty-launcher-9320-thread-1) [ ] o.a.s.u.UpdateShardHandler Creating UpdateShardHandler HTTP client with params: socketTimeout=340000&connTimeout=45000&retry=true
    [junit4] 2> 2855921 INFO (jetty-launcher-9320-thread-2) [ ] o.a.s.c.ZkContainer Zookeeper client=127.0.0.1:60662/solr
    [junit4] 2> 2855921 INFO (jetty-launcher-9320-thread-2) [ ] o.a.s.c.ZkController zkHost includes chroot
    [junit4] 2> 2855921 INFO (jetty-launcher-9320-thread-2) [ ] o.a.s.c.c.SolrZkClient Using default ZkCredentialsProvider
    [junit4] 2> 2855921 INFO (jetty-launcher-9320-thread-1) [ ] o.a.s.l.LogWatcher SLF4J impl is org.slf4j.impl.Log4jLoggerFactory
    [junit4] 2> 2855921 INFO (jetty-launcher-9320-thread-1) [ ] o.a.s.l.LogWatcher Registering Log Listener [Log4j (org.slf4j.impl.Log4jLoggerFactory)]
    [junit4] 2> 2855922 INFO (jetty-launcher-9320-thread-1) [ ] o.a.s.c.ZkContainer Zookeeper client=127.0.0.1:60662/solr
    [junit4] 2> 2855922 INFO (jetty-launcher-9320-thread-1) [ ] o.a.s.c.ZkController zkHost includes chroot
    [junit4] 2> 2855922 INFO (jetty-launcher-9320-thread-1) [ ] o.a.s.c.c.SolrZkClient Using default ZkCredentialsProvider
    [junit4] 2> 2855922 INFO (jetty-launcher-9320-thread-2) [ ] o.a.s.c.c.ConnectionManager Waiting for client to connect to ZooKeeper
    [junit4] 2> 2855922 INFO (jetty-launcher-9320-thread-1) [ ] o.a.s.c.c.ConnectionManager Waiting for client to connect to ZooKeeper
    [junit4] 2> 2855925 INFO (zkCallback-9328-thread-1) [ ] o.a.s.c.c.ConnectionManager Watcher org.apache.solr.common.cloud.ConnectionManager@5d48b9 name:ZooKeeperConnection Watcher:127.0.0.1:60662 got event WatchedEvent state:SyncConnected type:None path:null path:null type:None
    [junit4] 2> 2855925 INFO (zkCallback-9329-thread-1) [ ] o.a.s.c.c.ConnectionManager Watcher org.apache.solr.common.cloud.ConnectionManager@dfbcf2 name:ZooKeeperConnection Watcher:127.0.0.1:60662 got event WatchedEvent state:SyncConnected type:None path:null path:null type:None
    [junit4] 2> 2855925 INFO (jetty-launcher-9320-thread-2) [ ] o.a.s.c.c.ConnectionManager Client is connected to ZooKeeper
    [junit4] 2> 2855925 INFO (jetty-launcher-9320-thread-1) [ ] o.a.s.c.c.ConnectionManager Client is connected to ZooKeeper
    [junit4] 2> 2855925 INFO (jetty-launcher-9320-thread-1) [ ] o.a.s.c.c.SolrZkClient Using default ZkACLProvider
    [junit4] 2> 2855925 INFO (jetty-launcher-9320-thread-2) [ ] o.a.s.c.c.SolrZkClient Using default ZkACLProvider
    [junit4] 2> 2855926 INFO (jetty-launcher-9320-thread-1) [n:127.0.0.1:60669_solr ] o.a.s.c.ZkController Added new OnReconnect listener org.apache.solr.cloud.ZkController$$Lambda$79/16718732@1b7538
    [junit4] 2> 2855929 INFO (jetty-launcher-9320-thread-2) [n:127.0.0.1:60666_solr ] o.a.s.c.ZkController Added new OnReconnect listener org.apache.solr.cloud.ZkController$$Lambda$79/16718732@728694
    [junit4] 2> 2855930 INFO (jetty-launcher-9320-thread-1) [n:127.0.0.1:60669_solr ] o.a.s.c.c.ConnectionManager Waiting for client to connect to ZooKeeper
    [junit4] 2> 2855930 INFO (jetty-launcher-9320-thread-2) [n:127.0.0.1:60666_solr ] o.a.s.c.c.ConnectionManager Waiting for client to connect to ZooKeeper
    [junit4] 2> 2855931 INFO (zkCallback-9330-thread-1-processing-n:127.0.0.1:60669_solr) [n:127.0.0.1:60669_solr ] o.a.s.c.c.ConnectionManager Watcher org.apache.solr.common.cloud.ConnectionManager@170757d name:ZooKeeperConnection Watcher:127.0.0.1:60662/solr got event WatchedEvent state:SyncConnected type:None path:null path:null type:None
    [junit4] 2> 2855931 INFO (zkCallback-9331-thread-1-processing-n:127.0.0.1:60666_solr) [n:127.0.0.1:60666_solr ] o.a.s.c.c.ConnectionManager Watcher org.apache.solr.common.cloud.ConnectionManager@5d94b5 name:ZooKeeperConnection Watcher:127.0.0.1:60662/solr got event WatchedEvent state:SyncConnected type:None path:null path:null type:None
    [junit4] 2> 2855932 INFO (jetty-launcher-9320-thread-1) [n:127.0.0.1:60669_solr ] o.a.s.c.c.ConnectionManager Client is connected to ZooKeeper
    [junit4] 2> 2855932 INFO (jetty-launcher-9320-thread-2) [n:127.0.0.1:60666_solr ] o.a.s.c.c.ConnectionManager Client is connected to ZooKeeper
    [junit4] 2> 2855934 INFO (jetty-launcher-9320-thread-2) [n:127.0.0.1:60666_solr ] o.a.s.c.c.SolrZkClient makePath: /overseer/queue
    [junit4] 2> 2855934 INFO (jetty-launcher-9320-thread-1) [n:127.0.0.1:60669_solr ] o.a.s.c.c.SolrZkClient makePath: /overseer/queue
    [junit4] 2> 2855936 INFO (jetty-launcher-9320-thread-1) [n:127.0.0.1:60669_solr ] o.a.s.c.c.SolrZkClient makePath: /overseer/collection-queue-work
    [junit4] 2> 2855936 INFO (jetty-launcher-9320-thread-2) [n:127.0.0.1:60666_solr ] o.a.s.c.c.SolrZkClient makePath: /overseer/collection-queue-work
    [junit4] 2> 2855940 INFO (jetty-launcher-9320-thread-1) [n:127.0.0.1:60669_solr ] o.a.s.c.c.SolrZkClient makePath: /overseer/collection-map-running
    [junit4] 2> 2855942 INFO (jetty-launcher-9320-thread-1) [n:127.0.0.1:60669_solr ] o.a.s.c.c.SolrZkClient makePath: /overseer/collection-map-completed
    [junit4] 2> 2855942 INFO (jetty-launcher-9320-thread-2) [n:127.0.0.1:60666_solr ] o.a.s.c.c.SolrZkClient makePath: /overseer/collection-map-completed
    [junit4] 2> 2855945 INFO (jetty-launcher-9320-thread-1) [n:127.0.0.1:60669_solr ] o.a.s.c.c.SolrZkClient makePath: /overseer/collection-map-failure
    [junit4] 2> 2855945 INFO (jetty-launcher-9320-thread-2) [n:127.0.0.1:60666_solr ] o.a.s.c.c.SolrZkClient makePath: /overseer/collection-map-failure
    [junit4] 2> 2855947 INFO (jetty-launcher-9320-thread-2) [n:127.0.0.1:60666_solr ] o.a.s.c.c.SolrZkClient makePath: /live_nodes
    [junit4] 2> 2855947 INFO (jetty-launcher-9320-thread-1) [n:127.0.0.1:60669_solr ] o.a.s.c.c.SolrZkClient makePath: /live_nodes
    [junit4] 2> 2855948 INFO (jetty-launcher-9320-thread-2) [n:127.0.0.1:60666_solr ] o.a.s.c.c.SolrZkClient makePath: /collections
    [junit4] 2> 2855948 INFO (jetty-launcher-9320-thread-1) [n:127.0.0.1:60669_solr ] o.a.s.c.c.SolrZkClient makePath: /collections
    [junit4] 2> 2855949 INFO (jetty-launcher-9320-thread-2) [n:127.0.0.1:60666_solr ] o.a.s.c.c.SolrZkClient makePath: /aliases.json
    [junit4] 2> 2855949 INFO (jetty-launcher-9320-thread-1) [n:127.0.0.1:60669_solr ] o.a.s.c.c.SolrZkClient makePath: /aliases.json
    [junit4] 2> 2855951 INFO (jetty-launcher-9320-thread-1) [n:127.0.0.1:60669_solr ] o.a.s.c.c.SolrZkClient makePath: /clusterstate.json
    [junit4] 2> 2855951 INFO (jetty-launcher-9320-thread-2) [n:127.0.0.1:60666_solr ] o.a.s.c.c.SolrZkClient makePath: /clusterstate.json
    [junit4] 2> 2855952 INFO (jetty-launcher-9320-thread-1) [n:127.0.0.1:60669_solr ] o.a.s.c.c.SolrZkClient makePath: /security.json
    [junit4] 2> 2855952 INFO (jetty-launcher-9320-thread-2) [n:127.0.0.1:60666_solr ] o.a.s.c.c.SolrZkClient makePath: /security.json
    [junit4] 2> 2855953 INFO (jetty-launcher-9320-thread-2) [n:127.0.0.1:60666_solr ] o.a.s.c.c.ZkStateReader Updating cluster state from ZooKeeper...
    [junit4] 2> 2855953 INFO (jetty-launcher-9320-thread-1) [n:127.0.0.1:60669_solr ] o.a.s.c.c.ZkStateReader Updating cluster state from ZooKeeper...
    [junit4] 2> 2855953 INFO (jetty-launcher-9320-thread-2) [n:127.0.0.1:60666_solr ] o.a.s.c.c.ZkStateReader Loaded empty cluster properties
    [junit4] 2> 2855953 INFO (jetty-launcher-9320-thread-1) [n:127.0.0.1:60669_solr ] o.a.s.c.c.ZkStateReader Loaded empty cluster properties
    [junit4] 2> 2855953 INFO (jetty-launcher-9320-thread-2) [n:127.0.0.1:60666_solr ] o.a.s.c.c.ZkStateReader Updated live nodes from ZooKeeper... (0) -> (0)
    [junit4] 2> 2855953 INFO (jetty-launcher-9320-thread-1) [n:127.0.0.1:60669_solr ] o.a.s.c.c.ZkStateReader Updated live nodes from ZooKeeper... (0) -> (0)
    [junit4] 2> 2855956 INFO (jetty-launcher-9320-thread-2) [n:127.0.0.1:60666_solr ] o.a.s.c.c.SolrZkClient makePath: /overseer_elect
    [junit4] 2> 2855957 INFO (jetty-launcher-9320-thread-1) [n:127.0.0.1:60669_solr ] o.a.s.c.c.SolrZkClient makePath: /overseer_elect
    [junit4] 2> 2855957 INFO (jetty-launcher-9320-thread-2) [n:127.0.0.1:60666_solr ] o.a.s.c.c.SolrZkClient makePath: /overseer_elect/election
    [junit4] 2> 2855958 INFO (jetty-launcher-9320-thread-1) [n:127.0.0.1:60669_solr ] o.a.s.c.c.SolrZkClient makePath: /overseer_elect/election
    [junit4] 2> 2855959 INFO (jetty-launcher-9320-thread-2) [n:127.0.0.1:60666_solr ] o.a.s.c.Overseer Overseer (id=null) closing
    [junit4] 2> 2855959 INFO (jetty-launcher-9320-thread-1) [n:127.0.0.1:60669_solr ] o.a.s.c.Overseer Overseer (id=null) closing
    [junit4] 2> 2855959 INFO (jetty-launcher-9320-thread-2) [n:127.0.0.1:60666_solr ] o.a.s.c.LeaderElector Joined leadership election with path: /overseer_elect/election/96078797589774342-127.0.0.1:60666_solr-n_0000000000
    [junit4] 2> 2855960 INFO (jetty-launcher-9320-thread-1) [n:127.0.0.1:60669_solr ] o.a.s.c.LeaderElector Joined leadership election with path: /overseer_elect/election/96078797589774341-127.0.0.1:60669_solr-n_0000000001
    [junit4] 2> 2855960 INFO (jetty-launcher-9320-thread-2) [n:127.0.0.1:60666_solr ] o.a.s.c.OverseerElectionContext I am going to be the leader 127.0.0.1:60666_solr
    [junit4] 2> 2855960 INFO (jetty-launcher-9320-thread-2) [n:127.0.0.1:60666_solr ] o.a.s.c.c.SolrZkClient makePath: /overseer_elect/leader
    [junit4] 2> 2855960 INFO (jetty-launcher-9320-thread-1) [n:127.0.0.1:60669_solr ] o.a.s.c.LeaderElector Watching path /overseer_elect/election/96078797589774342-127.0.0.1:60666_solr-n_0000000000 to know if I could be the leader
    [junit4] 2> 2855961 INFO (jetty-launcher-9320-thread-1) [n:127.0.0.1:60669_solr ] o.a.s.c.ZkController Register node as live in ZooKeeper:/live_nodes/127.0.0.1:60669_solr
    [junit4] 2> 2855962 INFO (jetty-launcher-9320-thread-1) [n:127.0.0.1:60669_solr ] o.a.s.c.c.SolrZkClient makePath: /live_nodes/127.0.0.1:60669_solr
    [junit4] 2> 2855962 INFO (jetty-launcher-9320-thread-2) [n:127.0.0.1:60666_solr ] o.a.s.c.Overseer Overseer (id=96078797589774342-127.0.0.1:60666_solr-n_0000000000) starting
    [junit4] 2> 2855963 INFO (zkCallback-9331-thread-1-processing-n:127.0.0.1:60666_solr) [n:127.0.0.1:60666_solr ] o.a.s.c.c.ZkStateReader A live node change: [WatchedEvent state:SyncConnected type:NodeChildrenChanged path:/live_nodes], has occurred - updating... (live nodes size: [0])
    [junit4] 2> 2855963 INFO (zkCallback-9330-thread-1-processing-n:127.0.0.1:60669_solr) [n:127.0.0.1:60669_solr ] o.a.s.c.c.ZkStateReader A live node change: [WatchedEvent state:SyncConnected type:NodeChildrenChanged path:/live_nodes], has occurred - updating... (live nodes size: [0])
    [junit4] 2> 2855966 INFO (zkCallback-9331-thread-1-processing-n:127.0.0.1:60666_solr) [n:127.0.0.1:60666_solr ] o.a.s.c.c.ZkStateReader Updated live nodes from ZooKeeper... (0) -> (1)
    [junit4] 2> 2855968 INFO (zkCallback-9330-thread-1-processing-n:127.0.0.1:60669_solr) [n:127.0.0.1:60669_solr ] o.a.s.c.c.ZkStateReader Updated live nodes from ZooKeeper... (0) -> (1)
    [junit4] 2> 2855968 INFO (jetty-launcher-9320-thread-2) [n:127.0.0.1:60666_solr ] o.a.s.c.c.SolrZkClient makePath: /overseer/queue-work
    [junit4] 2> 2855976 INFO (jetty-launcher-9320-thread-1) [n:127.0.0.1:60669_solr ] o.a.s.c.CoreContainer Security conf doesn't exist. Skipping setup for authorization module.
    [junit4] 2> 2855977 INFO (jetty-launcher-9320-thread-1) [n:127.0.0.1:60669_solr ] o.a.s.c.CoreContainer No authentication plugin used.
    [junit4] 2> 2855978 INFO (jetty-launcher-9320-thread-1) [n:127.0.0.1:60669_solr ] o.a.s.c.CorePropertiesLocator Looking for core definitions underneath C:\Users\jenkins\workspace\Lucene-Solr-6.1-Windows\solr\build\solr-core\test\J0\temp\solr.schema.TestManagedSchemaAPI_D9B7FAB906BB7F1A-001\tempDir-001\node1\.
    [junit4] 2> 2855978 INFO (jetty-launcher-9320-thread-1) [n:127.0.0.1:60669_solr ] o.a.s.c.CorePropertiesLocator Found 0 core definitions
    [junit4] 2> 2855978 INFO (jetty-launcher-9320-thread-1) [n:127.0.0.1:60669_solr ] o.a.s.s.SolrDispatchFilter user.dir=C:\Users\jenkins\workspace\Lucene-Solr-6.1-Windows\solr\build\solr-core\test\J0
    [junit4] 2> 2855978 INFO (jetty-launcher-9320-thread-1) [n:127.0.0.1:60669_solr ] o.a.s.s.SolrDispatchFilter SolrDispatchFilter.init() done
    [junit4] 2> 2855980 INFO (jetty-launcher-9320-thread-2) [n:127.0.0.1:60666_solr ] o.a.s.c.OverseerAutoReplicaFailoverThread Starting OverseerAutoReplicaFailoverThread autoReplicaFailoverWorkLoopDelay=10000 autoReplicaFailoverWaitAfterExpiration=30000 autoReplicaFailoverBadNodeExpiration=60000
    [junit4] 2> 2855981 INFO (OverseerCollectionConfigSetProcessor-96078797589774342-127.0.0.1:60666_solr-n_0000000000) [n:127.0.0.1:60666_solr ] o.a.s.c.OverseerTaskProcessor Process current queue of overseer operations
    [junit4] 2> 2855981 INFO (jetty-launcher-9320-thread-2) [n:127.0.0.1:60666_solr ] o.a.s.c.ZkController Publish node=127.0.0.1:60666_solr as DOWN
    [junit4] 2> 2855981 INFO (OverseerStateUpdate-96078797589774342-127.0.0.1:60666_solr-n_0000000000) [n:127.0.0.1:60666_solr ] o.a.s.c.Overseer Starting to work on the main queue
    [junit4] 2> 2855984 INFO (OverseerStateUpdate-96078797589774342-127.0.0.1:60666_solr-n_0000000000) [n:127.0.0.1:60666_solr ] o.a.s.c.c.ZkStateReader Updated live nodes from ZooKeeper... (1) -> (1)
    [junit4] 2> 2855985 INFO (OverseerStateUpdate-96078797589774342-127.0.0.1:60666_solr-n_0000000000) [n:127.0.0.1:60666_solr ] o.a.s.c.Overseer processMessage: queueSize: 1, message = {
    [junit4] 2> "operation":"downnode",
    [junit4] 2> "node_name":"127.0.0.1:60666_solr"} current state version: 0
    [junit4] 2> 2855985 INFO (OverseerStateUpdate-96078797589774342-127.0.0.1:60666_solr-n_0000000000) [n:127.0.0.1:60666_solr ] o.a.s.c.o.NodeMutator DownNode state invoked for node: 127.0.0.1:60666_solr
    [junit4] 2> 2856983 INFO (jetty-launcher-9320-thread-2) [n:127.0.0.1:60666_solr ] o.a.s.c.ZkController Register node as live in ZooKeeper:/live_nodes/127.0.0.1:60666_solr
    [junit4] 2> 2856983 INFO (jetty-launcher-9320-thread-2) [n:127.0.0.1:60666_solr ] o.a.s.c.c.SolrZkClient makePath: /live_nodes/127.0.0.1:60666_solr
    [junit4] 2> 2856985 INFO (zkCallback-9330-thread-1-processing-n:127.0.0.1:60669_solr) [n:127.0.0.1:60669_solr ] o.a.s.c.c.ZkStateReader A live node change: [WatchedEvent state:SyncConnected type:NodeChildrenChanged path:/live_nodes], has occurred - updating... (live nodes size: [1])
    [junit4] 2> 2856985 INFO (zkCallback-9331-thread-1-processing-n:127.0.0.1:60666_solr) [n:127.0.0.1:60666_solr ] o.a.s.c.c.ZkStateReader A live node change: [WatchedEvent state:SyncConnected type:NodeChildrenChanged path:/live_nodes], has occurred - updating... (live nodes size: [1])
    [junit4] 2> 2856985 INFO (zkCallback-9331-thread-1-processing-n:127.0.0.1:60666_solr) [n:127.0.0.1:60666_solr ] o.a.s.c.c.ZkStateReader Updated live nodes from ZooKeeper... (1) -> (2)
    [junit4] 2> 2856985 INFO (zkCallback-9330-thread-1-processing-n:127.0.0.1:60669_solr) [n:127.0.0.1:60669_solr ] o.a.s.c.c.ZkStateReader Updated live nodes from ZooKeeper... (1) -> (2)
    [junit4] 2> 2857011 INFO (jetty-launcher-9320-thread-2) [n:127.0.0.1:60666_solr ] o.a.s.c.CoreContainer Security conf doesn't exist. Skipping setup for authorization module.
    [junit4] 2> 2857011 INFO (jetty-launcher-9320-thread-2) [n:127.0.0.1:60666_solr ] o.a.s.c.CoreContainer No authentication plugin used.
    [junit4] 2> 2857013 INFO (jetty-launcher-9320-thread-2) [n:127.0.0.1:60666_solr ] o.a.s.c.CorePropertiesLocator Looking for core definitions underneath C:\Users\jenkins\workspace\Lucene-Solr-6.1-Windows\solr\build\solr-core\test\J0\temp\solr.schema.TestManagedSchemaAPI_D9B7FAB906BB7F1A-001\tempDir-001\node2\.
    [junit4] 2> 2857014 INFO (jetty-launcher-9320-thread-2) [n:127.0.0.1:60666_solr ] o.a.s.c.CorePropertiesLocator Found 0 core definitions
    [junit4] 2> 2857015 INFO (jetty-launcher-9320-thread-2) [n:127.0.0.1:60666_solr ] o.a.s.s.SolrDispatchFilter user.dir=C:\Users\jenkins\workspace\Lucene-Solr-6.1-Windows\solr\build\solr-core\test\J0
    [junit4] 2> 2857015 INFO (jetty-launcher-9320-thread-2) [n:127.0.0.1:60666_solr ] o.a.s.s.SolrDispatchFilter SolrDispatchFilter.init() done
    [junit4] 2> 2857015 INFO (SUITE-TestManagedSchemaAPI-seed#[D9B7FAB906BB7F1A]-worker) [ ] o.a.s.c.c.SolrZkClient Using default ZkCredentialsProvider
    [junit4] 2> 2857016 INFO (SUITE-TestManagedSchemaAPI-seed#[D9B7FAB906BB7F1A]-worker) [ ] o.a.s.c.c.ConnectionManager Waiting for client to connect to ZooKeeper
    [junit4] 2> 2857017 INFO (zkCallback-9334-thread-1) [ ] o.a.s.c.c.ConnectionManager Watcher org.apache.solr.common.cloud.ConnectionManager@c15a3c name:ZooKeeperConnection Watcher:127.0.0.1:60662 got event WatchedEvent state:SyncConnected type:None path:null path:null type:None
    [junit4] 2> 2857017 INFO (SUITE-TestManagedSchemaAPI-seed#[D9B7FAB906BB7F1A]-worker) [ ] o.a.s.c.c.ConnectionManager Client is connected to ZooKeeper
    [junit4] 2> 2857018 INFO (SUITE-TestManagedSchemaAPI-seed#[D9B7FAB906BB7F1A]-worker) [ ] o.a.s.c.c.SolrZkClient Using default ZkACLProvider
    [junit4] 2> 2857019 WARN (NIOServerCxn.Factory:0.0.0.0/0.0.0.0:0) [ ] o.a.z.s.NIOServerCnxn caught end of stream exception
    [junit4] 2> EndOfStreamException: Unable to read additional data from client sessionid 0x155572848c90007, likely client has closed socket
    [junit4] 2> at org.apache.zookeeper.server.NIOServerCnxn.doIO(NIOServerCnxn.java:228)
    [junit4] 2> at org.apache.zookeeper.server.NIOServerCnxnFactory.run(NIOServerCnxnFactory.java:208)
    [junit4] 2> at java.lang.Thread.run(Thread.java:745)
    [junit4] 2> 2857019 INFO (SUITE-TestManagedSchemaAPI-seed#[D9B7FAB906BB7F1A]-worker) [ ] o.a.s.c.s.i.CloudSolrClient Final constructed zkHost string: 127.0.0.1:60662/solr
    [junit4] 2> 2857020 INFO (SUITE-TestManagedSchemaAPI-seed#[D9B7FAB906BB7F1A]-worker) [ ] o.a.s.c.c.SolrZkClient Using default ZkCredentialsProvider
    [junit4] 2> 2857022 INFO (SUITE-TestManagedSchemaAPI-seed#[D9B7FAB906BB7F1A]-worker) [ ] o.a.s.c.c.ConnectionManager Waiting for client to connect to ZooKeeper
    [junit4] 2> 2857023 INFO (zkCallback-9337-thread-1) [ ] o.a.s.c.c.ConnectionManager Watcher org.apache.solr.common.cloud.ConnectionManager@eaa281 name:ZooKeeperConnection Watcher:127.0.0.1:60662/solr got event WatchedEvent state:SyncConnected type:None path:null path:null type:None
    [junit4] 2> 2857023 INFO (SUITE-TestManagedSchemaAPI-seed#[D9B7FAB906BB7F1A]-worker) [ ] o.a.s.c.c.ConnectionManager Client is connected to ZooKeeper
    [junit4] 2> 2857024 INFO (SUITE-TestManagedSchemaAPI-seed#[D9B7FAB906BB7F1A]-worker) [ ] o.a.s.c.c.SolrZkClient Using default ZkACLProvider
    [junit4] 2> 2857024 INFO (SUITE-TestManagedSchemaAPI-seed#[D9B7FAB906BB7F1A]-worker) [ ] o.a.s.c.c.ZkStateReader Updating cluster state from ZooKeeper...
    [junit4] 2> 2857025 INFO (SUITE-TestManagedSchemaAPI-seed#[D9B7FAB906BB7F1A]-worker) [ ] o.a.s.c.c.ZkStateReader Loaded empty cluster properties
    [junit4] 2> 2857026 INFO (SUITE-TestManagedSchemaAPI-seed#[D9B7FAB906BB7F1A]-worker) [ ] o.a.s.c.c.ZkStateReader Updated live nodes from ZooKeeper... (0) -> (2)
    [junit4] 2> 2857029 INFO (SUITE-TestManagedSchemaAPI-seed#[D9B7FAB906BB7F1A]-worker) [ ] o.a.s.c.c.SolrZkClient makePath: /configs/conf1/managed-schema
    [junit4] 2> 2857033 INFO (SUITE-TestManagedSchemaAPI-seed#[D9B7FAB906BB7F1A]-worker) [ ] o.a.s.c.c.SolrZkClient makePath: /configs/conf1/solrconfig.xml
    [junit4] 2> 2857051 INFO (TEST-TestManagedSchemaAPI.test-seed#[D9B7FAB906BB7F1A]) [ ] o.a.s.SolrTestCaseJ4 ###Starting test
    [junit4] 2> 2857056 INFO (qtp26062370-41576) [n:127.0.0.1:60669_solr ] o.a.s.h.a.CollectionsHandler Invoked Collection Action :create with params replicationFactor=2&collection.configName=conf1&name=testschemaapi&action=CREATE&numShards=1&wt=javabin&version=2 and sendToOCPQueue=true
    [junit4] 2> 2857059 INFO (OverseerCollectionConfigSetProcessor-96078797589774342-127.0.0.1:60666_solr-n_0000000000) [n:127.0.0.1:60666_solr ] o.a.s.c.OverseerTaskProcessor Overseer Collection Message Handler: Get the message id:/overseer/collection-queue-work/qn-0000000000 message:{
    [junit4] 2> "name":"testschemaapi",
    [junit4] 2> "fromApi":"true",
    [junit4] 2> "replicationFactor":"2",
    [junit4] 2> "collection.configName":"conf1",
    [junit4] 2> "numShards":"1",
    [junit4] 2> "stateFormat":"2",
    [junit4] 2> "operation":"create"}
    [junit4] 2> 2857059 INFO (OverseerThreadFactory-10284-thread-1-processing-n:127.0.0.1:60666_solr) [n:127.0.0.1:60666_solr ] o.a.s.c.OverseerCollectionMessageHandler OverseerCollectionMessageHandler.processMessage : create , {
    [junit4] 2> "name":"testschemaapi",
    [junit4] 2> "fromApi":"true",
    [junit4] 2> "replicationFactor":"2",
    [junit4] 2> "collection.configName":"conf1",
    [junit4] 2> "numShards":"1",
    [junit4] 2> "stateFormat":"2",
    [junit4] 2> "operation":"create"}
    [junit4] 2> 2857059 INFO (OverseerThreadFactory-10284-thread-1-processing-n:127.0.0.1:60666_solr) [n:127.0.0.1:60666_solr ] o.a.s.c.OverseerCollectionMessageHandler Create collection testschemaapi
    [junit4] 2> 2857060 INFO (OverseerThreadFactory-10284-thread-1-processing-n:127.0.0.1:60666_solr) [n:127.0.0.1:60666_solr ] o.a.s.c.OverseerCollectionMessageHandler creating collections conf node /collections/testschemaapi
    [junit4] 2> 2857060 INFO (OverseerThreadFactory-10284-thread-1-processing-n:127.0.0.1:60666_solr) [n:127.0.0.1:60666_solr ] o.a.s.c.c.SolrZkClient makePath: /collections/testschemaapi
    [junit4] 2> 2857062 INFO (zkCallback-9331-thread-1-processing-n:127.0.0.1:60666_solr) [n:127.0.0.1:60666_solr ] o.a.s.c.c.ZkStateReader A collections change: [WatchedEvent state:SyncConnected type:NodeChildrenChanged path:/collections], has occurred - updating...
    [junit4] 2> 2857062 INFO (zkCallback-9337-thread-1) [ ] o.a.s.c.c.ZkStateReader A collections change: [WatchedEvent state:SyncConnected type:NodeChildrenChanged path:/collections], has occurred - updating...
    [junit4] 2> 2857062 INFO (zkCallback-9330-thread-1-processing-n:127.0.0.1:60669_solr) [n:127.0.0.1:60669_solr ] o.a.s.c.c.ZkStateReader A collections change: [WatchedEvent state:SyncConnected type:NodeChildrenChanged path:/collections], has occurred - updating...
    [junit4] 2> 2857066 INFO (OverseerStateUpdate-96078797589774342-127.0.0.1:60666_solr-n_0000000000) [n:127.0.0.1:60666_solr ] o.a.s.c.Overseer processMessage: queueSize: 1, message = {
    [junit4] 2> "name":"testschemaapi",
    [junit4] 2> "fromApi":"true",
    [junit4] 2> "replicationFactor":"2",
    [junit4] 2> "collection.configName":"conf1",
    [junit4] 2> "numShards":"1",
    [junit4] 2> "stateFormat":"2",
    [junit4] 2> "operation":"create"} current state version: 0
    [junit4] 2> 2857066 INFO (OverseerStateUpdate-96078797589774342-127.0.0.1:60666_solr-n_0000000000) [n:127.0.0.1:60666_solr ] o.a.s.c.o.ClusterStateMutator building a new cName: testschemaapi
    [junit4] 2> 2857066 INFO (OverseerStateUpdate-96078797589774342-127.0.0.1:60666_solr-n_0000000000) [n:127.0.0.1:60666_solr ] o.a.s.c.o.ZkStateWriter going to create_collection /collections/testschemaapi/state.json
    [junit4] 2> 2857165 INFO (OverseerThreadFactory-10284-thread-1-processing-n:127.0.0.1:60666_solr) [n:127.0.0.1:60666_solr ] o.a.s.c.OverseerCollectionMessageHandler Creating SolrCores for new collection testschemaapi, shardNames [shard1] , replicationFactor : 2
    [junit4] 2> 2857165 INFO (OverseerThreadFactory-10284-thread-1-processing-n:127.0.0.1:60666_solr) [n:127.0.0.1:60666_solr ] o.a.s.c.OverseerCollectionMessageHandler Creating core testschemaapi_shard1_replica1 as part of shard shard1 of collection testschemaapi on 127.0.0.1:60666_solr
    [junit4] 2> 2857165 INFO (OverseerThreadFactory-10284-thread-1-processing-n:127.0.0.1:60666_solr) [n:127.0.0.1:60666_solr ] o.a.s.c.OverseerCollectionMessageHandler Creating core testschemaapi_shard1_replica2 as part of shard shard1 of collection testschemaapi on 127.0.0.1:60669_solr
    [junit4] 2> 2857170 INFO (qtp26062370-41575) [n:127.0.0.1:60669_solr ] o.a.s.h.a.CoreAdminOperation core create command qt=/admin/cores&collection.configName=conf1&name=testschemaapi_shard1_replica2&action=CREATE&numShards=1&collection=testschemaapi&shard=shard1&wt=javabin&version=2
    [junit4] 2> 2857171 INFO (qtp16786663-41586) [n:127.0.0.1:60666_solr ] o.a.s.h.a.CoreAdminOperation core create command qt=/admin/cores&collection.configName=conf1&name=testschemaapi_shard1_replica1&action=CREATE&numShards=1&collection=testschemaapi&shard=shard1&wt=javabin&version=2
    [junit4] 2> 2857171 INFO (qtp26062370-41575) [n:127.0.0.1:60669_solr ] o.a.s.c.CoreDescriptor Created CoreDescriptor: {name=testschemaapi_shard1_replica2, collection.configName=conf1, config=solrconfig.xml, transient=false, schema=schema.xml, loadOnStartup=true, configSetProperties=configsetprops.json, collection=testschemaapi, numShards=1, dataDir=data\, shard=shard1}
    [junit4] 2> 2857172 INFO (qtp26062370-41575) [n:127.0.0.1:60669_solr c:testschemaapi s:shard1 x:testschemaapi_shard1_replica2] o.a.s.c.ZkController publishing state=down
    [junit4] 2> 2857172 INFO (qtp16786663-41586) [n:127.0.0.1:60666_solr ] o.a.s.c.CoreDescriptor Created CoreDescriptor: {name=testschemaapi_shard1_replica1, collection.configName=conf1, config=solrconfig.xml, transient=false, schema=schema.xml, loadOnStartup=true, configSetProperties=configsetprops.json, collection=testschemaapi, numShards=1, dataDir=data\, shard=shard1}
    [junit4] 2> 2857173 INFO (qtp16786663-41586) [n:127.0.0.1:60666_solr c:testschemaapi s:shard1 x:testschemaapi_shard1_replica1] o.a.s.c.ZkController publishing state=down
    [junit4] 2> 2857173 INFO (qtp26062370-41575) [n:127.0.0.1:60669_solr c:testschemaapi s:shard1 x:testschemaapi_shard1_replica2] o.a.s.c.ZkController Registering watch for collection testschemaapi
    [junit4] 2> 2857174 INFO (qtp26062370-41575) [n:127.0.0.1:60669_solr c:testschemaapi s:shard1 x:testschemaapi_shard1_replica2] o.a.s.c.c.ZkStateReader Add data for [testschemaapi] ver [0]
    [junit4] 2> 2857174 INFO (qtp26062370-41575) [n:127.0.0.1:60669_solr c:testschemaapi s:shard1 x:testschemaapi_shard1_replica2] o.a.s.c.ZkController look for our core node name
    [junit4] 2> 2857175 INFO (OverseerStateUpdate-96078797589774342-127.0.0.1:60666_solr-n_0000000000) [n:127.0.0.1:60666_solr ] o.a.s.c.Overseer processMessage: queueSize: 1, message = {
    [junit4] 2> "core":"testschemaapi_shard1_replica2",
    [junit4] 2> "roles":null,
    [junit4] 2> "base_url":"http://127.0.0.1:60669/solr",
    [junit4] 2> "node_name":"127.0.0.1:60669_solr",
    [junit4] 2> "numShards":"1",
    [junit4] 2> "state":"down",
    [junit4] 2> "shard":"shard1",
    [junit4] 2> "collection":"testschemaapi",
    [junit4] 2> "operation":"state"} current state version: 0
    [junit4] 2> 2857175 INFO (qtp16786663-41586) [n:127.0.0.1:60666_solr c:testschemaapi s:shard1 x:testschemaapi_shard1_replica1] o.a.s.c.ZkController Registering watch for collection testschemaapi
    [junit4] 2> 2857175 INFO (OverseerStateUpdate-96078797589774342-127.0.0.1:60666_solr-n_0000000000) [n:127.0.0.1:60666_solr ] o.a.s.c.o.ReplicaMutator Update state numShards=1 message={
    [junit4] 2> "core":"testschemaapi_shard1_replica2",
    [junit4] 2> "roles":null,
    [junit4] 2> "base_url":"http://127.0.0.1:60669/solr",
    [junit4] 2> "node_name":"127.0.0.1:60669_solr",
    [junit4] 2> "numShards":"1",
    [junit4] 2> "state":"down",
    [junit4] 2> "shard":"shard1",
    [junit4] 2> "collection":"testschemaapi",
    [junit4] 2> "operation":"state"}
    [junit4] 2> 2857175 INFO (qtp16786663-41586) [n:127.0.0.1:60666_solr c:testschemaapi s:shard1 x:testschemaapi_shard1_replica1] o.a.s.c.c.ZkStateReader Add data for [testschemaapi] ver [0]
    [junit4] 2> 2857176 INFO (qtp16786663-41586) [n:127.0.0.1:60666_solr c:testschemaapi s:shard1 x:testschemaapi_shard1_replica1] o.a.s.c.ZkController look for our core node name
    [junit4] 2> 2857178 INFO (OverseerStateUpdate-96078797589774342-127.0.0.1:60666_solr-n_0000000000) [n:127.0.0.1:60666_solr ] o.a.s.c.Overseer processMessage: queueSize: 2, message = {
    [junit4] 2> "core":"testschemaapi_shard1_replica1",
    [junit4] 2> "roles":null,
    [junit4] 2> "base_url":"http://127.0.0.1:60666/solr",
    [junit4] 2> "node_name":"127.0.0.1:60666_solr",
    [junit4] 2> "numShards":"1",
    [junit4] 2> "state":"down",
    [junit4] 2> "shard":"shard1",
    [junit4] 2> "collection":"testschemaapi",
    [junit4] 2> "operation":"state"} current state version: 0
    [junit4] 2> 2857178 INFO (OverseerStateUpdate-96078797589774342-127.0.0.1:60666_solr-n_0000000000) [n:127.0.0.1:60666_solr ] o.a.s.c.o.ReplicaMutator Update state numShards=1 message={
    [junit4] 2> "core":"testschemaapi_shard1_replica1",
    [junit4] 2> "roles":null,
    [junit4] 2> "base_url":"http://127.0.0.1:60666/solr",
    [junit4] 2> "node_name":"127.0.0.1:60666_solr",
    [junit4] 2> "numShards":"1",
    [junit4] 2> "state":"down",
    [junit4] 2> "shard":"shard1",
    [junit4] 2> "collection":"testschemaapi",
    [junit4] 2> "operation":"state"}
    [junit4] 2> 2857282 INFO (OverseerStateUpdate-96078797589774342-127.0.0.1:60666_solr-n_0000000000) [n:127.0.0.1:60666_solr ] o.a.s.c.o.ZkStateWriter going to update_collection /collections/testschemaapi/state.json version: 0
    [junit4] 2> 2857283 INFO (zkCallback-9331-thread-3-processing-n:127.0.0.1:60666_solr) [n:127.0.0.1:60666_solr ] o.a.s.c.c.ZkStateReader A cluster state change: [WatchedEvent state:SyncConnected type:NodeDataChanged path:/collections/testschemaapi/state.json] for collection [testschemaapi] has occurred - updating... (live nodes size: [2])
    [junit4] 2> 2857283 INFO (zkCallback-9330-thread-1-processing-n:127.0.0.1:60669_solr) [n:127.0.0.1:60669_solr ] o.a.s.c.c.ZkStateReader A cluster state change: [WatchedEvent state:SyncConnected type:NodeDataChanged path:/collections/testschemaapi/state.json] for collection [testschemaapi] has occurred - updating... (live nodes size: [2])
    [junit4] 2> 2857283 INFO (zkCallback-9331-thread-3-processing-n:127.0.0.1:60666_solr) [n:127.0.0.1:60666_solr ] o.a.s.c.c.ZkStateReader Updating data for [testschemaapi] from [0] to [1]
    [junit4] 2> 2857283 INFO (zkCallback-9330-thread-1-processing-n:127.0.0.1:60669_solr) [n:127.0.0.1:60669_solr ] o.a.s.c.c.ZkStateReader Updating data for [testschemaapi] from [0] to [1]
    [junit4] 2> 2858174 INFO (qtp26062370-41575) [n:127.0.0.1:60669_solr c:testschemaapi s:shard1 x:testschemaapi_shard1_replica2] o.a.s.c.ZkController waiting to find shard id in clusterstate for testschemaapi_shard1_replica2
    [junit4] 2> 2858174 INFO (qtp26062370-41575) [n:127.0.0.1:60669_solr c:testschemaapi s:shard1 x:testschemaapi_shard1_replica2] o.a.s.c.ZkController Check for collection zkNode:testschemaapi
    [junit4] 2> 2858174 INFO (qtp26062370-41575) [n:127.0.0.1:60669_solr c:testschemaapi s:shard1 x:testschemaapi_shard1_replica2] o.a.s.c.ZkController Collection zkNode exists
    [junit4] 2> 2858174 INFO (qtp26062370-41575) [n:127.0.0.1:60669_solr c:testschemaapi s:shard1 x:testschemaapi_shard1_replica2] o.a.s.c.c.ZkStateReader Load collection config from: [/collections/testschemaapi]
    [junit4] 2> 2858175 INFO (qtp26062370-41575) [n:127.0.0.1:60669_solr c:testschemaapi s:shard1 x:testschemaapi_shard1_replica2] o.a.s.c.c.ZkStateReader path=[/collections/testschemaapi] [configName]=[conf1] specified config exists in ZooKeeper
    [junit4] 2> 2858175 INFO (qtp26062370-41575) [n:127.0.0.1:60669_solr c:testschemaapi s:shard1 x:testschemaapi_shard1_replica2] o.a.s.c.SolrResourceLoader new SolrResourceLoader for directory: 'C:\Users\jenkins\workspace\Lucene-Solr-6.1-Windows\solr\build\solr-core\test\J0\temp\solr.schema.TestManagedSchemaAPI_D9B7FAB906BB7F1A-001\tempDir-001\node1\testschemaapi_shard1_replica2'
    [junit4] 2> 2858175 INFO (qtp26062370-41575) [n:127.0.0.1:60669_solr c:testschemaapi s:shard1 x:testschemaapi_shard1_replica2] o.a.s.c.SolrResourceLoader JNDI not configured for solr (NoInitialContextEx)
    [junit4] 2> 2858176 INFO (qtp26062370-41575) [n:127.0.0.1:60669_solr c:testschemaapi s:shard1 x:testschemaapi_shard1_replica2] o.a.s.c.SolrResourceLoader solr home defaulted to 'solr/' (could not find system property or JNDI)
    [junit4] 2> 2858176 INFO (qtp16786663-41586) [n:127.0.0.1:60666_solr c:testschemaapi s:shard1 x:testschemaapi_shard1_replica1] o.a.s.c.ZkController waiting to find shard id in clusterstate for testschemaapi_shard1_replica1
    [junit4] 2> 2858176 INFO (qtp16786663-41586) [n:127.0.0.1:60666_solr c:testschemaapi s:shard1 x:testschemaapi_shard1_replica1] o.a.s.c.ZkController Check for collection zkNode:testschemaapi
    [junit4] 2> 2858177 INFO (qtp16786663-41586) [n:127.0.0.1:60666_solr c:testschemaapi s:shard1 x:testschemaapi_shard1_replica1] o.a.s.c.ZkController Collection zkNode exists
    [junit4] 2> 2858177 INFO (qtp16786663-41586) [n:127.0.0.1:60666_solr c:testschemaapi s:shard1 x:testschemaapi_shard1_replica1] o.a.s.c.c.ZkStateReader Load collection config from: [/collections/testschemaapi]
    [junit4] 2> 2858178 INFO (qtp16786663-41586) [n:127.0.0.1:60666_solr c:testschemaapi s:shard1 x:testschemaapi_shard1_replica1] o.a.s.c.c.ZkStateReader path=[/collections/testschemaapi] [configName]=[conf1] specified config exists in ZooKeeper
    [junit4] 2> 2858179 INFO (qtp16786663-41586) [n:127.0.0.1:60666_solr c:testschemaapi s:shard1 x:testschemaapi_shard1_replica1] o.a.s.c.SolrResourceLoader new SolrResourceLoader for directory: 'C:\Users\jenkins\workspace\Lucene-Solr-6.1-Windows\solr\build\solr-core\test\J0\temp\solr.schema.TestManagedSchemaAPI_D9B7FAB906BB7F1A-001\tempDir-001\node2\testschemaapi_shard1_replica1'
    [junit4] 2> 2858179 INFO (qtp26062370-41575) [n:127.0.0.1:60669_solr c:testschemaapi s:shard1 x:testschemaapi_shard1_replica2] o.a.s.c.Config loaded config solrconfig.xml with version 0
    [junit4] 2> 2858179 INFO (qtp16786663-41586) [n:127.0.0.1:60666_solr c:testschemaapi s:shard1 x:testschemaapi_shard1_replica1] o.a.s.c.SolrResourceLoader JNDI not configured for solr (NoInitialContextEx)
    [junit4] 2> 2858179 INFO (qtp16786663-41586) [n:127.0.0.1:60666_solr c:testschemaapi s:shard1 x:testschemaapi_shard1_replica1] o.a.s.c.SolrResourceLoader solr home defaulted to 'solr/' (could not find system property or JNDI)
    [junit4] 2> 2858181 INFO (qtp16786663-41586) [n:127.0.0.1:60666_solr c:testschemaapi s:shard1 x:testschemaapi_shard1_replica1] o.a.s.c.Config loaded config solrconfig.xml with version 0
    [junit4] 2> 2858182 INFO (qtp26062370-41575) [n:127.0.0.1:60669_solr c:testschemaapi s:shard1 x:testschemaapi_shard1_replica2] o.a.s.c.SolrConfig current version of requestparams : -1
    [junit4] 2> 2858184 INFO (qtp26062370-41575) [n:127.0.0.1:60669_solr c:testschemaapi s:shard1 x:testschemaapi_shard1_replica2] o.a.s.c.SolrConfig Using Lucene MatchVersion: 6.1.0
    [junit4] 2> 2858185 INFO (qtp16786663-41586) [n:127.0.0.1:60666_solr c:testschemaapi s:shard1 x:testschemaapi_shard1_replica1] o.a.s.c.SolrConfig current version of requestparams : -1
    [junit4] 2> 2858186 INFO (qtp16786663-41586) [n:127.0.0.1:60666_solr c:testschemaapi s:shard1 x:testschemaapi_shard1_replica1] o.a.s.c.SolrConfig Using Lucene MatchVersion: 6.1.0
    [junit4] 2> 2858187 INFO (qtp26062370-41575) [n:127.0.0.1:60669_solr c:testschemaapi s:shard1 x:testschemaapi_shard1_replica2] o.a.s.c.SolrConfig Loaded SolrConfig: solrconfig.xml
    [junit4] 2> 2858190 INFO (qtp16786663-41586) [n:127.0.0.1:60666_solr c:testschemaapi s:shard1 x:testschemaapi_shard1_replica1] o.a.s.c.SolrConfig Loaded SolrConfig: solrconfig.xml
    [junit4] 2> 2858194 INFO (qtp16786663-41586) [n:127.0.0.1:60666_solr c:testschemaapi s:shard1 x:testschemaapi_shard1_replica1] o.a.s.s.IndexSchema [testschemaapi_shard1_replica1] Schema name=minimal
    [junit4] 2> 2858195 INFO (qtp26062370-41575) [n:127.0.0.1:60669_solr c:testschemaapi s:shard1 x:testschemaapi_shard1_replica2] o.a.s.s.IndexSchema [testschemaapi_shard1_replica2] Schema name=minimal
    [junit4] 2> 2858197 INFO (qtp16786663-41586) [n:127.0.0.1:60666_solr c:testschemaapi s:shard1 x:testschemaapi_shard1_replica1] o.a.s.s.IndexSchema unique key field: id
    [junit4] 2> 2858197 INFO (qtp26062370-41575) [n:127.0.0.1:60669_solr c:testschemaapi s:shard1 x:testschemaapi_shard1_replica2] o.a.s.s.IndexSchema unique key field: id
    [junit4] 2> 2858198 INFO (qtp16786663-41586) [n:127.0.0.1:60666_solr c:testschemaapi s:shard1 x:testschemaapi_shard1_replica1] o.a.s.c.ConfigSetProperties Did not find ConfigSet properties, assuming default properties: Can't find resource 'configsetprops.json' in classpath or '/configs/conf1', cwd=C:\Users\jenkins\workspace\Lucene-Solr-6.1-Windows\solr\build\solr-core\test\J0
    [junit4] 2> 2858198 INFO (qtp16786663-41586) [n:127.0.0.1:60666_solr c:testschemaapi s:shard1 x:testschemaapi_shard1_replica1] o.a.s.c.CoreContainer Creating SolrCore 'testschemaapi_shard1_replica1' using configuration from collection testschemaapi
    [junit4] 2> 2858199 INFO (qtp16786663-41586) [n:127.0.0.1:60666_solr c:testschemaapi s:shard1 r:core_node2 x:testschemaapi_shard1_replica1] o.a.s.c.SolrCore org.apache.solr.core.MockDirectoryFactory
    [junit4] 2> 2858199 INFO (qtp16786663-41586) [n:127.0.0.1:60666_solr c:testschemaapi s:shard1 r:core_node2 x:testschemaapi_shard1_replica1] o.a.s.c.SolrCore [[testschemaapi_shard1_replica1] ] Opening new SolrCore at [C:\Users\jenkins\workspace\Lucene-Solr-6.1-Windows\solr\build\solr-core\test\J0\temp\solr.schema.TestManagedSchemaAPI_D9B7FAB906BB7F1A-001\tempDir-001\node2\testschemaapi_shard1_replica1], dataDir=[C:\Users\jenkins\workspace\Lucene-Solr-6.1-Windows\solr\build\solr-core\test\J0\temp\solr.schema.TestManagedSchemaAPI_D9B7FAB906BB7F1A-001\tempDir-001\node2\.\testschemaapi_shard1_replica1\data\]
    [junit4] 2> 2858199 INFO (qtp16786663-41586) [n:127.0.0.1:60666_solr c:testschemaapi s:shard1 r:core_node2 x:testschemaapi_shard1_replica1] o.a.s.c.SolrCore JMX monitoring not detected for core: testschemaapi_shard1_replica1
    [junit4] 2> 2858199 INFO (qtp26062370-41575) [n:127.0.0.1:60669_solr c:testschemaapi s:shard1 x:testschemaapi_shard1_replica2] o.a.s.c.ConfigSetProperties Did not find ConfigSet properties, assuming default properties: Can't find resource 'configsetprops.json' in classpath or '/configs/conf1', cwd=C:\Users\jenkins\workspace\Lucene-Solr-6.1-Windows\solr\build\solr-core\test\J0
    [junit4] 2> 2858199 INFO (qtp26062370-41575) [n:127.0.0.1:60669_solr c:testschemaapi s:shard1 x:testschemaapi_shard1_replica2] o.a.s.c.CoreContainer Creating SolrCore 'testschemaapi_shard1_replica2' using configuration from collection testschemaapi
    [junit4] 2> 2858200 INFO (qtp26062370-41575) [n:127.0.0.1:60669_solr c:testschemaapi s:shard1 r:core_node1 x:testschemaapi_shard1_replica2] o.a.s.c.SolrCore org.apache.solr.core.MockDirectoryFactory
    [junit4] 2> 2858200 INFO (qtp26062370-41575) [n:127.0.0.1:60669_solr c:testschemaapi s:shard1 r:core_node1 x:testschemaapi_shard1_replica2] o.a.s.c.SolrCore [[testschemaapi_shard1_replica2] ] Opening new SolrCore at [C:\Users\jenkins\workspace\Lucene-Solr-6.1-Windows\solr\build\solr-core\test\J0\temp\solr.schema.TestManagedSchemaAPI_D9B7FAB906BB7F1A-001\tempDir-001\node1\testschemaapi_shard1_replica2], dataDir=[C:\Users\jenkins\workspace\Lucene-Solr-6.1-Windows\solr\build\solr-core\test\J0\temp\solr.schema.TestManagedSchemaAPI_D9B7FAB906BB7F1A-001\tempDir-001\node1\.\testschemaapi_shard1_replica2\data\]
    [junit4] 2> 2858200 INFO (qtp16786663-41586) [n:127.0.0.1:60666_solr c:testschemaapi s:shard1 r:core_node2 x:testschemaapi_shard1_replica1] o.a.s.c.CachingDirectoryFactory return new directory for C:\Users\jenkins\workspace\Lucene-Solr-6.1-Windows\solr\build\solr-core\test\J0\temp\solr.schema.TestManagedSchemaAPI_D9B7FAB906BB7F1A-001\tempDir-001\node2\.\testschemaapi_shard1_replica1\data\
    [junit4] 2> 2858200 INFO (qtp26062370-41575) [n:127.0.0.1:60669_solr c:testschemaapi s:shard1 r:core_node1 x:testschemaapi_shard1_replica2] o.a.s.c.SolrCore JMX monitoring not detected for core: testschemaapi_shard1_replica2
    [junit4] 2> 2858200 INFO (qtp16786663-41586) [n:127.0.0.1:60666_solr c:testschemaapi s:shard1 r:core_node2 x:testschemaapi_shard1_replica1] o.a.s.c.SolrCore New index directory detected: old=null new=C:\Users\jenkins\workspace\Lucene-Solr-6.1-Windows\solr\build\solr-core\test\J0\temp\solr.schema.TestManagedSchemaAPI_D9B7FAB906BB7F1A-001\tempDir-001\node2\.\testschemaapi_shard1_replica1\data\index/
    [junit4] 2> 2858200 WARN (qtp16786663-41586) [n:127.0.0.1:60666_solr c:testschemaapi s:shard1 r:core_node2 x:testschemaapi_shard1_replica1] o.a.s.c.SolrCore [testschemaapi_shard1_replica1] Solr index directory 'C:\Users\jenkins\workspace\Lucene-Solr-6.1-Windows\solr\build\solr-core\test\J0\temp\solr.schema.TestManagedSchemaAPI_D9B7FAB906BB7F1A-001\tempDir-001\node2\.\testschemaapi_shard1_replica1\data\index' doesn't exist. Creating new index...
    [junit4] 2> 2858201 INFO (qtp26062370-41575) [n:127.0.0.1:60669_solr c:testschemaapi s:shard1 r:core_node1 x:testschemaapi_shard1_replica2] o.a.s.c.CachingDirectoryFactory return new directory for C:\Users\jenkins\workspace\Lucene-Solr-6.1-Windows\solr\build\solr-core\test\J0\temp\solr.schema.TestManagedSchemaAPI_D9B7FAB906BB7F1A-001\tempDir-001\node1\.\testschemaapi_shard1_replica2\data\
    [junit4] 2> 2858201 INFO (qtp16786663-41586) [n:127.0.0.1:60666_solr c:testschemaapi s:shard1 r:core_node2 x:testschemaapi_shard1_replica1] o.a.s.c.CachingDirectoryFactory return new directory for C:\Users\jenkins\workspace\Lucene-Solr-6.1-Windows\solr\build\solr-core\test\J0\temp\solr.schema.TestManagedSchemaAPI_D9B7FAB906BB7F1A-001\tempDir-001\node2\.\testschemaapi_shard1_replica1\data\index
    [junit4] 2> 2858201 INFO (qtp26062370-41575) [n:127.0.0.1:60669_solr c:testschemaapi s:shard1 r:core_node1 x:testschemaapi_shard1_replica2] o.a.s.c.SolrCore New index directory detected: old=null new=C:\Users\jenkins\workspace\Lucene-Solr-6.1-Windows\solr\build\solr-core\test\J0\temp\solr.schema.TestManagedSchemaAPI_D9B7FAB906BB7F1A-001\tempDir-001\node1\.\testschemaapi_shard1_replica2\data\index/
    [junit4] 2> 2858201 WARN (qtp26062370-41575) [n:127.0.0.1:60669_solr c:testschemaapi s:shard1 r:core_node1 x:testschemaapi_shard1_replica2] o.a.s.c.SolrCore [testschemaapi_shard1_replica2] Solr index directory 'C:\Users\jenkins\workspace\Lucene-Solr-6.1-Windows\solr\build\solr-core\test\J0\temp\solr.schema.TestManagedSchemaAPI_D9B7FAB906BB7F1A-001\tempDir-001\node1\.\testschemaapi_shard1_replica2\data\index' doesn't exist. Creating new index...
    [junit4] 2> 2858202 INFO (qtp26062370-41575) [n:127.0.0.1:60669_solr c:testschemaapi s:shard1 r:core_node1 x:testschemaapi_shard1_replica2] o.a.s.c.CachingDirectoryFactory return new directory for C:\Users\jenkins\workspace\Lucene-Solr-6.1-Windows\solr\build\solr-core\test\J0\temp\solr.schema.TestManagedSchemaAPI_D9B7FAB906BB7F1A-001\tempDir-001\node1\.\testschemaapi_shard1_replica2\data\index
    [junit4] 2> 2858202 INFO (qtp16786663-41586) [n:127.0.0.1:60666_solr c:testschemaapi s:shard1 r:core_node2 x:testschemaapi_shard1_replica1] o.a.s.c.SolrDeletionPolicy SolrDeletionPolicy.onCommit: commits: num=1
    [junit4] 2> commit{dir=MockDirectoryWrapper(RAMDirectory@1406c62 lockFactory=org.apache.lucene.store.SingleInstanceLockFactory@5af6e9),segFN=segments_1,generation=1}
    [junit4] 2> 2858202 INFO (qtp16786663-41586) [n:127.0.0.1:60666_solr c:testschemaapi s:shard1 r:core_node2 x:testschemaapi_shard1_replica1] o.a.s.c.SolrDeletionPolicy newest commit generation = 1
    [junit4] 2> 2858203 INFO (OldIndexDirectoryCleanupThreadForCore-testschemaapi_shard1_replica1) [n:127.0.0.1:60666_solr c:testschemaapi s:shard1 r:core_node2 x:testschemaapi_shard1_replica1] o.a.s.c.SolrCore Looking for old index directories to cleanup for core testschemaapi_shard1_replica1 in C:\Users\jenkins\workspace\Lucene-Solr-6.1-Windows\solr\build\solr-core\test\J0\temp\solr.schema.TestManagedSchemaAPI_D9B7FAB906BB7F1A-001\tempDir-001\node2\.\testschemaapi_shard1_replica1\data\
    [junit4] 2> 2858204 INFO (qtp26062370-41575) [n:127.0.0.1:60669_solr c:testschemaapi s:shard1 r:core_node1 x:testschemaapi_shard1_replica2] o.a.s.c.SolrDeletionPolicy SolrDeletionPolicy.onCommit: commits: num=1
    [junit4] 2> commit{dir=MockDirectoryWrapper(RAMDirectory@e2f0e6 lockFactory=org.apache.lucene.store.SingleInstanceLockFactory@15b71e),segFN=segments_1,generation=1}
    [junit4] 2> 2858204 INFO (qtp26062370-41575) [n:127.0.0.1:60669_solr c:testschemaapi s:shard1 r:core_node1 x:testschemaapi_shard1_replica2] o.a.s.c.SolrDeletionPolicy newest commit generation = 1
    [junit4] 2> 2858204 WARN (OldIndexDirectoryCleanupThreadForCore-testschemaapi_shard1_replica1) [n:127.0.0.1:60666_solr c:testschemaapi s:shard1 r:core_node2 x:testschemaapi_shard1_replica1] o.a.s.c.DirectoryFactory C:\Users\jenkins\workspace\Lucene-Solr-6.1-Windows\solr\build\solr-core\test\J0\temp\solr.schema.TestManagedSchemaAPI_D9B7FAB906BB7F1A-001\tempDir-001\node2\.\testschemaapi_shard1_replica1\data\ does not point to a valid data directory; skipping clean-up of old index directories.
    [junit4] 2> 2858205 INFO (qtp26062370-41575) [n:127.0.0.1:60669_solr c:testschemaapi s:shard1 r:core_node1 x:testschemaapi_shard1_replica2] o.a.s.c.SolrCore no updateRequestProcessorChain defined as default, creating implicit default
    [junit4] 2> 2858205 INFO (qtp16786663-41586) [n:127.0.0.1:60666_solr c:testschemaapi s:shard1 r:core_node2 x:testschemaapi_shard1_replica1] o.a.s.c.SolrCore no updateRequestProcessorChain defined as default, creating implicit default
    [junit4] 2> 2858206 INFO (qtp16786663-41586) [n:127.0.0.1:60666_solr c:testschemaapi s:shard1 r:core_node2 x:testschemaapi_shard1_replica1] o.a.s.h.l.XMLLoader xsltCacheLifetimeSeconds=60
    [junit4] 2> 2858207 INFO (OldIndexDirectoryCleanupThreadForCore-testschemaapi_shard1_replica2) [n:127.0.0.1:60669_solr c:testschemaapi s:shard1 r:core_node1 x:testschemaapi_shard1_replica2] o.a.s.c.SolrCore Looking for old index directories to cleanup for core testschemaapi_shard1_replica2 in C:\Users\jenkins\workspace\Lucene-Solr-6.1-Windows\solr\build\solr-core\test\J0\temp\solr.schema.TestManagedSchemaAPI_D9B7FAB906BB7F1A-001\tempDir-001\node1\.\testschemaapi_shard1_replica2\data\
    [junit4] 2> 2858207 INFO (qtp26062370-41575) [n:127.0.0.1:60669_solr c:testschemaapi s:shard1 r:core_node1 x:testschemaapi_shard1_replica2] o.a.s.h.l.XMLLoader xsltCacheLifetimeSeconds=60
    [junit4] 2> 2858207 INFO (qtp16786663-41586) [n:127.0.0.1:60666_solr c:testschemaapi s:shard1 r:core_node2 x:testschemaapi_shard1_replica1] o.a.s.h.l.XMLLoader xsltCacheLifetimeSeconds=60
    [junit4] 2> 2858208 INFO (qtp16786663-41586) [n:127.0.0.1:60666_solr c:testschemaapi s:shard1 r:core_node2 x:testschemaapi_shard1_replica1] o.a.s.h.l.XMLLoader xsltCacheLifetimeSeconds=60
    [junit4] 2> 2858209 INFO (qtp16786663-41586) [n:127.0.0.1:60666_solr c:testschemaapi s:shard1 r:core_node2 x:testschemaapi_shard1_replica1] o.a.s.h.l.XMLLoader xsltCacheLifetimeSeconds=60
    [junit4] 2> 2858210 WARN (OldIndexDirectoryCleanupThreadForCore-testschemaapi_shard1_replica2) [n:127.0.0.1:60669_solr c:testschemaapi s:shard1 r:core_node1 x:testschemaapi_shard1_replica2] o.a.s.c.DirectoryFactory C:\Users\jenkins\workspace\Lucene-Solr-6.1-Windows\solr\build\solr-core\test\J0\temp\solr.schema.TestManagedSchemaAPI_D9B7FAB906BB7F1A-001\tempDir-001\node1\.\testschemaapi_shard1_replica2\data\ does not point to a valid data directory; skipping clean-up of old index directories.
    [junit4] 2> 2858211 INFO (qtp16786663-41586) [n:127.0.0.1:60666_solr c:testschemaapi s:shard1 r:core_node2 x:testschemaapi_shard1_replica1] o.a.s.c.RequestHandlers Registered paths: /admin/mbeans,/update/csv,/sql,/update/json/docs,/admin/luke,/graph,/export,/select,/admin/segments,/get,/admin/system,/replication,/admin/properties,/config,/stream,/schema,/admin/plugins,/admin/logging,/update/json,/admin/ping,/admin/threads,/update,/admin/file
    [junit4] 2> 2858211 INFO (qtp26062370-41575) [n:127.0.0.1:60669_solr c:testschemaapi s:shard1 r:core_node1 x:testschemaapi_shard1_replica2] o.a.s.h.l.XMLLoader xsltCacheLifetimeSeconds=60
    [junit4] 2> 2858211 INFO (qtp16786663-41586) [n:127.0.0.1:60666_solr c:testschemaapi s:shard1 r:core_node2 x:testschemaapi_shard1_replica1] o.a.s.c.SolrCore Using default statsCache cache: org.apache.solr.search.stats.LocalStatsCache
    [junit4] 2> 2858212 INFO (qtp16786663-41586) [n:127.0.0.1:60666_solr c:testschemaapi s:shard1 r:core_node2 x:testschemaapi_shard1_replica1] o.a.s.u.UpdateHandler Using UpdateLog implementation: org.apache.solr.update.UpdateLog
    [junit4] 2> 2858212 INFO (qtp16786663-41586) [n:127.0.0.1:60666_solr c:testschemaapi s:shard1 r:core_node2 x:testschemaapi_shard1_replica1] o.a.s.u.UpdateLog Initializing UpdateLog: dataDir=null defaultSyncLevel=FLUSH numRecordsToKeep=100 maxNumLogsToKeep=10 numVersionBuckets=65536
    [junit4] 2> 2858213 INFO (qtp26062370-41575) [n:127.0.0.1:60669_solr c:testschemaapi s:shard1 r:core_node1 x:testschemaapi_shard1_replica2] o.a.s.h.l.XMLLoader xsltCacheLifetimeSeconds=60
    [junit4] 2> 2858215 INFO (qtp16786663-41586) [n:127.0.0.1:60666_solr c:testschemaapi s:shard1 r:core_node2 x:testschemaapi_shard1_replica1] o.a.s.u.CommitTracker Hard AutoCommit: disabled
    [junit4] 2> 2858215 INFO (qtp16786663-41586) [n:127.0.0.1:60666_solr c:testschemaapi s:shard1 r:core_node2 x:testschemaapi_shard1_replica1] o.a.s.u.CommitTracker Soft AutoCommit: disabled
    [junit4] 2> 2858216 INFO (qtp26062370-41575) [n:127.0.0.1:60669_solr c:testschemaapi s:shard1 r:core_node1 x:testschemaapi_shard1_replica2] o.a.s.h.l.XMLLoader xsltCacheLifetimeSeconds=60
    [junit4] 2> 2858216 INFO (qtp16786663-41586) [n:127.0.0.1:60666_solr c:testschemaapi s:shard1 r:core_node2 x:testschemaapi_shard1_replica1] o.a.s.c.SolrDeletionPolicy SolrDeletionPolicy.onInit: commits: num=1
    [junit4] 2> commit{dir=MockDirectoryWrapper(RAMDirectory@1406c62 lockFactory=org.apache.lucene.store.SingleInstanceLockFactory@5af6e9),segFN=segments_1,generation=1}
    [junit4] 2> 2858216 INFO (qtp16786663-41586) [n:127.0.0.1:60666_solr c:testschemaapi s:shard1 r:core_node2 x:testschemaapi_shard1_replica1] o.a.s.c.SolrDeletionPolicy newest commit generation = 1
    [junit4] 2> 2858216 INFO (qtp16786663-41586) [n:127.0.0.1:60666_solr c:testschemaapi s:shard1 r:core_node2 x:testschemaapi_shard1_replica1] o.a.s.s.SolrIndexSearcher Opening [Searcher@1fa8061[testschemaapi_shard1_replica1] main]
    [junit4] 2> 2858216 INFO (qtp16786663-41586) [n:127.0.0.1:60666_solr c:testschemaapi s:shard1 r:core_node2 x:testschemaapi_shard1_replica1] o.a.s.c.c.ZkStateReader Load collection config from: [/collections/testschemaapi]
    [junit4] 2> 2858217 INFO (qtp26062370-41575) [n:127.0.0.1:60669_solr c:testschemaapi s:shard1 r:core_node1 x:testschemaapi_shard1_replica2] o.a.s.c.RequestHandlers Registered paths: /admin/mbeans,/update/csv,/sql,/update/json/docs,/admin/luke,/graph,/export,/select,/admin/segments,/get,/admin/system,/replication,/admin/properties,/config,/stream,/schema,/admin/plugins,/admin/logging,/update/json,/admin/ping,/admin/threads,/update,/admin/file
    [junit4] 2> 2858217 INFO (qtp26062370-41575) [n:127.0.0.1:60669_solr c:testschemaapi s:shard1 r:core_node1 x:testschemaapi_shard1_replica2] o.a.s.c.SolrCore Using default statsCache cache: org.apache.solr.search.stats.LocalStatsCache
    [junit4] 2> 2858218 INFO (qtp26062370-41575) [n:127.0.0.1:60669_solr c:testschemaapi s:shard1 r:core_node1 x:testschemaapi_shard1_replica2] o.a.s.u.UpdateHandler Using UpdateLog implementation: org.apache.solr.update.UpdateLog
    [junit4] 2> 2858218 INFO (qtp16786663-41586) [n:127.0.0.1:60666_solr c:testschemaapi s:shard1 r:core_node2 x:testschemaapi_shard1_replica1] o.a.s.c.c.ZkStateReader path=[/collections/testschemaapi] [configName]=[conf1] specified config exists in ZooKeeper
    [junit4] 2> 2858218 INFO (qtp26062370-41575) [n:127.0.0.1:60669_solr c:testschemaapi s:shard1 r:core_node1 x:testschemaapi_shard1_replica2] o.a.s.u.UpdateLog Initializing UpdateLog: dataDir=null defaultSyncLevel=FLUSH numRecordsToKeep=100 maxNumLogsToKeep=10 numVersionBuckets=65536
    [junit4] 2> 2858218 INFO (qtp16786663-41586) [n:127.0.0.1:60666_solr c:testschemaapi s:shard1 r:core_node2 x:testschemaapi_shard1_replica1] o.a.s.r.ManagedResourceStorage Setting up ZooKeeper-based storage for the RestManager with znodeBase: /configs/conf1
    [junit4] 2> 2858219 INFO (qtp16786663-41586) [n:127.0.0.1:60666_solr c:testschemaapi s:shard1 r:core_node2 x:testschemaapi_shard1_replica1] o.a.s.r.ManagedResourceStorage Configured ZooKeeperStorageIO with znodeBase: /configs/conf1
    [junit4] 2> 2858219 INFO (qtp16786663-41586) [n:127.0.0.1:60666_solr c:testschemaapi s:shard1 r:core_node2 x:testschemaapi_shard1_replica1] o.a.s.r.RestManager Initializing RestManager with initArgs: {}
    [junit4] 2> 2858219 INFO (qtp16786663-41586) [n:127.0.0.1:60666_solr c:testschemaapi s:shard1 r:core_node2 x:testschemaapi_shard1_replica1] o.a.s.r.ManagedResourceStorage Reading _rest_managed.json using ZooKeeperStorageIO:path=/configs/conf1
    [junit4] 2> 2858220 INFO (qtp26062370-41575) [n:127.0.0.1:60669_solr c:testschemaapi s:shard1 r:core_node1 x:testschemaapi_shard1_replica2] o.a.s.u.CommitTracker Hard AutoCommit: disabled
    [junit4] 2> 2858220 INFO (qtp26062370-41575) [n:127.0.0.1:60669_solr c:testschemaapi s:shard1 r:core_node1 x:testschemaapi_shard1_replica2] o.a.s.u.CommitTracker Soft AutoCommit: disabled
    [junit4] 2> 2858220 INFO (qtp16786663-41586) [n:127.0.0.1:60666_solr c:testschemaapi s:shard1 r:core_node2 x:testschemaapi_shard1_replica1] o.a.s.r.ManagedResourceStorage No data found for znode /configs/conf1/_rest_managed.json
    [junit4] 2> 2858220 INFO (qtp16786663-41586) [n:127.0.0.1:60666_solr c:testschemaapi s:shard1 r:core_node2 x:testschemaapi_shard1_replica1] o.a.s.r.ManagedResourceStorage Loaded null at path _rest_managed.json using ZooKeeperStorageIO:path=/configs/conf1
    [junit4] 2> 2858220 INFO (qtp16786663-41586) [n:127.0.0.1:60666_solr c:testschemaapi s:shard1 r:core_node2 x:testschemaapi_shard1_replica1] o.a.s.r.RestManager Initializing 0 registered ManagedResources
    [junit4] 2> 2858220 INFO (qtp16786663-41586) [n:127.0.0.1:60666_solr c:testschemaapi s:shard1 r:core_node2 x:testschemaapi_shard1_replica1] o.a.s.s.ZkIndexSchemaReader Creating ZooKeeper watch for the managed schema at /configs/conf1/managed-schema
    [junit4] 2> 2858221 INFO (qtp16786663-41586) [n:127.0.0.1:60666_solr c:testschemaapi s:shard1 r:core_node2 x:testschemaapi_shard1_replica1] o.a.s.c.ZkController Added new OnReconnect listener ZkIndexSchemaReader: /configs/conf1/managed-schema, uniqueCoreId: testschemaapi_shard1_replica1:277818355651884
    [junit4] 2> 2858221 INFO (qtp16786663-41586) [n:127.0.0.1:60666_solr c:testschemaapi s:shard1 r:core_node2 x:testschemaapi_shard1_replica1] o.a.s.h.ReplicationHandler Commits will be reserved for 10000
    [junit4] 2> 2858221 INFO (qtp16786663-41586) [n:127.0.0.1:60666_solr c:testschemaapi s:shard1 r:core_node2 x:testschemaapi_shard1_replica1] o.a.s.u.UpdateLog Looking up max value of version field to seed version buckets
    [junit4] 2> 2858221 INFO (searcherExecutor-10287-thread-1-processing-n:127.0.0.1:60666_solr x:testschemaapi_shard1_replica1 s:shard1 c:testschemaapi r:core_node2) [n:127.0.0.1:60666_solr c:testschemaapi s:shard1 r:core_node2 x:testschemaapi_shard1_replica1] o.a.s.c.SolrCore [testschemaapi_shard1_replica1] Registered new searcher Searcher@1fa8061[testschemaapi_shard1_replica1] main{ExitableDirectoryReader(UninvertingDirectoryReader())}
    [junit4] 2> 2858221 INFO (qtp16786663-41586) [n:127.0.0.1:60666_solr c:testschemaapi s:shard1 r:core_node2 x:testschemaapi_shard1_replica1] o.a.s.u.VersionInfo Refreshing highest value of _version_ for 65536 version buckets from index
    [junit4] 2> 2858222 INFO (qtp16786663-41586) [n:127.0.0.1:60666_solr c:testschemaapi s:shard1 r:core_node2 x:testschemaapi_shard1_replica1] o.a.s.u.VersionInfo No terms found for _version_, cannot seed version bucket highest value from index
    [junit4] 2> 2858222 INFO (qtp16786663-41586) [n:127.0.0.1:60666_solr c:testschemaapi s:shard1 r:core_node2 x:testschemaapi_shard1_replica1] o.a.s.u.UpdateLog Could not find max version in index or recent updates, using new clock 1537260763985477632
    [junit4] 2> 2858222 INFO (qtp26062370-41575) [n:127.0.0.1:60669_solr c:testschemaapi s:shard1 r:core_node1 x:testschemaapi_shard1_replica2] o.a.s.c.SolrDeletionPolicy SolrDeletionPolicy.onInit: commits: num=1
    [junit4] 2> commit{dir=MockDirectoryWrapper(RAMDirectory@e2f0e6 lockFactory=org.apache.lucene.store.SingleInstanceLockFactory@15b71e),segFN=segments_1,generation=1}
    [junit4] 2> 2858222 INFO (qtp26062370-41575) [n:127.0.0.1:60669_solr c:testschemaapi s:shard1 r:core_node1 x:testschemaapi_shard1_replica2] o.a.s.c.SolrDeletionPolicy newest commit generation = 1
    [junit4] 2> 2858222 INFO (qtp26062370-41575) [n:127.0.0.1:60669_solr c:testschemaapi s:shard1 r:core_node1 x:testschemaapi_shard1_replica2] o.a.s.s.SolrIndexSearcher Opening [Searcher@1879d5e[testschemaapi_shard1_replica2] main]
    [junit4] 2> 2858222 INFO (qtp26062370-41575) [n:127.0.0.1:60669_solr c:testschemaapi s:shard1 r:core_node1 x:testschemaapi_shard1_replica2] o.a.s.c.c.ZkStateReader Load collection config from: [/collections/testschemaapi]
    [junit4] 2> 2858223 INFO (qtp16786663-41586) [n:127.0.0.1:60666_solr c:testschemaapi s:shard1 r:core_node2 x:testschemaapi_shard1_replica1] o.a.s.u.UpdateLog Took 1.0ms to seed version buckets with highest version 1537260763985477632
    [junit4] 2> 2858223 INFO (qtp16786663-41586) [n:127.0.0.1:60666_solr c:testschemaapi s:shard1 r:core_node2 x:testschemaapi_shard1_replica1] o.a.s.c.ZkController watch zkdir /configs/conf1
    [junit4] 2> 2858224 INFO (qtp26062370-41575) [n:127.0.0.1:60669_solr c:testschemaapi s:shard1 r:core_node1 x:testschemaapi_shard1_replica2] o.a.s.c.c.ZkStateReader path=[/collections/testschemaapi] [configName]=[conf1] specified config exists in ZooKeeper
    [junit4] 2> 2858224 INFO (qtp26062370-41575) [n:127.0.0.1:60669_solr c:testschemaapi s:shard1 r:core_node1 x:testschemaapi_shard1_replica2] o.a.s.r.ManagedResourceStorage Setting up ZooKeeper-based storage for the RestManager with znodeBase: /configs/conf1
    [junit4] 2> 2858224 INFO (qtp16786663-41586) [n:127.0.0.1:60666_solr c:testschemaapi s:shard1 r:core_node2 x:testschemaapi_shard1_replica1] o.a.s.c.CoreContainer registering core: testschemaapi_shard1_replica1
    [junit4] 2> 2858224 INFO (qtp16786663-41586) [n:127.0.0.1:60666_solr c:testschemaapi s:shard1 r:core_node2 x:testschemaapi_shard1_replica1] o.a.s.c.ZkController Register replica - core:testschemaapi_shard1_replica1 address:http://127.0.0.1:60666/solr collection:testschemaapi shard:shard1
    [junit4] 2> 2858225 INFO (qtp26062370-41575) [n:127.0.0.1:60669_solr c:testschemaapi s:shard1 r:core_node1 x:testschemaapi_shard1_replica2] o.a.s.r.ManagedResourceStorage Configured ZooKeeperStorageIO with znodeBase: /configs/conf1
    [junit4] 2> 2858225 INFO (qtp26062370-41575) [n:127.0.0.1:60669_solr c:testschemaapi s:shard1 r:core_node1 x:testschemaapi_shard1_replica2] o.a.s.r.RestManager Initializing RestManager with initArgs: {}
    [junit4] 2> 2858225 INFO (qtp26062370-41575) [n:127.0.0.1:60669_solr c:testschemaapi s:shard1 r:core_node1 x:testschemaapi_shard1_replica2] o.a.s.r.ManagedResourceStorage Reading _rest_managed.json using ZooKeeperStorageIO:path=/configs/conf1
    [junit4] 2> 2858226 INFO (qtp26062370-41575) [n:127.0.0.1:60669_solr c:testschemaapi s:shard1 r:core_node1 x:testschemaapi_shard1_replica2] o.a.s.r.ManagedResourceStorage No data found for znode /configs/conf1/_rest_managed.json
    [junit4] 2> 2858226 INFO (qtp16786663-41586) [n:127.0.0.1:60666_solr c:testschemaapi s:shard1 r:core_node2 x:testschemaapi_shard1_replica1] o.a.s.c.c.SolrZkClient makePath: /collections/testschemaapi/leader_elect/shard1/election
    [junit4] 2> 2858226 INFO (qtp26062370-41575) [n:127.0.0.1:60669_solr c:testschemaapi s:shard1 r:core_node1 x:testschemaapi_shard1_replica2] o.a.s.r.ManagedResourceStorage Loaded null at path _rest_managed.json using ZooKeeperStorageIO:path=/configs/conf1
    [junit4] 2> 2858226 INFO (qtp26062370-41575) [n:127.0.0.1:60669_solr c:testschemaapi s:shard1 r:core_node1 x:testschemaapi_shard1_replica2] o.a.s.r.RestManager Initializing 0 registered ManagedResources
    [junit4] 2> 2858226 INFO (qtp26062370-41575) [n:127.0.0.1:60669_solr c:testschemaapi s:shard1 r:core_node1 x:testschemaapi_shard1_replica2] o.a.s.s.ZkIndexSchemaReader Creating ZooKeeper watch for the managed schema at /configs/conf1/managed-schema
    [junit4] 2> 2858227 INFO (qtp26062370-41575) [n:127.0.0.1:60669_solr c:testschemaapi s:shard1 r:core_node1 x:testschemaapi_shard1_replica2] o.a.s.c.ZkController Added new OnReconnect listener ZkIndexSchemaReader: /configs/conf1/managed-schema, uniqueCoreId: testschemaapi_shard1_replica2:277818356528417
    [junit4] 2> 2858227 INFO (qtp26062370-41575) [n:127.0.0.1:60669_solr c:testschemaapi s:shard1 r:core_node1 x:testschemaapi_shard1_replica2] o.a.s.h.ReplicationHandler Commits will be reserved for 10000
    [junit4] 2> 2858227 INFO (qtp26062370-41575) [n:127.0.0.1:60669_solr c:testschemaapi s:shard1 r:core_node1 x:testschemaapi_shard1_replica2] o.a.s.u.UpdateLog Looking up max value of version field to seed version buckets
    [junit4] 2> 2858227 INFO (qtp26062370-41575) [n:127.0.0.1:60669_solr c:testschemaapi s:shard1 r:core_node1 x:testschemaapi_shard1_replica2] o.a.s.u.VersionInfo Refreshing highest value of _version_ for 65536 version buckets from index
    [junit4] 2> 2858227 INFO (qtp26062370-41575) [n:127.0.0.1:60669_solr c:testschemaapi s:shard1 r:core_node1 x:testschemaapi_shard1_replica2] o.a.s.u.VersionInfo No terms found for _version_, cannot seed version bucket highest value from index
    [junit4] 2> 2858227 INFO (qtp26062370-41575) [n:127.0.0.1:60669_solr c:testschemaapi s:shard1 r:core_node1 x:testschemaapi_shard1_replica2] o.a.s.u.UpdateLog Could not find max version in index or recent updates, using new clock 1537260763990720512
    [junit4] 2> 2858227 INFO (searcherExecutor-10288-thread-1-processing-n:127.0.0.1:60669_solr x:testschemaapi_shard1_replica2 s:shard1 c:testschemaapi r:core_node1) [n:127.0.0.1:60669_solr c:testschemaapi s:shard1 r:core_node1 x:testschemaapi_shard1_replica2] o.a.s.c.SolrCore [testschemaapi_shard1_replica2] Registered new searcher Searcher@1879d5e[testschemaapi_shard1_replica2] main{ExitableDirectoryReader(UninvertingDirectoryReader())}
    [junit4] 2> 2858229 INFO (qtp26062370-41575) [n:127.0.0.1:60669_solr c:testschemaapi s:shard1 r:core_node1 x:testschemaapi_shard1_replica2] o.a.s.u.UpdateLog Took 1.0ms to seed version buckets with highest version 1537260763990720512
    [junit4] 2> 2858229 INFO (qtp26062370-41575) [n:127.0.0.1:60669_solr c:testschemaapi s:shard1 r:core_node1 x:testschemaapi_shard1_replica2] o.a.s.c.ZkController watch zkdir /configs/conf1
    [junit4] 2> 2858230 INFO (qtp26062370-41575) [n:127.0.0.1:60669_solr c:testschemaapi s:shard1 r:core_node1 x:testschemaapi_shard1_replica2] o.a.s.c.CoreContainer registering core: testschemaapi_shard1_replica2
    [junit4] 2> 2858230 INFO (qtp26062370-41575) [n:127.0.0.1:60669_solr c:testschemaapi s:shard1 r:core_node1 x:testschemaapi_shard1_replica2] o.a.s.c.ZkController Register replica - core:testschemaapi_shard1_replica2 address:http://127.0.0.1:60669/solr collection:testschemaapi shard:shard1
    [junit4] 2> 2858231 INFO (qtp26062370-41575) [n:127.0.0.1:60669_solr c:testschemaapi s:shard1 r:core_node1 x:testschemaapi_shard1_replica2] o.a.s.c.c.SolrZkClient makePath: /collections/testschemaapi/leader_elect/shard1/election
    [junit4] 2> 2858233 INFO (qtp16786663-41586) [n:127.0.0.1:60666_solr c:testschemaapi s:shard1 r:core_node2 x:testschemaapi_shard1_replica1] o.a.s.c.LeaderElector Joined leadership election with path: /collections/testschemaapi/leader_elect/shard1/election/96078797589774342-core_node2-n_0000000000
    [junit4] 2> 2858233 INFO (qtp16786663-41586) [n:127.0.0.1:60666_solr c:testschemaapi s:shard1 r:core_node2 x:testschemaapi_shard1_replica1] o.a.s.c.ShardLeaderElectionContext Running the leader process for shard=shard1 and weAreReplacement=false and leaderVoteWait=10000
    [junit4] 2> 2858233 INFO (qtp26062370-41575) [n:127.0.0.1:60669_solr c:testschemaapi s:shard1 r:core_node1 x:testschemaapi_shard1_replica2] o.a.s.c.LeaderElector Joined leadership election with path: /collections/testschemaapi/leader_elect/shard1/election/96078797589774341-core_node1-n_0000000001
    [junit4] 2> 2858234 INFO (qtp26062370-41575) [n:127.0.0.1:60669_solr c:testschemaapi s:shard1 r:core_node1 x:testschemaapi_shard1_replica2] o.a.s.c.LeaderElector Watching path /collections/testschemaapi/leader_elect/shard1/election/96078797589774342-core_node2-n_0000000000 to know if I could be the leader
    [junit4] 2> 2858235 INFO (qtp16786663-41586) [n:127.0.0.1:60666_solr c:testschemaapi s:shard1 r:core_node2 x:testschemaapi_shard1_replica1] o.a.s.c.ShardLeaderElectionContext Enough replicas found to continue.
    [junit4] 2> 2858235 INFO (qtp16786663-41586) [n:127.0.0.1:60666_solr c:testschemaapi s:shard1 r:core_node2 x:testschemaapi_shard1_replica1] o.a.s.c.ShardLeaderElectionContext I may be the new leader - try and sync
    [junit4] 2> 2858235 INFO (qtp16786663-41586) [n:127.0.0.1:60666_solr c:testschemaapi s:shard1 r:core_node2 x:testschemaapi_shard1_replica1] o.a.s.c.SyncStrategy Sync replicas to http://127.0.0.1:60666/solr/testschemaapi_shard1_replica1/
    [junit4] 2> 2858235 INFO (qtp16786663-41586) [n:127.0.0.1:60666_solr c:testschemaapi s:shard1 r:core_node2 x:testschemaapi_shard1_replica1] o.a.s.u.PeerSync PeerSync: core=testschemaapi_shard1_replica1 url=http://127.0.0.1:60666/solr START replicas=[http://127.0.0.1:60669/solr/testschemaapi_shard1_replica2/] nUpdates=100
    [junit4] 2> 2858235 INFO (qtp16786663-41586) [n:127.0.0.1:60666_solr c:testschemaapi s:shard1 r:core_node2 x:testschemaapi_shard1_replica1] o.a.s.u.PeerSync PeerSync: core=testschemaapi_shard1_replica1 url=http://127.0.0.1:60666/solr DONE. We have no versions. sync failed.
    [junit4] 2> 2858235 INFO (qtp16786663-41586) [n:127.0.0.1:60666_solr c:testschemaapi s:shard1 r:core_node2 x:testschemaapi_shard1_replica1] o.a.s.c.SyncStrategy Leader's attempt to sync with shard failed, moving to the next candidate
    [junit4] 2> 2858235 INFO (qtp16786663-41586) [n:127.0.0.1:60666_solr c:testschemaapi s:shard1 r:core_node2 x:testschemaapi_shard1_replica1] o.a.s.c.ShardLeaderElectionContext We failed sync, but we have no versions - we can't sync in that case - we were active before, so become leader anyway
    [junit4] 2> 2858235 INFO (OverseerStateUpdate-96078797589774342-127.0.0.1:60666_solr-n_0000000000) [n:127.0.0.1:60666_solr ] o.a.s.c.Overseer processMessage: queueSize: 1, message = {
    [junit4] 2> "operation":"leader",
    [junit4] 2> "shard":"shard1",
    [junit4] 2> "collection":"testschemaapi"} current state version: 0
    [junit4] 2> 2858236 INFO (qtp16786663-41586) [n:127.0.0.1:60666_solr c:testschemaapi s:shard1 r:core_node2 x:testschemaapi_shard1_replica1] o.a.s.c.c.SolrZkClient makePath: /collections/testschemaapi/leaders/shard1
    [junit4] 2> 2858239 INFO (qtp26062370-41573) [n:127.0.0.1:60669_solr c:testschemaapi s:shard1 r:core_node1 x:testschemaapi_shard1_replica2] o.a.s.c.S.Request [testschemaapi_shard1_replica2] webapp=/solr path=/get params={distrib=false&qt=/get&fingerprint=false&getVersions=100&wt=javabin&version=2} status=0 QTime=0
    [junit4] 2> 2858241 INFO (qtp16786663-41586) [n:127.0.0.1:60666_solr c:testschemaapi s:shard1 r:core_node2 x:testschemaapi_shard1_replica1] o.a.s.c.ShardLeaderElectionContextBase Creating leader registration node /collections/testschemaapi/leaders/shard1/leader after winning as /collections/testschemaapi/leader_elect/shard1/election/96078797589774342-core_node2-n_0000000000
    [junit4] 2> 2858243 INFO (qtp16786663-41586) [n:127.0.0.1:60666_solr c:testschemaapi s:shard1 r:core_node2 x:testschemaapi_shard1_replica1] o.a.s.c.ShardLeaderElectionContext I am the new leader: http://127.0.0.1:60666/solr/testschemaapi_shard1_replica1/ shard1
    [junit4] 2> 2858245 INFO (OverseerStateUpdate-96078797589774342-127.0.0.1:60666_solr-n_0000000000) [n:127.0.0.1:60666_solr ] o.a.s.c.Overseer processMessage: queueSize: 1, message = {
    [junit4] 2> "operation":"leader",
    [junit4] 2> "shard":"shard1",
    [junit4] 2> "collection":"testschemaapi",
    [junit4] 2> "base_url":"http://127.0.0.1:60666/solr",
    [junit4] 2> "core":"testschemaapi_shard1_replica1",
    [junit4] 2> "state":"active"} current state version: 0
    [junit4] 2> 2858348 INFO (OverseerStateUpdate-96078797589774342-127.0.0.1:60666_solr-n_0000000000) [n:127.0.0.1:60666_solr ] o.a.s.c.o.ZkStateWriter going to update_collection /collections/testschemaapi/state.json version: 1
    [junit4] 2> 2858349 INFO (zkCallback-9331-thread-2-processing-n:127.0.0.1:60666_solr) [n:127.0.0.1:60666_solr ] o.a.s.c.c.ZkStateReader A cluster state change: [WatchedEvent state:SyncConnected type:NodeDataChanged path:/collections/testschemaapi/state.json] for collection [testschemaapi] has occurred - updating... (live nodes size: [2])
    [junit4] 2> 2858349 INFO (zkCallback-9330-thread-1-processing-n:127.0.0.1:60669_solr) [n:127.0.0.1:60669_solr ] o.a.s.c.c.ZkStateReader A cluster state change: [WatchedEvent state:SyncConnected type:NodeDataChanged path:/collections/testschemaapi/state.json] for collection [testschemaapi] has occurred - updating... (live nodes size: [2])
    [junit4] 2> 2858350 INFO (zkCallback-9331-thread-2-processing-n:127.0.0.1:60666_solr) [n:127.0.0.1:60666_solr ] o.a.s.c.c.ZkStateReader Updating data for [testschemaapi] from [1] to [2]
    [junit4] 2> 2858350 INFO (zkCallback-9330-thread-1-processing-n:127.0.0.1:60669_solr) [n:127.0.0.1:60669_solr ] o.a.s.c.c.ZkStateReader Updating data for [testschemaapi] from [1] to [2]
    [junit4] 2> 2858397 INFO (qtp16786663-41586) [n:127.0.0.1:60666_solr c:testschemaapi s:shard1 r:core_node2 x:testschemaapi_shard1_replica1] o.a.s.c.ZkController We are http://127.0.0.1:60666/solr/testschemaapi_shard1_replica1/ and leader is http://127.0.0.1:60666/solr/testschemaapi_shard1_replica1/
    [junit4] 2> 2858397 INFO (qtp16786663-41586) [n:127.0.0.1:60666_solr c:testschemaapi s:shard1 r:core_node2 x:testschemaapi_shard1_replica1] o.a.s.c.ZkController No LogReplay needed for core=testschemaapi_shard1_replica1 baseURL=http://127.0.0.1:60666/solr
    [junit4] 2> 2858397 INFO (qtp16786663-41586) [n:127.0.0.1:60666_solr c:testschemaapi s:shard1 r:core_node2 x:testschemaapi_shard1_replica1] o.a.s.c.ZkController I am the leader, no recovery necessary
    [junit4] 2> 2858397 INFO (qtp16786663-41586) [n:127.0.0.1:60666_solr c:testschemaapi s:shard1 r:core_node2 x:testschemaapi_shard1_replica1] o.a.s.c.ZkController publishing state=active
    [junit4] 2> 2858399 INFO (OverseerStateUpdate-96078797589774342-127.0.0.1:60666_solr-n_0000000000) [n:127.0.0.1:60666_solr ] o.a.s.c.Overseer processMessage: queueSize: 1, message = {
    [junit4] 2> "core":"testschemaapi_shard1_replica1",
    [junit4] 2> "core_node_name":"core_node2",
    [junit4] 2> "roles":null,
    [junit4] 2> "base_url":"http://127.0.0.1:60666/solr",
    [junit4] 2> "node_name":"127.0.0.1:60666_solr",
    [junit4] 2> "numShards":"1",
    [junit4] 2> "state":"active",
    [junit4] 2> "shard":"shard1",
    [junit4] 2> "collection":"testschemaapi",
    [junit4] 2> "operation":"state"} current state version: 0
    [junit4] 2> 2858399 INFO (OverseerStateUpdate-96078797589774342-127.0.0.1:60666_solr-n_0000000000) [n:127.0.0.1:60666_solr ] o.a.s.c.o.ReplicaMutator Update state numShards=1 message={
    [junit4] 2> "core":"testschemaapi_shard1_replica1",
    [junit4] 2> "core_node_name":"core_node2",
    [junit4] 2> "roles":null,
    [junit4] 2> "base_url":"http://127.0.0.1:60666/solr",
    [junit4] 2> "node_name":"127.0.0.1:60666_solr",
    [junit4] 2> "numShards":"1",
    [junit4] 2> "state":"active",
    [junit4] 2> "shard":"shard1",
    [junit4] 2> "collection":"testschemaapi",
    [junit4] 2> "operation":"state"}
    [junit4] 2> 2858401 INFO (qtp16786663-41586) [n:127.0.0.1:60666_solr c:testschemaapi s:shard1 r:core_node2 x:testschemaapi_shard1_replica1] o.a.s.s.HttpSolrCall [admin] webapp=null path=/admin/cores params={qt=/admin/cores&collection.configName=conf1&name=testschemaapi_shard1_replica1&action=CREATE&numShards=1&collection=testschemaapi&shard=shard1&wt=javabin&version=2} status=0 QTime=1230
    [junit4] 2> 2858502 INFO (OverseerStateUpdate-96078797589774342-127.0.0.1:60666_solr-n_0000000000) [n:127.0.0.1:60666_solr ] o.a.s.c.o.ZkStateWriter going to update_collection /collections/testschemaapi/state.json version: 2
    [junit4] 2> 2858503 INFO (zkCallback-9331-thread-3-processing-n:127.0.0.1:60666_solr) [n:127.0.0.1:60666_solr ] o.a.s.c.c.ZkStateReader A cluster state change: [WatchedEvent state:SyncConnected type:NodeDataChanged path:/collections/testschemaapi/state.json] for collection [testschemaapi] has occurred - updating... (live nodes size: [2])
    [junit4] 2> 2858503 INFO (zkCallback-9331-thread-3-processing-n:127.0.0.1:60666_solr) [n:127.0.0.1:60666_solr ] o.a.s.c.c.ZkStateReader Updating data for [testschemaapi] from [2] to [3]
    [junit4] 2> 2858504 INFO (zkCallback-9330-thread-1-processing-n:127.0.0.1:60669_solr) [n:127.0.0.1:60669_solr ] o.a.s.c.c.ZkStateReader A cluster state change: [WatchedEvent state:SyncConnected type:NodeDataChanged path:/collections/testschemaapi/state.json] for collection [testschemaapi] has occurred - updating... (live nodes size: [2])
    [junit4] 2> 2858504 INFO (zkCallback-9330-thread-1-processing-n:127.0.0.1:60669_solr) [n:127.0.0.1:60669_solr ] o.a.s.c.c.ZkStateReader Updating data for [testschemaapi] from

[...truncated too long message...]

p\solr.schema.TestManagedSchemaAPI_D9B7FAB906BB7F1A-001\tempDir-001\node1\.\testschemaapi_shard1_replica2\data\index
    [junit4] 2> 2868623 WARN (Thread-6719) [n:127.0.0.1:60669_solr c:testschemaapi s:shard1 r:core_node1 x:testschemaapi_shard1_replica2] o.a.s.c.ZkController listener throws error
    [junit4] 2> org.apache.solr.common.SolrException: Unable to reload core [testschemaapi_shard1_replica2]
    [junit4] 2> at org.apache.solr.core.CoreContainer.reload(CoreContainer.java:920)
    [junit4] 2> at org.apache.solr.core.SolrCore.lambda$getConfListener$6(SolrCore.java:2510)
    [junit4] 2> at org.apache.solr.cloud.ZkController$4.run(ZkController.java:2408)
    [junit4] 2> Caused by: org.apache.solr.common.SolrException: Could not find config name for collection:testschemaapi
    [junit4] 2> at org.apache.solr.core.SolrCore.<init>(SolrCore.java:773)
    [junit4] 2> at org.apache.solr.core.SolrCore.reload(SolrCore.java:462)
    [junit4] 2> at org.apache.solr.core.CoreContainer.reload(CoreContainer.java:914)
    [junit4] 2> ... 2 more
    [junit4] 2> Caused by: org.apache.solr.common.SolrException: Could not find config name for collection:testschemaapi
    [junit4] 2> at org.apache.solr.rest.ManagedResourceStorage.newStorageIO(ManagedResourceStorage.java:101)
    [junit4] 2> at org.apache.solr.core.SolrCore.initRestManager(SolrCore.java:2305)
    [junit4] 2> at org.apache.solr.core.SolrCore.<init>(SolrCore.java:749)
    [junit4] 2> ... 4 more
    [junit4] 2> Jun 16, 2016 3:01:58 AM com.carrotsearch.randomizedtesting.ThreadLeakControl checkThreadLeaks
    [junit4] 2> WARNING: Will linger awaiting termination of 3 leaked thread(s).
    [junit4] 2> NOTE: test params are: codec=Lucene60, sim=ClassicSimilarity, locale=es-BO, timezone=Africa/Juba
    [junit4] 2> NOTE: Windows 10 10.0 x86/Oracle Corporation 1.8.0_92 (32-bit)/cpus=3,threads=1,free=249682176,total=518979584
    [junit4] 2> NOTE: All tests run in this JVM: [TestFunctionQuery, TestExceedMaxTermLength, InfoHandlerTest, HighlighterMaxOffsetTest, TestShardHandlerFactory, BadComponentTest, TestManagedSchema, TestDocumentBuilder, PathHierarchyTokenizerFactoryTest, DeleteLastCustomShardedReplicaTest, DistributedSpellCheckComponentTest, TestSolr4Spatial2, QueryEqualityTest, FastVectorHighlighterTest, TestClassicSimilarityFactory, SolrXmlInZkTest, TestStressLucene, ConcurrentDeleteAndCreateCollectionTest, TolerantUpdateProcessorTest, TestInitQParser, RulesTest, ConjunctionSolrSpellCheckerTest, MoreLikeThisHandlerTest, BufferStoreTest, TestSimpleQParserPlugin, TestReRankQParserPlugin, TestIBSimilarityFactory, TestXIncludeConfig, HdfsThreadLeakTest, DistributedFacetPivotSmallTest, SharedFSAutoReplicaFailoverTest, DocumentBuilderTest, UpdateParamsTest, TestFieldTypeResource, SegmentsInfoRequestHandlerTest, RecoveryZkTest, ClusterStateUpdateTest, TestExtendedDismaxParser, HdfsLockFactoryTest, TestConfigSetProperties, OverseerStatusTest, TestJmxMonitoredMap, TestCoreContainer, JSONWriterTest, ChaosMonkeyNothingIsSafeTest, AnalysisErrorHandlingTest, IndexSchemaTest, TestRemoteStreaming, TestDefaultStatsCache, DistributedVersionInfoTest, TestSweetSpotSimilarityFactory, TestRawResponseWriter, DirectUpdateHandlerTest, HighlighterTest, TestCloudManagedSchema, TestSha256AuthenticationProvider, TestAnalyzedSuggestions, ShardRoutingTest, TestSearchPerf, CollectionStateFormat2Test, SimpleFacetsTest, ReplicationFactorTest, SyncSliceTest, TestStandardQParsers, RecoveryAfterSoftCommitTest, TestDynamicFieldResource, TestRequestStatusCollectionAPI, MigrateRouteKeyTest, HdfsUnloadDistributedZkTest, TestDistributedSearch, TestOverriddenPrefixQueryForCustomFieldType, TestEmbeddedSolrServerConstructors, BlockCacheTest, RollingRestartTest, QueryElevationComponentTest, TestDynamicLoading, TestWordDelimiterFilterFactory, XsltUpdateRequestHandlerTest, TestComponentsName, TriLevelCompositeIdRoutingTest, TestPostingsSolrHighlighter, TestReplicaProperties, TestStressReorder, OutOfBoxZkACLAndCredentialsProvidersTest, DocValuesTest, RequestLoggingTest, TestDefaultSearchFieldResource, TestUniqueKeyFieldResource, LeaderInitiatedRecoveryOnCommitTest, TestNumericTerms32, DirectSolrSpellCheckerTest, TestCloudBackupRestore, LeaderElectionTest, TestConfigReload, CdcrReplicationDistributedZkTest, SliceStateTest, TestSolrDynamicMBean, SortSpecParsingTest, SuggestComponentTest, OverseerCollectionConfigSetProcessorTest, TestGraphTermsQParserPlugin, TestManagedSynonymFilterFactory, HardAutoCommitTest, TestMacros, TestJmxIntegration, TestLRUCache, TestFieldCacheSortRandom, BigEndianAscendingWordSerializerTest, TestElisionMultitermQuery, SOLR749Test, SpatialRPTFieldTypeTest, AsyncMigrateRouteKeyTest, ClusterStateTest, TestOrdValues, DocumentAnalysisRequestHandlerTest, DocValuesMissingTest, TestFreeTextSuggestions, DirectoryFactoryTest, TestPhraseSuggestions, CircularListTest, TestJsonFacets, TestDFRSimilarityFactory, DocValuesMultiTest, TestCursorMarkWithoutUniqueKey, SolrRequestParserTest, TestTestInjection, SparseHLLTest, TestReloadDeadlock, TestMergePolicyConfig, TestSort, PrimUtilsTest, TestUseDocValuesAsStored2, TestStressVersions, TestDocSet, TestNonDefinedSimilarityFactory, TestDownShardTolerantSearch, TestLFUCache, DistributedFacetPivotLongTailTest, TestSurroundQueryParser, TestSolrCloudWithKerberosAlt, ZkStateReaderTest, UUIDFieldTest, StressHdfsTest, BasicDistributedZkTest, UnloadDistributedZkTest, CollectionsAPIDistributedZkTest, AutoCommitTest, TestFaceting, TestHashPartitioner, ZkControllerTest, TestRangeQuery, TestSolr4Spatial, TestGroupingSearch, PeerSyncTest, TestBadConfig, SoftAutoCommitTest, ShowFileRequestHandlerTest, CurrencyFieldOpenExchangeTest, CurrencyFieldXmlFileTest, SolrIndexSplitterTest, SimplePostToolTest, AnalysisAfterCoreReloadTest, SignatureUpdateProcessorFactoryTest, SuggesterFSTTest, SuggesterTest, TestCSVLoader, PolyFieldTest, SchemaVersionSpecificBehaviorTest, TestUpdate, TestAtomicUpdateErrorCases, DefaultValueUpdateProcessorTest, TestSolrDeletionPolicy1, DebugComponentTest, IndexBasedSpellCheckerTest, TestReversedWildcardFilterFactory, TestOmitPositions, TermsComponentTest, XmlUpdateRequestHandlerTest, TestIndexingPerformance, TestArbitraryIndexDir, RegexBoostProcessorTest, TestCollationField, MBeansHandlerTest, JsonLoaderTest, CSVRequestHandlerTest, SearchHandlerTest, TestSolrIndexConfig, CopyFieldTest, MultiTermTest, SampleTest, TestBinaryField, ExternalFileFieldSortTest, TestSolrCoreProperties, TestLuceneMatchVersion, EchoParamsTest, TestPerFieldSimilarity, TestLMDirichletSimilarityFactory, TestLMJelinekMercerSimilarityFactory, TimeZoneUtilsTest, TestFastOutputStream, URLClassifyProcessorTest, DistributedIntervalFacetingTest, ActionThrottleTest, AliasIntegrationTest, CollectionsAPIAsyncDistributedZkTest, ConnectionManagerTest, CreateCollectionCleanupTest, CustomCollectionTest, DistribCursorPagingTest, DistribJoinFromCollectionTest, HttpPartitionTest, SimpleCollectionCreateDeleteTest, TestCloudInspectUtil, TestCloudPivotFacet, TestCollectionAPI, TestDistribDocBasedVersion, TestLockTree, TestMiniSolrCloudCluster, TestMiniSolrCloudClusterSSL, TestRebalanceLeaders, TestShortCircuitedRequests, TestStressLiveNodes, TestRestoreCore, TestSQLHandler, CoreAdminCreateDiscoverTest, CoreAdminRequestStatusTest, CoreMergeIndexesAdminHandlerTest, SecurityConfHandlerTest, DistributedDebugComponentTest, DistributedExpandComponentTest, DistributedFacetPivotWhiteBoxTest, DistributedQueryComponentCustomSortTest, DistributedSuggestComponentTest, SuggestComponentContextFilterQueryTest, TestDistributedStatsComponentCardinality, TestDynamicFieldCollectionResource, TestFieldCollectionResource, TestFieldResource, TestFieldTypeCollectionResource, TestSchemaNameResource, TestSchemaSimilarityResource, TestSerializedLuceneMatchVersion, BadCopyFieldTest, TestCollationFieldDocValues, TestManagedSchemaAPI]
    [junit4] 2> NOTE: reproduce with: ant test -Dtestcase=TestManagedSchemaAPI -Dtests.seed=D9B7FAB906BB7F1A -Dtests.slow=true -Dtests.locale=es-BO -Dtests.timezone=Africa/Juba -Dtests.asserts=true -Dtests.file.encoding=US-ASCII
    [junit4] ERROR 0.00s J0 | TestManagedSchemaAPI (suite) <<<
    [junit4] > Throwable #1: java.lang.AssertionError: ObjectTracker found 2 object(s) that were not released!!! [MockDirectoryWrapper, MockDirectoryWrapper]
    [junit4] > at __randomizedtesting.SeedInfo.seed([D9B7FAB906BB7F1A]:0)
    [junit4] > at org.apache.solr.SolrTestCaseJ4.teardownTestCases(SolrTestCaseJ4.java:257)
    [junit4] > at java.lang.Thread.run(Thread.java:745)
    [junit4] Completed [551/614 (1!)] on J0 in 13.37s, 1 test, 1 failure <<< FAILURES!

[...truncated 207 lines...]
BUILD FAILED
C:\Users\jenkins\workspace\Lucene-Solr-6.1-Windows\build.xml:740: The following error occurred while executing this line:
C:\Users\jenkins\workspace\Lucene-Solr-6.1-Windows\build.xml:684: The following error occurred while executing this line:
C:\Users\jenkins\workspace\Lucene-Solr-6.1-Windows\build.xml:59: The following error occurred while executing this line:
C:\Users\jenkins\workspace\Lucene-Solr-6.1-Windows\solr\build.xml:233: The following error occurred while executing this line:
C:\Users\jenkins\workspace\Lucene-Solr-6.1-Windows\solr\common-build.xml:531: The following error occurred while executing this line:
C:\Users\jenkins\workspace\Lucene-Solr-6.1-Windows\lucene\common-build.xml:1427: The following error occurred while executing this line:
C:\Users\jenkins\workspace\Lucene-Solr-6.1-Windows\lucene\common-build.xml:984: There were test failures: 614 suites (10 ignored), 2580 tests, 1 suite-level error, 127 ignored (83 assumptions) [seed: D9B7FAB906BB7F1A]

Total time: 73 minutes 16 seconds
Build step 'Invoke Ant' marked build as failure
Archiving artifacts
[WARNINGS] Skipping publisher since build result is FAILURE
Recording test results
Email was triggered for: Failure - Any
Sending email for trigger: Failure - Any

Search Discussions

Discussion Posts

Previous

Follow ups

Related Discussions

Discussion Navigation
viewthread | post
posts ‹ prev | 3 of 4 | next ›
Discussion Overview
groupdev @
categorieslucene
postedJun 15, '16 at 4:38a
activeJun 16, '16 at 2:17p
posts4
users1
websitelucene.apache.org

1 user in discussion

Policeman Jenkins Server: 4 posts

People

Translate

site design / logo © 2017 Grokbase