Grokbase Groups Lucene dev June 2016
FAQ
Build: http://jenkins.thetaphi.de/job/Lucene-Solr-master-Solaris/652/
Java: 64bit/jdk1.8.0 -XX:+UseCompressedOops -XX:+UseSerialGC

2 tests failed.
FAILED: org.apache.solr.handler.component.SpatialHeatmapFacetsTest.test

Error Message:
Test abandoned because suite timeout was reached.

Stack Trace:
java.lang.Exception: Test abandoned because suite timeout was reached.
  at __randomizedtesting.SeedInfo.seed([84B7C7CDA2E33448]:0)


FAILED: junit.framework.TestSuite.org.apache.solr.handler.component.SpatialHeatmapFacetsTest

Error Message:
Suite timeout exceeded (>= 7200000 msec).

Stack Trace:
java.lang.Exception: Suite timeout exceeded (>= 7200000 msec).
  at __randomizedtesting.SeedInfo.seed([84B7C7CDA2E33448]:0)




Build Log:
[...truncated 12181 lines...]
    [junit4] Suite: org.apache.solr.handler.component.SpatialHeatmapFacetsTest
    [junit4] 2> Creating dataDir: /export/home/jenkins/workspace/Lucene-Solr-master-Solaris/solr/build/solr-core/test/J0/temp/solr.handler.component.SpatialHeatmapFacetsTest_84B7C7CDA2E33448-001/init-core-data-001
    [junit4] 2> 343524 INFO (SUITE-SpatialHeatmapFacetsTest-seed#[84B7C7CDA2E33448]-worker) [ ] o.a.s.SolrTestCaseJ4 Randomized ssl (false) and clientAuth (false) via: @org.apache.solr.util.RandomizeSSL(reason=, value=NaN, ssl=NaN, clientAuth=NaN)
    [junit4] 2> 343525 INFO (SUITE-SpatialHeatmapFacetsTest-seed#[84B7C7CDA2E33448]-worker) [ ] o.a.s.BaseDistributedSearchTestCase Setting hostContext system property: /
    [junit4] 2> 344189 INFO (TEST-SpatialHeatmapFacetsTest.testPng-seed#[84B7C7CDA2E33448]) [ ] o.a.s.SolrTestCaseJ4 Writing core.properties file to /export/home/jenkins/workspace/Lucene-Solr-master-Solaris/solr/build/solr-core/test/J0/temp/solr.handler.component.SpatialHeatmapFacetsTest_84B7C7CDA2E33448-001/tempDir-001/control/cores/collection1
    [junit4] 2> 344191 INFO (TEST-SpatialHeatmapFacetsTest.testPng-seed#[84B7C7CDA2E33448]) [ ] o.e.j.s.Server jetty-9.3.8.v20160314
    [junit4] 2> 344194 INFO (TEST-SpatialHeatmapFacetsTest.testPng-seed#[84B7C7CDA2E33448]) [ ] o.e.j.s.h.ContextHandler Started o.e.j.s.ServletContextHandler@3a75e996{/,null,AVAILABLE}
    [junit4] 2> 344200 INFO (TEST-SpatialHeatmapFacetsTest.testPng-seed#[84B7C7CDA2E33448]) [ ] o.e.j.s.ServerConnector Started ServerConnector@4daaa0b8{HTTP/1.1,[http/1.1]}{127.0.0.1:55782}
    [junit4] 2> 344200 INFO (TEST-SpatialHeatmapFacetsTest.testPng-seed#[84B7C7CDA2E33448]) [ ] o.e.j.s.Server Started @347819ms
    [junit4] 2> 344200 INFO (TEST-SpatialHeatmapFacetsTest.testPng-seed#[84B7C7CDA2E33448]) [ ] o.a.s.c.s.e.JettySolrRunner Jetty properties: {schema=schema-spatial.xml, solrconfig=solrconfig-basic.xml, hostContext=/, hostPort=55782, coreRootDirectory=/export/home/jenkins/workspace/Lucene-Solr-master-Solaris/solr/build/solr-core/test/J0/temp/solr.handler.component.SpatialHeatmapFacetsTest_84B7C7CDA2E33448-001/tempDir-001/control/cores}
    [junit4] 2> 344201 INFO (TEST-SpatialHeatmapFacetsTest.testPng-seed#[84B7C7CDA2E33448]) [ ] o.a.s.s.SolrDispatchFilter SolrDispatchFilter.init(): sun.misc.Launcher$AppClassLoader@6d06d69c
    [junit4] 2> 344201 INFO (TEST-SpatialHeatmapFacetsTest.testPng-seed#[84B7C7CDA2E33448]) [ ] o.a.s.c.SolrResourceLoader new SolrResourceLoader for directory: '/export/home/jenkins/workspace/Lucene-Solr-master-Solaris/solr/build/solr-core/test/J0/temp/solr.handler.component.SpatialHeatmapFacetsTest_84B7C7CDA2E33448-001/tempDir-001/control'
    [junit4] 2> 344201 INFO (TEST-SpatialHeatmapFacetsTest.testPng-seed#[84B7C7CDA2E33448]) [ ] o.a.s.c.SolrResourceLoader JNDI not configured for solr (NoInitialContextEx)
    [junit4] 2> 344201 INFO (TEST-SpatialHeatmapFacetsTest.testPng-seed#[84B7C7CDA2E33448]) [ ] o.a.s.c.SolrResourceLoader solr home defaulted to 'solr/' (could not find system property or JNDI)
    [junit4] 2> 344201 INFO (TEST-SpatialHeatmapFacetsTest.testPng-seed#[84B7C7CDA2E33448]) [ ] o.a.s.c.SolrXmlConfig Loading container configuration from /export/home/jenkins/workspace/Lucene-Solr-master-Solaris/solr/build/solr-core/test/J0/temp/solr.handler.component.SpatialHeatmapFacetsTest_84B7C7CDA2E33448-001/tempDir-001/control/solr.xml
    [junit4] 2> 344208 INFO (TEST-SpatialHeatmapFacetsTest.testPng-seed#[84B7C7CDA2E33448]) [ ] o.a.s.c.CorePropertiesLocator Config-defined core root directory: /export/home/jenkins/workspace/Lucene-Solr-master-Solaris/solr/build/solr-core/test/J0/temp/solr.handler.component.SpatialHeatmapFacetsTest_84B7C7CDA2E33448-001/tempDir-001/control/cores
    [junit4] 2> 344208 INFO (TEST-SpatialHeatmapFacetsTest.testPng-seed#[84B7C7CDA2E33448]) [ ] o.a.s.c.CoreContainer New CoreContainer 1597717563
    [junit4] 2> 344208 INFO (TEST-SpatialHeatmapFacetsTest.testPng-seed#[84B7C7CDA2E33448]) [ ] o.a.s.c.CoreContainer Loading cores into CoreContainer [instanceDir=/export/home/jenkins/workspace/Lucene-Solr-master-Solaris/solr/build/solr-core/test/J0/temp/solr.handler.component.SpatialHeatmapFacetsTest_84B7C7CDA2E33448-001/tempDir-001/control]
    [junit4] 2> 344208 WARN (TEST-SpatialHeatmapFacetsTest.testPng-seed#[84B7C7CDA2E33448]) [ ] o.a.s.c.CoreContainer Couldn't add files from /export/home/jenkins/workspace/Lucene-Solr-master-Solaris/solr/build/solr-core/test/J0/temp/solr.handler.component.SpatialHeatmapFacetsTest_84B7C7CDA2E33448-001/tempDir-001/control/lib to classpath: /export/home/jenkins/workspace/Lucene-Solr-master-Solaris/solr/build/solr-core/test/J0/temp/solr.handler.component.SpatialHeatmapFacetsTest_84B7C7CDA2E33448-001/tempDir-001/control/lib
    [junit4] 2> 344208 INFO (TEST-SpatialHeatmapFacetsTest.testPng-seed#[84B7C7CDA2E33448]) [ ] o.a.s.h.c.HttpShardHandlerFactory created with socketTimeout : 90000,urlScheme : ,connTimeout : 15000,maxConnectionsPerHost : 20,maxConnections : 10000,corePoolSize : 0,maximumPoolSize : 2147483647,maxThreadIdleTime : 5,sizeOfQueue : -1,fairnessPolicy : false,
    [junit4] 2> 344210 INFO (TEST-SpatialHeatmapFacetsTest.testPng-seed#[84B7C7CDA2E33448]) [ ] o.a.s.u.UpdateShardHandler Creating UpdateShardHandler HTTP client with params:
    [junit4] 2> 344212 INFO (TEST-SpatialHeatmapFacetsTest.testPng-seed#[84B7C7CDA2E33448]) [ ] o.a.s.l.LogWatcher SLF4J impl is org.slf4j.impl.Log4jLoggerFactory
    [junit4] 2> 344212 INFO (TEST-SpatialHeatmapFacetsTest.testPng-seed#[84B7C7CDA2E33448]) [ ] o.a.s.l.LogWatcher Registering Log Listener [Log4j (org.slf4j.impl.Log4jLoggerFactory)]
    [junit4] 2> 344212 INFO (TEST-SpatialHeatmapFacetsTest.testPng-seed#[84B7C7CDA2E33448]) [ ] o.a.s.c.CoreContainer Security conf doesn't exist. Skipping setup for authorization module.
    [junit4] 2> 344212 INFO (TEST-SpatialHeatmapFacetsTest.testPng-seed#[84B7C7CDA2E33448]) [ ] o.a.s.c.CoreContainer No authentication plugin used.
    [junit4] 2> 344213 INFO (TEST-SpatialHeatmapFacetsTest.testPng-seed#[84B7C7CDA2E33448]) [ ] o.a.s.c.CorePropertiesLocator Looking for core definitions underneath /export/home/jenkins/workspace/Lucene-Solr-master-Solaris/solr/build/solr-core/test/J0/temp/solr.handler.component.SpatialHeatmapFacetsTest_84B7C7CDA2E33448-001/tempDir-001/control/cores
    [junit4] 2> 344214 INFO (TEST-SpatialHeatmapFacetsTest.testPng-seed#[84B7C7CDA2E33448]) [ ] o.a.s.c.CoreDescriptor Created CoreDescriptor: {name=collection1, config=solrconfig-basic.xml, loadOnStartup=true, schema=schema-spatial.xml, configSetProperties=configsetprops.json, transient=false, dataDir=data/, configSet=collection1}
    [junit4] 2> 344214 INFO (TEST-SpatialHeatmapFacetsTest.testPng-seed#[84B7C7CDA2E33448]) [ ] o.a.s.c.CorePropertiesLocator Found core collection1 in /export/home/jenkins/workspace/Lucene-Solr-master-Solaris/solr/build/solr-core/test/J0/temp/solr.handler.component.SpatialHeatmapFacetsTest_84B7C7CDA2E33448-001/tempDir-001/control/cores/collection1
    [junit4] 2> 344214 INFO (TEST-SpatialHeatmapFacetsTest.testPng-seed#[84B7C7CDA2E33448]) [ ] o.a.s.c.CorePropertiesLocator Found 1 core definitions
    [junit4] 2> 344215 INFO (coreLoadExecutor-1076-thread-1) [ ] o.a.s.c.SolrResourceLoader new SolrResourceLoader for directory: '/export/home/jenkins/workspace/Lucene-Solr-master-Solaris/solr/core/src/test-files/solr/collection1'
    [junit4] 2> 344215 INFO (TEST-SpatialHeatmapFacetsTest.testPng-seed#[84B7C7CDA2E33448]) [ ] o.a.s.s.SolrDispatchFilter user.dir=/export/home/jenkins/workspace/Lucene-Solr-master-Solaris/solr/build/solr-core/test/J0
    [junit4] 2> 344216 INFO (TEST-SpatialHeatmapFacetsTest.testPng-seed#[84B7C7CDA2E33448]) [ ] o.a.s.s.SolrDispatchFilter SolrDispatchFilter.init() done
    [junit4] 2> 344216 INFO (coreLoadExecutor-1076-thread-1) [ ] o.a.s.c.SolrResourceLoader JNDI not configured for solr (NoInitialContextEx)
    [junit4] 2> 344217 INFO (coreLoadExecutor-1076-thread-1) [ ] o.a.s.c.SolrResourceLoader solr home defaulted to 'solr/' (could not find system property or JNDI)
    [junit4] 2> 344217 INFO (coreLoadExecutor-1076-thread-1) [ ] o.a.s.c.SolrResourceLoader Adding 'file:/export/home/jenkins/workspace/Lucene-Solr-master-Solaris/solr/core/src/test-files/solr/collection1/lib/classes/' to classloader
    [junit4] 2> 344217 INFO (coreLoadExecutor-1076-thread-1) [ ] o.a.s.c.SolrResourceLoader Adding 'file:/export/home/jenkins/workspace/Lucene-Solr-master-Solaris/solr/core/src/test-files/solr/collection1/lib/README' to classloader
    [junit4] 2> 344254 INFO (coreLoadExecutor-1076-thread-1) [ ] o.a.s.c.SolrConfig current version of requestparams : -1
    [junit4] 2> 344255 WARN (coreLoadExecutor-1076-thread-1) [ ] o.a.s.c.Config Beginning with Solr 5.5, <mergePolicy> is deprecated, use <mergePolicyFactory> instead.
    [junit4] 2> 344257 INFO (coreLoadExecutor-1076-thread-1) [ ] o.a.s.c.SolrConfig Using Lucene MatchVersion: 7.0.0
    [junit4] 2> 344261 INFO (coreLoadExecutor-1076-thread-1) [ ] o.a.s.c.SolrConfig Loaded SolrConfig: solrconfig-basic.xml
    [junit4] 2> 344264 INFO (coreLoadExecutor-1076-thread-1) [ ] o.a.s.s.IndexSchema [collection1] Schema name=test
    [junit4] 2> 344358 INFO (coreLoadExecutor-1076-thread-1) [ ] o.a.s.s.IndexSchema unique key field: id
    [junit4] 2> 344361 INFO (coreLoadExecutor-1076-thread-1) [ ] o.a.s.c.ConfigSetProperties Did not find ConfigSet properties, assuming default properties: Can't find resource 'configsetprops.json' in classpath or '/export/home/jenkins/workspace/Lucene-Solr-master-Solaris/solr/core/src/test-files/solr/collection1'
    [junit4] 2> 344361 INFO (coreLoadExecutor-1076-thread-1) [ ] o.a.s.c.CoreContainer Creating SolrCore 'collection1' using configuration from configset /export/home/jenkins/workspace/Lucene-Solr-master-Solaris/solr/core/src/test-files/solr/collection1
    [junit4] 2> 344361 INFO (coreLoadExecutor-1076-thread-1) [ x:collection1] o.a.s.c.SolrCore org.apache.solr.core.MockDirectoryFactory
    [junit4] 2> 344361 INFO (coreLoadExecutor-1076-thread-1) [ x:collection1] o.a.s.c.SolrCore [[collection1] ] Opening new SolrCore at [/export/home/jenkins/workspace/Lucene-Solr-master-Solaris/solr/core/src/test-files/solr/collection1], dataDir=[/export/home/jenkins/workspace/Lucene-Solr-master-Solaris/solr/build/solr-core/test/J0/temp/solr.handler.component.SpatialHeatmapFacetsTest_84B7C7CDA2E33448-001/tempDir-001/control/cores/collection1/data/]
    [junit4] 2> 344361 INFO (coreLoadExecutor-1076-thread-1) [ x:collection1] o.a.s.c.SolrCore JMX monitoring not detected for core: collection1
    [junit4] 2> 344361 INFO (coreLoadExecutor-1076-thread-1) [ x:collection1] o.a.s.c.CachingDirectoryFactory return new directory for /export/home/jenkins/workspace/Lucene-Solr-master-Solaris/solr/build/solr-core/test/J0/temp/solr.handler.component.SpatialHeatmapFacetsTest_84B7C7CDA2E33448-001/tempDir-001/control/cores/collection1/data
    [junit4] 2> 344361 INFO (coreLoadExecutor-1076-thread-1) [ x:collection1] o.a.s.c.SolrCore New index directory detected: old=null new=/export/home/jenkins/workspace/Lucene-Solr-master-Solaris/solr/build/solr-core/test/J0/temp/solr.handler.component.SpatialHeatmapFacetsTest_84B7C7CDA2E33448-001/tempDir-001/control/cores/collection1/data/index/
    [junit4] 2> 344362 WARN (coreLoadExecutor-1076-thread-1) [ x:collection1] o.a.s.c.SolrCore [collection1] Solr index directory '/export/home/jenkins/workspace/Lucene-Solr-master-Solaris/solr/build/solr-core/test/J0/temp/solr.handler.component.SpatialHeatmapFacetsTest_84B7C7CDA2E33448-001/tempDir-001/control/cores/collection1/data/index' doesn't exist. Creating new index...
    [junit4] 2> 344362 INFO (coreLoadExecutor-1076-thread-1) [ x:collection1] o.a.s.c.CachingDirectoryFactory return new directory for /export/home/jenkins/workspace/Lucene-Solr-master-Solaris/solr/build/solr-core/test/J0/temp/solr.handler.component.SpatialHeatmapFacetsTest_84B7C7CDA2E33448-001/tempDir-001/control/cores/collection1/data/index
    [junit4] 2> 344362 INFO (coreLoadExecutor-1076-thread-1) [ x:collection1] o.a.s.u.RandomMergePolicy RandomMergePolicy wrapping class org.apache.lucene.index.LogDocMergePolicy: [LogDocMergePolicy: minMergeSize=1000, mergeFactor=20, maxMergeSize=9223372036854775807, maxMergeSizeForForcedMerge=9223372036854775807, calibrateSizeByDeletes=true, maxMergeDocs=2147483647, maxCFSSegmentSizeMB=8.796093022207999E12, noCFSRatio=0.0]
    [junit4] 2> 344362 INFO (coreLoadExecutor-1076-thread-1) [ x:collection1] o.a.s.c.SolrDeletionPolicy SolrDeletionPolicy.onCommit: commits: num=1
    [junit4] 2> commit{dir=MockDirectoryWrapper(RAMDirectory@79531303 lockFactory=org.apache.lucene.store.SingleInstanceLockFactory@4438f3ae),segFN=segments_1,generation=1}
    [junit4] 2> 344362 INFO (coreLoadExecutor-1076-thread-1) [ x:collection1] o.a.s.c.SolrDeletionPolicy newest commit generation = 1
    [junit4] 2> 344364 INFO (OldIndexDirectoryCleanupThreadForCore-collection1) [ x:collection1] o.a.s.c.SolrCore Looking for old index directories to cleanup for core collection1 in /export/home/jenkins/workspace/Lucene-Solr-master-Solaris/solr/build/solr-core/test/J0/temp/solr.handler.component.SpatialHeatmapFacetsTest_84B7C7CDA2E33448-001/tempDir-001/control/cores/collection1/data/
    [junit4] 2> 344364 WARN (OldIndexDirectoryCleanupThreadForCore-collection1) [ x:collection1] o.a.s.c.DirectoryFactory /export/home/jenkins/workspace/Lucene-Solr-master-Solaris/solr/build/solr-core/test/J0/temp/solr.handler.component.SpatialHeatmapFacetsTest_84B7C7CDA2E33448-001/tempDir-001/control/cores/collection1/data/ does not point to a valid data directory; skipping clean-up of old index directories.
    [junit4] 2> 344368 INFO (coreLoadExecutor-1076-thread-1) [ x:collection1] o.a.s.c.SolrCore no updateRequestProcessorChain defined as default, creating implicit default
    [junit4] 2> 344371 INFO (coreLoadExecutor-1076-thread-1) [ x:collection1] o.a.s.h.l.XMLLoader xsltCacheLifetimeSeconds=60
    [junit4] 2> 344373 INFO (coreLoadExecutor-1076-thread-1) [ x:collection1] o.a.s.h.l.XMLLoader xsltCacheLifetimeSeconds=60
    [junit4] 2> 344373 INFO (coreLoadExecutor-1076-thread-1) [ x:collection1] o.a.s.h.l.XMLLoader xsltCacheLifetimeSeconds=60
    [junit4] 2> 344374 INFO (coreLoadExecutor-1076-thread-1) [ x:collection1] o.a.s.h.l.XMLLoader xsltCacheLifetimeSeconds=60
    [junit4] 2> 344376 INFO (coreLoadExecutor-1076-thread-1) [ x:collection1] o.a.s.c.RequestHandlers Registered paths: /admin/mbeans,standard,/update/csv,/sql,/update/json/docs,/admin/luke,/graph,/export,/admin/segments,/get,/admin/system,/replication,/admin/properties,/config,/stream,/schema,/admin/plugins,/admin/logging,/update/json,/admin/ping,/admin/threads,/update,/admin/file
    [junit4] 2> 344376 INFO (coreLoadExecutor-1076-thread-1) [ x:collection1] o.a.s.c.SolrCore Using default statsCache cache: org.apache.solr.search.stats.LocalStatsCache
    [junit4] 2> 344377 INFO (coreLoadExecutor-1076-thread-1) [ x:collection1] o.a.s.u.CommitTracker Hard AutoCommit: disabled
    [junit4] 2> 344377 INFO (coreLoadExecutor-1076-thread-1) [ x:collection1] o.a.s.u.CommitTracker Soft AutoCommit: disabled
    [junit4] 2> 344377 INFO (coreLoadExecutor-1076-thread-1) [ x:collection1] o.a.s.u.RandomMergePolicy RandomMergePolicy wrapping class org.apache.lucene.index.TieredMergePolicy: [TieredMergePolicy: maxMergeAtOnce=28, maxMergeAtOnceExplicit=36, maxMergedSegmentMB=14.318359375, floorSegmentMB=0.544921875, forceMergeDeletesPctAllowed=10.241382891336874, segmentsPerTier=21.0, maxCFSSegmentSizeMB=8.796093022207999E12, noCFSRatio=0.5577642425964823
    [junit4] 2> 344377 INFO (coreLoadExecutor-1076-thread-1) [ x:collection1] o.a.s.c.SolrDeletionPolicy SolrDeletionPolicy.onInit: commits: num=1
    [junit4] 2> commit{dir=MockDirectoryWrapper(RAMDirectory@79531303 lockFactory=org.apache.lucene.store.SingleInstanceLockFactory@4438f3ae),segFN=segments_1,generation=1}
    [junit4] 2> 344377 INFO (coreLoadExecutor-1076-thread-1) [ x:collection1] o.a.s.c.SolrDeletionPolicy newest commit generation = 1
    [junit4] 2> 344377 INFO (coreLoadExecutor-1076-thread-1) [ x:collection1] o.a.s.s.SolrIndexSearcher Opening [Searcher@3bb390f4[collection1] main]
    [junit4] 2> 344378 WARN (coreLoadExecutor-1076-thread-1) [ x:collection1] o.a.s.r.ManagedResourceStorage Cannot write to config directory /export/home/jenkins/workspace/Lucene-Solr-master-Solaris/solr/core/src/test-files/solr/collection1/conf; switching to use InMemory storage instead.
    [junit4] 2> 344378 INFO (coreLoadExecutor-1076-thread-1) [ x:collection1] o.a.s.r.RestManager Initializing RestManager with initArgs: {}
    [junit4] 2> 344378 INFO (coreLoadExecutor-1076-thread-1) [ x:collection1] o.a.s.r.ManagedResourceStorage Reading _rest_managed.json using InMemoryStorage
    [junit4] 2> 344378 INFO (coreLoadExecutor-1076-thread-1) [ x:collection1] o.a.s.r.RestManager Initializing 0 registered ManagedResources
    [junit4] 2> 344378 INFO (coreLoadExecutor-1076-thread-1) [ x:collection1] o.a.s.h.ReplicationHandler Commits will be reserved for 10000
    [junit4] 2> 344378 INFO (coreLoadExecutor-1076-thread-1) [ x:collection1] o.a.s.c.CoreContainer registering core: collection1
    [junit4] 2> 344382 INFO (searcherExecutor-1077-thread-1-processing-x:collection1) [ x:collection1] o.a.s.c.SolrCore [collection1] Registered new searcher Searcher@3bb390f4[collection1] main{ExitableDirectoryReader(UninvertingDirectoryReader())}
    [junit4] 2> 345145 INFO (TEST-SpatialHeatmapFacetsTest.testPng-seed#[84B7C7CDA2E33448]) [ ] o.a.s.SolrTestCaseJ4 Writing core.properties file to /export/home/jenkins/workspace/Lucene-Solr-master-Solaris/solr/build/solr-core/test/J0/temp/solr.handler.component.SpatialHeatmapFacetsTest_84B7C7CDA2E33448-001/tempDir-001/shard0/cores/collection1
    [junit4] 2> 345146 INFO (TEST-SpatialHeatmapFacetsTest.testPng-seed#[84B7C7CDA2E33448]) [ ] o.e.j.s.Server jetty-9.3.8.v20160314
    [junit4] 2> 345149 INFO (TEST-SpatialHeatmapFacetsTest.testPng-seed#[84B7C7CDA2E33448]) [ ] o.e.j.s.h.ContextHandler Started o.e.j.s.ServletContextHandler@3685d420{/,null,AVAILABLE}
    [junit4] 2> 345149 INFO (TEST-SpatialHeatmapFacetsTest.testPng-seed#[84B7C7CDA2E33448]) [ ] o.e.j.s.ServerConnector Started ServerConnector@324d73bd{HTTP/1.1,[http/1.1]}{127.0.0.1:33171}
    [junit4] 2> 345149 INFO (TEST-SpatialHeatmapFacetsTest.testPng-seed#[84B7C7CDA2E33448]) [ ] o.e.j.s.Server Started @348768ms
    [junit4] 2> 345149 INFO (TEST-SpatialHeatmapFacetsTest.testPng-seed#[84B7C7CDA2E33448]) [ ] o.a.s.c.s.e.JettySolrRunner Jetty properties: {schema=schema-spatial.xml, solrconfig=solrconfig-basic.xml, hostContext=/, hostPort=33171, coreRootDirectory=/export/home/jenkins/workspace/Lucene-Solr-master-Solaris/solr/build/solr-core/test/J0/temp/solr.handler.component.SpatialHeatmapFacetsTest_84B7C7CDA2E33448-001/tempDir-001/shard0/cores}
    [junit4] 2> 345149 INFO (TEST-SpatialHeatmapFacetsTest.testPng-seed#[84B7C7CDA2E33448]) [ ] o.a.s.s.SolrDispatchFilter SolrDispatchFilter.init(): sun.misc.Launcher$AppClassLoader@6d06d69c
    [junit4] 2> 345149 INFO (TEST-SpatialHeatmapFacetsTest.testPng-seed#[84B7C7CDA2E33448]) [ ] o.a.s.c.SolrResourceLoader new SolrResourceLoader for directory: '/export/home/jenkins/workspace/Lucene-Solr-master-Solaris/solr/build/solr-core/test/J0/temp/solr.handler.component.SpatialHeatmapFacetsTest_84B7C7CDA2E33448-001/tempDir-001/shard0'
    [junit4] 2> 345150 INFO (TEST-SpatialHeatmapFacetsTest.testPng-seed#[84B7C7CDA2E33448]) [ ] o.a.s.c.SolrResourceLoader JNDI not configured for solr (NoInitialContextEx)
    [junit4] 2> 345150 INFO (TEST-SpatialHeatmapFacetsTest.testPng-seed#[84B7C7CDA2E33448]) [ ] o.a.s.c.SolrResourceLoader solr home defaulted to 'solr/' (could not find system property or JNDI)
    [junit4] 2> 345150 INFO (TEST-SpatialHeatmapFacetsTest.testPng-seed#[84B7C7CDA2E33448]) [ ] o.a.s.c.SolrXmlConfig Loading container configuration from /export/home/jenkins/workspace/Lucene-Solr-master-Solaris/solr/build/solr-core/test/J0/temp/solr.handler.component.SpatialHeatmapFacetsTest_84B7C7CDA2E33448-001/tempDir-001/shard0/solr.xml
    [junit4] 2> 345161 INFO (TEST-SpatialHeatmapFacetsTest.testPng-seed#[84B7C7CDA2E33448]) [ ] o.a.s.c.CorePropertiesLocator Config-defined core root directory: /export/home/jenkins/workspace/Lucene-Solr-master-Solaris/solr/build/solr-core/test/J0/temp/solr.handler.component.SpatialHeatmapFacetsTest_84B7C7CDA2E33448-001/tempDir-001/shard0/cores
    [junit4] 2> 345161 INFO (TEST-SpatialHeatmapFacetsTest.testPng-seed#[84B7C7CDA2E33448]) [ ] o.a.s.c.CoreContainer New CoreContainer 1006738217
    [junit4] 2> 345161 INFO (TEST-SpatialHeatmapFacetsTest.testPng-seed#[84B7C7CDA2E33448]) [ ] o.a.s.c.CoreContainer Loading cores into CoreContainer [instanceDir=/export/home/jenkins/workspace/Lucene-Solr-master-Solaris/solr/build/solr-core/test/J0/temp/solr.handler.component.SpatialHeatmapFacetsTest_84B7C7CDA2E33448-001/tempDir-001/shard0]
    [junit4] 2> 345161 WARN (TEST-SpatialHeatmapFacetsTest.testPng-seed#[84B7C7CDA2E33448]) [ ] o.a.s.c.CoreContainer Couldn't add files from /export/home/jenkins/workspace/Lucene-Solr-master-Solaris/solr/build/solr-core/test/J0/temp/solr.handler.component.SpatialHeatmapFacetsTest_84B7C7CDA2E33448-001/tempDir-001/shard0/lib to classpath: /export/home/jenkins/workspace/Lucene-Solr-master-Solaris/solr/build/solr-core/test/J0/temp/solr.handler.component.SpatialHeatmapFacetsTest_84B7C7CDA2E33448-001/tempDir-001/shard0/lib
    [junit4] 2> 345161 INFO (TEST-SpatialHeatmapFacetsTest.testPng-seed#[84B7C7CDA2E33448]) [ ] o.a.s.h.c.HttpShardHandlerFactory created with socketTimeout : 90000,urlScheme : ,connTimeout : 15000,maxConnectionsPerHost : 20,maxConnections : 10000,corePoolSize : 0,maximumPoolSize : 2147483647,maxThreadIdleTime : 5,sizeOfQueue : -1,fairnessPolicy : false,
    [junit4] 2> 345163 INFO (TEST-SpatialHeatmapFacetsTest.testPng-seed#[84B7C7CDA2E33448]) [ ] o.a.s.u.UpdateShardHandler Creating UpdateShardHandler HTTP client with params:
    [junit4] 2> 345164 INFO (TEST-SpatialHeatmapFacetsTest.testPng-seed#[84B7C7CDA2E33448]) [ ] o.a.s.l.LogWatcher SLF4J impl is org.slf4j.impl.Log4jLoggerFactory
    [junit4] 2> 345164 INFO (TEST-SpatialHeatmapFacetsTest.testPng-seed#[84B7C7CDA2E33448]) [ ] o.a.s.l.LogWatcher Registering Log Listener [Log4j (org.slf4j.impl.Log4jLoggerFactory)]
    [junit4] 2> 345165 INFO (TEST-SpatialHeatmapFacetsTest.testPng-seed#[84B7C7CDA2E33448]) [ ] o.a.s.c.CoreContainer Security conf doesn't exist. Skipping setup for authorization module.
    [junit4] 2> 345165 INFO (TEST-SpatialHeatmapFacetsTest.testPng-seed#[84B7C7CDA2E33448]) [ ] o.a.s.c.CoreContainer No authentication plugin used.
    [junit4] 2> 345165 INFO (TEST-SpatialHeatmapFacetsTest.testPng-seed#[84B7C7CDA2E33448]) [ ] o.a.s.c.CorePropertiesLocator Looking for core definitions underneath /export/home/jenkins/workspace/Lucene-Solr-master-Solaris/solr/build/solr-core/test/J0/temp/solr.handler.component.SpatialHeatmapFacetsTest_84B7C7CDA2E33448-001/tempDir-001/shard0/cores
    [junit4] 2> 345166 INFO (TEST-SpatialHeatmapFacetsTest.testPng-seed#[84B7C7CDA2E33448]) [ ] o.a.s.c.CoreDescriptor Created CoreDescriptor: {name=collection1, config=solrconfig-basic.xml, loadOnStartup=true, schema=schema-spatial.xml, configSetProperties=configsetprops.json, transient=false, dataDir=data/, configSet=collection1}
    [junit4] 2> 345166 INFO (TEST-SpatialHeatmapFacetsTest.testPng-seed#[84B7C7CDA2E33448]) [ ] o.a.s.c.CorePropertiesLocator Found core collection1 in /export/home/jenkins/workspace/Lucene-Solr-master-Solaris/solr/build/solr-core/test/J0/temp/solr.handler.component.SpatialHeatmapFacetsTest_84B7C7CDA2E33448-001/tempDir-001/shard0/cores/collection1
    [junit4] 2> 345166 INFO (TEST-SpatialHeatmapFacetsTest.testPng-seed#[84B7C7CDA2E33448]) [ ] o.a.s.c.CorePropertiesLocator Found 1 core definitions
    [junit4] 2> 345167 INFO (TEST-SpatialHeatmapFacetsTest.testPng-seed#[84B7C7CDA2E33448]) [ ] o.a.s.s.SolrDispatchFilter user.dir=/export/home/jenkins/workspace/Lucene-Solr-master-Solaris/solr/build/solr-core/test/J0
    [junit4] 2> 345167 INFO (TEST-SpatialHeatmapFacetsTest.testPng-seed#[84B7C7CDA2E33448]) [ ] o.a.s.s.SolrDispatchFilter SolrDispatchFilter.init() done
    [junit4] 2> 345167 INFO (coreLoadExecutor-1086-thread-1) [ ] o.a.s.c.SolrResourceLoader new SolrResourceLoader for directory: '/export/home/jenkins/workspace/Lucene-Solr-master-Solaris/solr/core/src/test-files/solr/collection1'
    [junit4] 2> 345176 INFO (coreLoadExecutor-1086-thread-1) [ ] o.a.s.c.SolrResourceLoader JNDI not configured for solr (NoInitialContextEx)
    [junit4] 2> 345176 INFO (coreLoadExecutor-1086-thread-1) [ ] o.a.s.c.SolrResourceLoader solr home defaulted to 'solr/' (could not find system property or JNDI)
    [junit4] 2> 345176 INFO (coreLoadExecutor-1086-thread-1) [ ] o.a.s.c.SolrResourceLoader Adding 'file:/export/home/jenkins/workspace/Lucene-Solr-master-Solaris/solr/core/src/test-files/solr/collection1/lib/classes/' to classloader
    [junit4] 2> 345176 INFO (coreLoadExecutor-1086-thread-1) [ ] o.a.s.c.SolrResourceLoader Adding 'file:/export/home/jenkins/workspace/Lucene-Solr-master-Solaris/solr/core/src/test-files/solr/collection1/lib/README' to classloader
    [junit4] 2> 345208 INFO (coreLoadExecutor-1086-thread-1) [ ] o.a.s.c.SolrConfig current version of requestparams : -1
    [junit4] 2> 345223 WARN (coreLoadExecutor-1086-thread-1) [ ] o.a.s.c.Config Beginning with Solr 5.5, <mergePolicy> is deprecated, use <mergePolicyFactory> instead.
    [junit4] 2> 345224 INFO (coreLoadExecutor-1086-thread-1) [ ] o.a.s.c.SolrConfig Using Lucene MatchVersion: 7.0.0
    [junit4] 2> 345238 INFO (coreLoadExecutor-1086-thread-1) [ ] o.a.s.c.SolrConfig Loaded SolrConfig: solrconfig-basic.xml
    [junit4] 2> 345242 INFO (coreLoadExecutor-1086-thread-1) [ ] o.a.s.s.IndexSchema [collection1] Schema name=test
    [junit4] 2> 345250 INFO (coreLoadExecutor-1086-thread-1) [ ] o.a.s.s.IndexSchema unique key field: id
    [junit4] 2> 345253 INFO (coreLoadExecutor-1086-thread-1) [ ] o.a.s.c.ConfigSetProperties Did not find ConfigSet properties, assuming default properties: Can't find resource 'configsetprops.json' in classpath or '/export/home/jenkins/workspace/Lucene-Solr-master-Solaris/solr/core/src/test-files/solr/collection1'
    [junit4] 2> 345253 INFO (coreLoadExecutor-1086-thread-1) [ ] o.a.s.c.CoreContainer Creating SolrCore 'collection1' using configuration from configset /export/home/jenkins/workspace/Lucene-Solr-master-Solaris/solr/core/src/test-files/solr/collection1
    [junit4] 2> 345253 INFO (coreLoadExecutor-1086-thread-1) [ x:collection1] o.a.s.c.SolrCore org.apache.solr.core.MockDirectoryFactory
    [junit4] 2> 345253 INFO (coreLoadExecutor-1086-thread-1) [ x:collection1] o.a.s.c.SolrCore [[collection1] ] Opening new SolrCore at [/export/home/jenkins/workspace/Lucene-Solr-master-Solaris/solr/core/src/test-files/solr/collection1], dataDir=[/export/home/jenkins/workspace/Lucene-Solr-master-Solaris/solr/build/solr-core/test/J0/temp/solr.handler.component.SpatialHeatmapFacetsTest_84B7C7CDA2E33448-001/tempDir-001/shard0/cores/collection1/data/]
    [junit4] 2> 345253 INFO (coreLoadExecutor-1086-thread-1) [ x:collection1] o.a.s.c.SolrCore JMX monitoring not detected for core: collection1
    [junit4] 2> 345254 INFO (coreLoadExecutor-1086-thread-1) [ x:collection1] o.a.s.c.CachingDirectoryFactory return new directory for /export/home/jenkins/workspace/Lucene-Solr-master-Solaris/solr/build/solr-core/test/J0/temp/solr.handler.component.SpatialHeatmapFacetsTest_84B7C7CDA2E33448-001/tempDir-001/shard0/cores/collection1/data
    [junit4] 2> 345254 INFO (coreLoadExecutor-1086-thread-1) [ x:collection1] o.a.s.c.SolrCore New index directory detected: old=null new=/export/home/jenkins/workspace/Lucene-Solr-master-Solaris/solr/build/solr-core/test/J0/temp/solr.handler.component.SpatialHeatmapFacetsTest_84B7C7CDA2E33448-001/tempDir-001/shard0/cores/collection1/data/index/
    [junit4] 2> 345254 WARN (coreLoadExecutor-1086-thread-1) [ x:collection1] o.a.s.c.SolrCore [collection1] Solr index directory '/export/home/jenkins/workspace/Lucene-Solr-master-Solaris/solr/build/solr-core/test/J0/temp/solr.handler.component.SpatialHeatmapFacetsTest_84B7C7CDA2E33448-001/tempDir-001/shard0/cores/collection1/data/index' doesn't exist. Creating new index...
    [junit4] 2> 345254 INFO (coreLoadExecutor-1086-thread-1) [ x:collection1] o.a.s.c.CachingDirectoryFactory return new directory for /export/home/jenkins/workspace/Lucene-Solr-master-Solaris/solr/build/solr-core/test/J0/temp/solr.handler.component.SpatialHeatmapFacetsTest_84B7C7CDA2E33448-001/tempDir-001/shard0/cores/collection1/data/index
    [junit4] 2> 345254 INFO (coreLoadExecutor-1086-thread-1) [ x:collection1] o.a.s.u.RandomMergePolicy RandomMergePolicy wrapping class org.apache.lucene.index.LogDocMergePolicy: [LogDocMergePolicy: minMergeSize=1000, mergeFactor=20, maxMergeSize=9223372036854775807, maxMergeSizeForForcedMerge=9223372036854775807, calibrateSizeByDeletes=true, maxMergeDocs=2147483647, maxCFSSegmentSizeMB=8.796093022207999E12, noCFSRatio=0.0]
    [junit4] 2> 345254 INFO (coreLoadExecutor-1086-thread-1) [ x:collection1] o.a.s.c.SolrDeletionPolicy SolrDeletionPolicy.onCommit: commits: num=1
    [junit4] 2> commit{dir=MockDirectoryWrapper(RAMDirectory@1eeb59af lockFactory=org.apache.lucene.store.SingleInstanceLockFactory@d74ae47),segFN=segments_1,generation=1}
    [junit4] 2> 345254 INFO (coreLoadExecutor-1086-thread-1) [ x:collection1] o.a.s.c.SolrDeletionPolicy newest commit generation = 1
    [junit4] 2> 345256 INFO (OldIndexDirectoryCleanupThreadForCore-collection1) [ x:collection1] o.a.s.c.SolrCore Looking for old index directories to cleanup for core collection1 in /export/home/jenkins/workspace/Lucene-Solr-master-Solaris/solr/build/solr-core/test/J0/temp/solr.handler.component.SpatialHeatmapFacetsTest_84B7C7CDA2E33448-001/tempDir-001/shard0/cores/collection1/data/
    [junit4] 2> 345256 WARN (OldIndexDirectoryCleanupThreadForCore-collection1) [ x:collection1] o.a.s.c.DirectoryFactory /export/home/jenkins/workspace/Lucene-Solr-master-Solaris/solr/build/solr-core/test/J0/temp/solr.handler.component.SpatialHeatmapFacetsTest_84B7C7CDA2E33448-001/tempDir-001/shard0/cores/collection1/data/ does not point to a valid data directory; skipping clean-up of old index directories.
    [junit4] 2> 345257 INFO (coreLoadExecutor-1086-thread-1) [ x:collection1] o.a.s.c.SolrCore no updateRequestProcessorChain defined as default, creating implicit default
    [junit4] 2> 345262 INFO (coreLoadExecutor-1086-thread-1) [ x:collection1] o.a.s.h.l.XMLLoader xsltCacheLifetimeSeconds=60
    [junit4] 2> 345264 INFO (coreLoadExecutor-1086-thread-1) [ x:collection1] o.a.s.h.l.XMLLoader xsltCacheLifetimeSeconds=60
    [junit4] 2> 345266 INFO (coreLoadExecutor-1086-thread-1) [ x:collection1] o.a.s.h.l.XMLLoader xsltCacheLifetimeSeconds=60
    [junit4] 2> 345267 INFO (coreLoadExecutor-1086-thread-1) [ x:collection1] o.a.s.h.l.XMLLoader xsltCacheLifetimeSeconds=60
    [junit4] 2> 345268 INFO (coreLoadExecutor-1086-thread-1) [ x:collection1] o.a.s.c.RequestHandlers Registered paths: /admin/mbeans,standard,/update/csv,/sql,/update/json/docs,/admin/luke,/graph,/export,/admin/segments,/get,/admin/system,/replication,/admin/properties,/config,/stream,/schema,/admin/plugins,/admin/logging,/update/json,/admin/ping,/admin/threads,/update,/admin/file
    [junit4] 2> 345268 INFO (coreLoadExecutor-1086-thread-1) [ x:collection1] o.a.s.c.SolrCore Using default statsCache cache: org.apache.solr.search.stats.LocalStatsCache
    [junit4] 2> 345269 INFO (coreLoadExecutor-1086-thread-1) [ x:collection1] o.a.s.u.CommitTracker Hard AutoCommit: disabled
    [junit4] 2> 345269 INFO (coreLoadExecutor-1086-thread-1) [ x:collection1] o.a.s.u.CommitTracker Soft AutoCommit: disabled
    [junit4] 2> 345269 INFO (coreLoadExecutor-1086-thread-1) [ x:collection1] o.a.s.u.RandomMergePolicy RandomMergePolicy wrapping class org.apache.lucene.index.TieredMergePolicy: [TieredMergePolicy: maxMergeAtOnce=28, maxMergeAtOnceExplicit=36, maxMergedSegmentMB=14.318359375, floorSegmentMB=0.544921875, forceMergeDeletesPctAllowed=10.241382891336874, segmentsPerTier=21.0, maxCFSSegmentSizeMB=8.796093022207999E12, noCFSRatio=0.5577642425964823
    [junit4] 2> 345269 INFO (coreLoadExecutor-1086-thread-1) [ x:collection1] o.a.s.c.SolrDeletionPolicy SolrDeletionPolicy.onInit: commits: num=1
    [junit4] 2> commit{dir=MockDirectoryWrapper(RAMDirectory@1eeb59af lockFactory=org.apache.lucene.store.SingleInstanceLockFactory@d74ae47),segFN=segments_1,generation=1}
    [junit4] 2> 345269 INFO (coreLoadExecutor-1086-thread-1) [ x:collection1] o.a.s.c.SolrDeletionPolicy newest commit generation = 1
    [junit4] 2> 345269 INFO (coreLoadExecutor-1086-thread-1) [ x:collection1] o.a.s.s.SolrIndexSearcher Opening [Searcher@1356bf35[collection1] main]
    [junit4] 2> 345270 WARN (coreLoadExecutor-1086-thread-1) [ x:collection1] o.a.s.r.ManagedResourceStorage Cannot write to config directory /export/home/jenkins/workspace/Lucene-Solr-master-Solaris/solr/core/src/test-files/solr/collection1/conf; switching to use InMemory storage instead.
    [junit4] 2> 345270 INFO (coreLoadExecutor-1086-thread-1) [ x:collection1] o.a.s.r.RestManager Initializing RestManager with initArgs: {}
    [junit4] 2> 345270 INFO (coreLoadExecutor-1086-thread-1) [ x:collection1] o.a.s.r.ManagedResourceStorage Reading _rest_managed.json using InMemoryStorage
    [junit4] 2> 345270 INFO (coreLoadExecutor-1086-thread-1) [ x:collection1] o.a.s.r.RestManager Initializing 0 registered ManagedResources
    [junit4] 2> 345270 INFO (coreLoadExecutor-1086-thread-1) [ x:collection1] o.a.s.h.ReplicationHandler Commits will be reserved for 10000
    [junit4] 2> 345270 INFO (searcherExecutor-1087-thread-1-processing-x:collection1) [ x:collection1] o.a.s.c.SolrCore [collection1] Registered new searcher Searcher@1356bf35[collection1] main{ExitableDirectoryReader(UninvertingDirectoryReader())}
    [junit4] 2> 345270 INFO (coreLoadExecutor-1086-thread-1) [ x:collection1] o.a.s.c.CoreContainer registering core: collection1
    [junit4] 2> 345676 INFO (TEST-SpatialHeatmapFacetsTest.testPng-seed#[84B7C7CDA2E33448]) [ ] o.a.s.SolrTestCaseJ4 ###Starting testPng { seed=[84B7C7CDA2E33448:C2F16F1B061CA112]}
    [junit4] 2> 345959 INFO (TEST-SpatialHeatmapFacetsTest.testPng-seed#[84B7C7CDA2E33448]) [ ] o.a.s.SolrTestCaseJ4 ###Ending testPng { seed=[84B7C7CDA2E33448:C2F16F1B061CA112]}
    [junit4] 2> 345961 INFO (TEST-SpatialHeatmapFacetsTest.testPng-seed#[84B7C7CDA2E33448]) [ ] o.e.j.s.ServerConnector Stopped ServerConnector@4daaa0b8{HTTP/1.1,[http/1.1]}{127.0.0.1:0}
    [junit4] 2> 345961 INFO (TEST-SpatialHeatmapFacetsTest.testPng-seed#[84B7C7CDA2E33448]) [ ] o.a.s.c.CoreContainer Shutting down CoreContainer instance=1597717563
    [junit4] 2> 345963 INFO (coreCloseExecutor-1091-thread-1) [ x:collection1] o.a.s.c.SolrCore [collection1] CLOSING SolrCore org.apache.solr.core.SolrCore@74bc4272
    [junit4] 2> 345963 INFO (coreCloseExecutor-1091-thread-1) [ x:collection1] o.a.s.u.DirectUpdateHandler2 closing DirectUpdateHandler2{commits=0,autocommits=0,soft autocommits=0,optimizes=0,rollbacks=0,expungeDeletes=0,docsPending=0,adds=0,deletesById=0,deletesByQuery=0,errors=0,cumulative_adds=0,cumulative_deletesById=0,cumulative_deletesByQuery=0,cumulative_errors=0}
    [junit4] 2> 345971 INFO (coreCloseExecutor-1091-thread-1) [ x:collection1] o.a.s.u.SolrCoreState Closing SolrCoreState
    [junit4] 2> 345971 INFO (coreCloseExecutor-1091-thread-1) [ x:collection1] o.a.s.u.DefaultSolrCoreState SolrCoreState ref count has reached 0 - closing IndexWriter
    [junit4] 2> 345971 INFO (coreCloseExecutor-1091-thread-1) [ x:collection1] o.a.s.u.DefaultSolrCoreState closing IndexWriter with IndexWriterCloser
    [junit4] 2> 345974 INFO (coreCloseExecutor-1091-thread-1) [ x:collection1] o.a.s.c.SolrCore [collection1] Closing main searcher on request.
    [junit4] 2> 345974 INFO (coreCloseExecutor-1091-thread-1) [ x:collection1] o.a.s.c.CachingDirectoryFactory Closing MockDirectoryFactory - 2 directories currently being tracked
    [junit4] 2> 345974 INFO (coreCloseExecutor-1091-thread-1) [ x:collection1] o.a.s.c.CachingDirectoryFactory looking to close /export/home/jenkins/workspace/Lucene-Solr-master-Solaris/solr/build/solr-core/test/J0/temp/solr.handler.component.SpatialHeatmapFacetsTest_84B7C7CDA2E33448-001/tempDir-001/control/cores/collection1/data [CachedDir<<refCount=0;path=/export/home/jenkins/workspace/Lucene-Solr-master-Solaris/solr/build/solr-core/test/J0/temp/solr.handler.component.SpatialHeatmapFacetsTest_84B7C7CDA2E33448-001/tempDir-001/control/cores/collection1/data;done=false>>]
    [junit4] 2> 345974 INFO (coreCloseExecutor-1091-thread-1) [ x:collection1] o.a.s.c.CachingDirectoryFactory Closing directory, CoreContainer#isShutdown=true
    [junit4] 2> 345975 INFO (coreCloseExecutor-1091-thread-1) [ x:collection1] o.a.s.c.CachingDirectoryFactory Closing directory: /export/home/jenkins/workspace/Lucene-Solr-master-Solaris/solr/build/solr-core/test/J0/temp/solr.handler.component.SpatialHeatmapFacetsTest_84B7C7CDA2E33448-001/tempDir-001/control/cores/collection1/data
    [junit4] 2> 345975 INFO (coreCloseExecutor-1091-thread-1) [ x:collection1] o.a.s.c.CachingDirectoryFactory looking to close /export/home/jenkins/workspace/Lucene-Solr-master-Solaris/solr/build/solr-core/test/J0/temp/solr.handler.component.SpatialHeatmapFacetsTest_84B7C7CDA2E33448-001/tempDir-001/control/cores/collection1/data/index [CachedDir<<refCount=0;path=/export/home/jenkins/workspace/Lucene-Solr-master-Solaris/solr/build/solr-core/test/J0/temp/solr.handler.component.SpatialHeatmapFacetsTest_84B7C7CDA2E33448-001/tempDir-001/control/cores/collection1/data/index;done=false>>]
    [junit4] 2> 345975 INFO (coreCloseExecutor-1091-thread-1) [ x:collection1] o.a.s.c.CachingDirectoryFactory Closing directory, CoreContainer#isShutdown=true
    [junit4] 2> 345975 INFO (coreCloseExecutor-1091-thread-1) [ x:collection1] o.a.s.c.CachingDirectoryFactory Closing directory: /export/home/jenkins/workspace/Lucene-Solr-master-Solaris/solr/build/solr-core/test/J0/temp/solr.handler.component.SpatialHeatmapFacetsTest_84B7C7CDA2E33448-001/tempDir-001/control/cores/collection1/data/index
    [junit4] 2> 345979 INFO (TEST-SpatialHeatmapFacetsTest.testPng-seed#[84B7C7CDA2E33448]) [ ] o.e.j.s.h.ContextHandler Stopped o.e.j.s.ServletContextHandler@3a75e996{/,null,UNAVAILABLE}
    [junit4] 2> 345983 INFO (TEST-SpatialHeatmapFacetsTest.testPng-seed#[84B7C7CDA2E33448]) [ ] o.e.j.s.ServerConnector Stopped ServerConnector@324d73bd{HTTP/1.1,[http/1.1]}{127.0.0.1:0}
    [junit4] 2> 345983 INFO (TEST-SpatialHeatmapFacetsTest.testPng-seed#[84B7C7CDA2E33448]) [ ] o.a.s.c.CoreContainer Shutting down CoreContainer instance=1006738217
    [junit4] 2> 345985 INFO (coreCloseExecutor-1093-thread-1) [ x:collection1] o.a.s.c.SolrCore [collection1] CLOSING SolrCore org.apache.solr.core.SolrCore@4a73482d
    [junit4] 2> 345985 INFO (coreCloseExecutor-1093-thread-1) [ x:collection1] o.a.s.u.DirectUpdateHandler2 closing DirectUpdateHandler2{commits=0,autocommits=0,soft autocommits=0,optimizes=0,rollbacks=0,expungeDeletes=0,docsPending=0,adds=0,deletesById=0,deletesByQuery=0,errors=0,cumulative_adds=0,cumulative_deletesById=0,cumulative_deletesByQuery=0,cumulative_errors=0}
    [junit4] 2> 345986 INFO (coreCloseExecutor-1093-thread-1) [ x:collection1] o.a.s.u.SolrCoreState Closing SolrCoreState
    [junit4] 2> 345986 INFO (coreCloseExecutor-1093-thread-1) [ x:collection1] o.a.s.u.DefaultSolrCoreState SolrCoreState ref count has reached 0 - closing IndexWriter
    [junit4] 2> 345986 INFO (coreCloseExecutor-1093-thread-1) [ x:collection1] o.a.s.u.DefaultSolrCoreState closing IndexWriter with IndexWriterCloser
    [junit4] 2> 345989 INFO (coreCloseExecutor-1093-thread-1) [ x:collection1] o.a.s.c.SolrCore [collection1] Closing main searcher on request.
    [junit4] 2> 345989 INFO (coreCloseExecutor-1093-thread-1) [ x:collection1] o.a.s.c.CachingDirectoryFactory Closing MockDirectoryFactory - 2 directories currently being tracked
    [junit4] 2> 345989 INFO (coreCloseExecutor-1093-thread-1) [ x:collection1] o.a.s.c.CachingDirectoryFactory looking to close /export/home/jenkins/workspace/Lucene-Solr-master-Solaris/solr/build/solr-core/test/J0/temp/solr.handler.component.SpatialHeatmapFacetsTest_84B7C7CDA2E33448-001/tempDir-001/shard0/cores/collection1/data [CachedDir<<refCount=0;path=/export/home/jenkins/workspace/Lucene-Solr-master-Solaris/solr/build/solr-core/test/J0/temp/solr.handler.component.SpatialHeatmapFacetsTest_84B7C7CDA2E33448-001/tempDir-001/shard0/cores/collection1/data;done=false>>]
    [junit4] 2> 345989 INFO (coreCloseExecutor-1093-thread-1) [ x:collection1] o.a.s.c.CachingDirectoryFactory Closing directory, CoreContainer#isShutdown=true
    [junit4] 2> 345989 INFO (coreCloseExecutor-1093-thread-1) [ x:collection1] o.a.s.c.CachingDirectoryFactory Closing directory: /export/home/jenkins/workspace/Lucene-Solr-master-Solaris/solr/build/solr-core/test/J0/temp/solr.handler.component.SpatialHeatmapFacetsTest_84B7C7CDA2E33448-001/tempDir-001/shard0/cores/collection1/data
    [junit4] 2> 345989 INFO (coreCloseExecutor-1093-thread-1) [ x:collection1] o.a.s.c.CachingDirectoryFactory looking to close /export/home/jenkins/workspace/Lucene-Solr-master-Solaris/solr/build/solr-core/test/J0/temp/solr.handler.component.SpatialHeatmapFacetsTest_84B7C7CDA2E33448-001/tempDir-001/shard0/cores/collection1/data/index [CachedDir<<refCount=0;path=/export/home/jenkins/workspace/Lucene-Solr-master-Solaris/solr/build/solr-core/test/J0/temp/solr.handler.component.SpatialHeatmapFacetsTest_84B7C7CDA2E33448-001/tempDir-001/shard0/cores/collection1/data/index;done=false>>]
    [junit4] 2> 345989 INFO (coreCloseExecutor-1093-thread-1) [ x:collection1] o.a.s.c.CachingDirectoryFactory Closing directory, CoreContainer#isShutdown=true
    [junit4] 2> 345989 INFO (coreCloseExecutor-1093-thread-1) [ x:collection1] o.a.s.c.CachingDirectoryFactory Closing directory: /export/home/jenkins/workspace/Lucene-Solr-master-Solaris/solr/build/solr-core/test/J0/temp/solr.handler.component.SpatialHeatmapFacetsTest_84B7C7CDA2E33448-001/tempDir-001/shard0/cores/collection1/data/index
    [junit4] 2> 345991 INFO (TEST-SpatialHeatmapFacetsTest.testPng-seed#[84B7C7CDA2E33448]) [ ] o.e.j.s.h.ContextHandler Stopped o.e.j.s.ServletContextHandler@3685d420{/,null,UNAVAILABLE}
    [junit4] 2> 346159 INFO (TEST-SpatialHeatmapFacetsTest.testPng-seed#[84B7C7CDA2E33448]) [ ] o.e.j.s.Server jetty-9.3.8.v20160314
    [junit4] 2> 346160 INFO (TEST-SpatialHeatmapFacetsTest.testPng-seed#[84B7C7CDA2E33448]) [ ] o.e.j.s.h.ContextHandler Started o.e.j.s.ServletContextHandler@1ffe5d18{/,null,AVAILABLE}
    [junit4] 2> 346161 INFO (TEST-SpatialHeatmapFacetsTest.testPng-seed#[84B7C7CDA2E33448]) [ ] o.e.j.s.ServerConnector Started ServerConnector@78668aba{HTTP/1.1,[http/1.1]}{127.0.0.1:33051}
    [junit4] 2> 346161 INFO (TEST-SpatialHeatmapFacetsTest.testPng-seed#[84B7C7CDA2E33448]) [ ] o.e.j.s.Server Started @349780ms
    [junit4] 2> 346161 INFO (TEST-SpatialHeatmapFacetsTest.testPng-seed#[84B7C7CDA2E33448]) [ ] o.a.s.c.s.e.JettySolrRunner Jetty properties: {schema=schema-spatial.xml, solrconfig=solrconfig-basic.xml, hostContext=/, hostPort=33051, coreRootDirectory=/export/home/jenkins/workspace/Lucene-Solr-master-Solaris/solr/build/solr-core/test/J0/temp/solr.handler.component.SpatialHeatmapFacetsTest_84B7C7CDA2E33448-001/tempDir-001/control/cores}
    [junit4] 2> 346161 INFO (TEST-SpatialHeatmapFacetsTest.testPng-seed#[84B7C7CDA2E33448]) [ ] o.a.s.s.SolrDispatchFilter SolrDispatchFilter.init(): sun.misc.Launcher$AppClassLoader@6d06d69c
    [junit4] 2> 346161 INFO (TEST-SpatialHeatmapFacetsTest.testPng-seed#[84B7C7CDA2E33448]) [ ] o.a.s.c.SolrResourceLoader new SolrResourceLoader for directory: '/export/home/jenkins/workspace/Lucene-Solr-master-Solaris/solr/build/solr-core/test/J0/temp/solr.handler.component.SpatialHeatmapFacetsTest_84B7C7CDA2E33448-001/tempDir-001/control'
    [junit4] 2> 346162 INFO (TEST-SpatialHeatmapFacetsTest.testPng-seed#[84B7C7CDA2E33448]) [ ] o.a.s.c.SolrResourceLoader JNDI not configured for solr (NoInitialContextEx)
    [junit4] 2> 346162 INFO (TEST-SpatialHeatmapFacetsTest.testPng-seed#[84B7C7CDA2E33448]) [ ] o.a.s.c.SolrResourceLoader solr home defaulted to 'solr/' (could not find system property or JNDI)
    [junit4] 2> 346162 INFO (TEST-SpatialHeatmapFacetsTest.testPng-seed#[84B7C7CDA2E33448]) [ ] o.a.s.c.SolrXmlConfig Loading container configuration from /export/home/jenkins/workspace/Lucene-Solr-master-Solaris/solr/build/solr-core/test/J0/temp/solr.handler.component.SpatialHeatmapFacetsTest_84B7C7CDA2E33448-001/tempDir-001/control/solr.xml
    [junit4] 2> 346168 INFO (TEST-SpatialHeatmapFacetsTest.testPng-seed#[84B7C7CDA2E33448]) [ ] o.a.s.c.CorePropertiesLocator Config-defined core root directory: /export/home/jenkins/workspace/Lucene-Solr-master-Solaris/solr/build/solr-core/test/J0/temp/solr.handler.component.SpatialHeatmapFacetsTest_84B7C7CDA2E33448-001/tempDir-001/control/cores
    [junit4] 2> 346168 INFO (TEST-SpatialHeatmapFacetsTest.testPng-seed#[84B7C7CDA2E33448]) [ ] o.a.s.c.CoreContainer New CoreContainer 1093256404
    [junit4] 2> 346168 INFO (TEST-SpatialHeatmapFacetsTest.testPng-seed#[84B7C7CDA2E33448]) [ ] o.a.s.c.CoreContainer Loading cores into CoreContainer [instanceDir=/export/home/jenkins/workspace/Lucene-Solr-master-Solaris/solr/build/solr-core/test/J0/temp/solr.handler.component.SpatialHeatmapFacetsTest_84B7C7CDA2E33448-001/tempDir-001/control]
    [junit4] 2> 346169 WARN (TEST-SpatialHeatmapFacetsTest.testPng-seed#[84B7C7CDA2E33448]) [ ] o.a.s.c.CoreContainer Couldn't add files from /export/home/jenkins/workspace/Lucene-Solr-master-Solaris/solr/build/solr-core/test/J0/temp/solr.handler.component.SpatialHeatmapFacetsTest_84B7C7CDA2E33448-001/tempDir-001/control/lib to classpath: /export/home/jenkins/workspace/Lucene-Solr-master-Solaris/solr/build/solr-core/test/J0/temp/solr.handler.component.SpatialHeatmapFacetsTest_84B7C7CDA2E33448-001/tempDir-001/control/lib
    [junit4] 2> 346169 INFO (TEST-SpatialHeatmapFacetsTest.testPng-seed#[84B7C7CDA2E33448]) [ ] o.a.s.h.c.HttpShardHandlerFactory created with socketTimeout : 90000,urlScheme : ,connTimeout : 15000,maxConnectionsPerHost : 20,maxConnections : 10000,corePoolSize : 0,maximumPoolSize : 2147483647,maxThreadIdleTime : 5,sizeOfQueue : -1,fairnessPolicy : false,
    [junit4] 2> 346171 INFO (TEST-SpatialHeatmapFacetsTest.testPng-seed#[84B7C7CDA2E33448]) [ ] o.a.s.u.UpdateShardHandler Creating UpdateShardHandler HTTP client with params:
    [junit4] 2> 346172 INFO (TEST-SpatialHeatmapFacetsTest.testPng-seed#[84B7C7CDA2E33448]) [ ] o.a.s.l.LogWatcher SLF4J impl is org.slf4j.impl.Log4jLoggerFactory
    [junit4] 2> 346172 INFO (TEST-SpatialHeatmapFacetsTest.testPng-seed#[84B7C7CDA2E33448]) [ ] o.a.s.l.LogWatcher Registering Log Listener [Log4j (org.slf4j.impl.Log4jLoggerFactory)]
    [junit4] 2> 346172 INFO (TEST-SpatialHeatmapFacetsTest.testPng-seed#[84B7C7CDA2E33448]) [ ] o.a.s.c.CoreContainer Security conf doesn't exist. Skipping setup for authorization module.
    [junit4] 2> 346172 INFO (TEST-SpatialHeatmapFacetsTest.testPng-seed#[84B7C7CDA2E33448]) [ ] o.a.s.c.CoreContainer No authentication plugin used.
    [junit4] 2> 346173 INFO (TEST-SpatialHeatmapFacetsTest.testPng-seed#[84B7C7CDA2E33448]) [ ] o.a.s.c.CorePropertiesLocator Looking for core definitions underneath /export/home/jenkins/workspace/Lucene-Solr-master-Solaris/solr/build/solr-core/test/J0/temp/solr.handler.component.SpatialHeatmapFacetsTest_84B7C7CDA2E33448-001/tempDir-001/control/cores
    [junit4] 2> 346174 INFO (TEST-SpatialHeatmapFacetsTest.testPng-seed#[84B7C7CDA2E33448]) [ ] o.a.s.c.CoreDescriptor Created CoreDescriptor: {name=collection1, config=solrconfig-basic.xml, loadOnStartup=true, schema=schema-spatial.xml, configSetProperties=configsetprops.json, transient=false, dataDir=data/, configSet=collection1}
    [junit4] 2> 346174 INFO (TEST-SpatialHeatmapFacetsTest.testPng-seed#[84B7C7CDA2E33448]) [ ] o.a.s.c.CorePropertiesLocator Found core collection1 in /export/home/jenkins/workspace/Lucene-Solr-master-Solaris/solr/build/solr-core/test/J0/temp/solr.handler.component.SpatialHeatmapFacetsTest_84B7C7CDA2E33448-001/tempDir-001/control/cores/collection1
    [junit4] 2> 346174 INFO (TEST-SpatialHeatmapFacetsTest.testPng-seed#[84B7C7CDA2E33448]) [ ] o.a.s.c.CorePropertiesLocator Found 1 core definitions
    [junit4] 2> 346175 INFO (TEST-SpatialHeatmapFacetsTest.testPng-seed#[84B7C7CDA2E33448]) [ ] o.a.s.s.SolrDispatchFilter user.dir=/export/home/jenkins/workspace/Lucene-Solr-master-Solaris/solr/build/solr-core/test/J0
    [junit4] 2> 346175 INFO (TEST-SpatialHeatmapFacetsTest.testPng-seed#[84B7C7CDA2E33448]) [ ] o.a.s.s.SolrDispatchFilter SolrDispatchFilter.init() done
    [junit4] 2> 346177 INFO (coreLoadExecutor-1100-thread-1) [ ] o.a.s.c.SolrResourceLoader new SolrResourceLoader for directory: '/export/home/jenkins/workspace/Lucene-Solr-master-Solaris/solr/core/src/test-files/solr/collection1'
    [junit4] 2> 346181 INFO (coreLoadExecutor-1100-thread-1) [ ] o.a.s.c.SolrResourceLoader JNDI not configured for solr (NoInitialContextEx)
    [junit4] 2> 346181 INFO (coreLoadExecutor-1100-thread-1) [ ] o.a.s.c.SolrResourceLoader solr home defaulted to 'solr/' (could not find system property or JNDI)
    [junit4] 2> 346181 INFO (coreLoadExecutor-1100-thread-1) [ ] o.a.s.c.SolrResourceLoader Adding 'file:/export/home/jenkins/workspace/Lucene-Solr-master-Solaris/solr/core/src/test-files/solr/collection1/lib/classes/' to classloader
    [junit4] 2> 346181 INFO (coreLoadExecutor-1100-thread-1) [ ] o.a.s.c.SolrResourceLoader Adding 'file:/export/home/jenkins/workspace/Lucene-Solr-master-Solaris/solr/core/src/test-files/solr/collection1/lib/README' to classloader
    [junit4] 2> 346221 INFO (coreLoadExecutor-1100-thread-1) [ ] o.a.s.c.SolrConfig current version of requestparams : -1
    [junit4] 2> 346222 WARN (coreLoadExecutor-1100-thread-1) [ ] o.a.s.c.Config Beginning with Solr 5.5, <mergePolicy> is deprecated, use <mergePolicyFactory> instead.
    [junit4] 2> 346223 INFO (coreLoadExecutor-1100-thread-1) [ ] o.a.s.c.SolrConfig Using Lucene MatchVersion: 7.0.0
    [junit4] 2> 346227 INFO (coreLoadExecutor-1100-thread-1) [ ] o.a.s.c.SolrConfig Loaded SolrConfig: solrconfig-basic.xml
    [junit4] 2> 346232 INFO (coreLoadExecutor-1100-thread-1) [ ] o.a.s.s.IndexSchema [collection1] Schema name=test
    [junit4] 2> 346242 INFO (coreLoadExecutor-1100-thread-1) [ ] o.a.s.s.IndexSchema unique key field: id
    [junit4] 2> 346245 INFO (coreLoadExecutor-1100-thread-1) [ ] o.a.s.c.ConfigSetProperties Did not find ConfigSet properties, assuming default properties: Can't find resource 'configsetprops.json' in classpath or '/export/home/jenkins/workspace/Lucene-Solr-master-Solaris/solr/core/src/test-files/solr/collection1'
    [junit4] 2> 346245 INFO (coreLoadExecutor-1100-thread-1) [ ] o.a.s.c.CoreContainer Creating SolrCore 'collection1' using configuration from configset /export/home/jenkins/workspace/Lucene-Solr-master-Solaris/solr/core/src/test-files/solr/collection1
    [junit4] 2> 346245 INFO (coreLoadExecutor-1100-thread-1) [ x:collection1] o.a.s.c.SolrCore org.apache.solr.core.MockDirectoryFactory
    [junit4] 2> 346245 INFO (coreLoadExecutor-1100-thread-1) [ x:collection1] o.a.s.c.SolrCore [[collection1] ] Opening new SolrCore at [/export/home/jenkins/workspace/Lucene-Solr-master-Solaris/solr/core/src/test-files/solr/collection1], dataDir=[/export/home/jenkins/workspace/Lucene-Solr-master-Solaris/solr/build/solr-core/test/J0/temp/solr.handler.component.SpatialHeatmapFacetsTest_84B7C7CDA2E33448-001/tempDir-001/control/cores/collection1/data/]
    [junit4] 2> 346245 INFO (coreLoadExecutor-1100-thread-1) [ x:collection1] o.a.s.c.SolrCore JMX monitoring not detected for core: collection1
    [junit4] 2> 346248 INFO (coreLoadExecutor-1100-thread-1) [ x:collection1] o.a.s.c.CachingDirectoryFactory return new directory for /export/home/jenkins/workspace/Lucene-Solr-master-Solaris/solr/build/solr-core/test/J0/temp/solr.handler.component.SpatialHeatmapFacetsTest_84B7C7CDA2E33448-001/tempDir-001/control/cores/collection1/data
    [junit4] 2> 346248 INFO (coreLoadExecutor-1100-thread-1) [ x:collection1] o.a.s.c.SolrCore New index directory detected: old=null new=/export/home/jenkins/workspace/Lucene-Solr-master-Solaris/solr/build/solr-core/test/J0/temp/solr.handler.component.SpatialHeatmapFacetsTest_84B7C7CDA2E33448-001/tempDir-001/control/cores/collection1/data/index/
    [junit4] 2> 346248 WARN (coreLoadExecutor-1100-thread-1) [ x:collection1] o.a.s.c.SolrCore [collection1] Solr index directory '/export/home/jenkins/workspace/Lucene-Solr-master-Solaris/solr/build/solr-core/test/J0/temp/solr.handler.component.SpatialHeatmapFacetsTest_84B7C7CDA2E33448-001/tempDir-001/control/cores/collection1/data/index' doesn't exist. Creating new index...
    [junit4] 2> 346248 INFO (coreLoadExecutor-1100-thread-1) [ x:collection1] o.a.s.c.CachingDirectoryFactory return new directory for /export/home/jenkins/workspace/Lucene-Solr-master-Solaris/solr/build/solr-core/test/J0/temp/solr.handler.component.SpatialHeatmapFacetsTest_84B7C7CDA2E33448-001/tempDir-001/control/cores/collection1/data/index
    [junit4] 2> 346248 INFO (coreLoadExecutor-1100-thread-1) [ x:collection1] o.a.s.u.RandomMergePolicy RandomMergePolicy wrapping class org.apache.lucene.index.LogDocMergePolicy: [LogDocMergePolicy: minMergeSize=1000, mergeFactor=20, maxMergeSize=9223372036854775807, maxMergeSizeForForcedMerge=9223372036854775807, calibrateSizeByDeletes=true, maxMergeDocs=2147483647, maxCFSSegmentSizeMB=8.796093022207999E12, noCFSRatio=0.0]
    [junit4] 2> 346249 INFO (coreLoadExecutor-1100-thread-1) [ x:collection1] o.a.s.c.SolrDeletionPolicy SolrDeletionPolicy.onCommit: commits: num=1
    [junit4] 2> commit{dir=MockDirectoryWrapper(RAMDirectory@5c05d80 lockFactory=org.apache.lucene.store.SingleInstanceLockFactory@79d96328),segFN=segments_1,generation=1}
    [junit4] 2> 346249 INFO (coreLoadExecutor-1100-thread-1) [ x:collection1] o.a.s.c.SolrDeletionPolicy newest commit generation = 1
    [junit4] 2> 346250 INFO (OldIndexDirectoryCleanupThreadForCore-collection1) [ x:collection1] o.a.s.c.SolrCore Looking for old index directories to cleanup for core collection1 in /export/home/jenkins/workspace/Lucene-Solr-master-Solaris/solr/build/solr-core/test/J0/temp/solr.handler.component.SpatialHeatmapFacetsTest_84B7C7CDA2E33448-001/tempDir-001/control/cores/collection1/data/
    [junit4] 2> 346252 WARN (OldIndexDirectoryCleanupThreadForCore-collection1) [ x:collection1] o.a.s.c.DirectoryFactory /export/home/jenkins/workspace/Lucene-Solr-master-Solaris/solr/build/solr-core/test/J0/temp/solr.handler.component.SpatialHeatmapFacetsTest_84B7C7CDA2E33448-001/tempDir-001/control/cores/collection1/data/ does not point to a valid data directory; skipping clean-up of old index directories.
    [junit4] 2> 346256 INFO (coreLoadExecutor-1100-thread-1) [ x:collection1] o.a.s.c.SolrCore no updateRequestProcessorChain defined as default, creating implicit default
    [junit4] 2> 346260 INFO (coreLoadExecutor-1100-thread-1) [ x:collection1] o.a.s.h.l.XMLLoader xsltCacheLifetimeSeconds=60
    [junit4] 2> 346262 INFO (coreLoadExecutor-1100-thread-1) [ x:collection1] o.a.s.h.l.XMLLoader xsltCacheLifetimeSeconds=60
    [junit4] 2> 346262 INFO (coreLoadExecutor-1100-thread-1) [ x:collection1] o.a.s.h.l.XMLLoader xsltCacheLifetimeSeconds=60
    [junit4] 2> 346263 INFO (coreLoadExecutor-1100-thread-1) [ x:collection1] o.a.s.h.l.XMLLoader xsltCacheLifetimeSeconds=60
    [junit4] 2> 346265 INFO (coreLoadExecutor-1100-thread-1) [ x:collection1] o.a.s.c.RequestHandlers Registered paths: /admin/mbeans,standard,/update/csv,/sql,/update/json/docs,/admin/luke,/graph,/export,/admin/segments,/get,/admin/system,/replication,/admin/properties,/config,/stream,/schema,/admin/plugins,/admin/logging,/update/json,/admin/ping,/admin/threads,/update,/admin/file
    [junit4] 2> 346265 INFO (coreLoadExecutor-1100-thread-1) [ x:collection1] o.a.s.c.SolrCore Using default statsCache cache: org.apache.solr.search.stats.LocalStatsCache
    [junit4] 2> 346265 INFO (coreLoadExecutor-1100-thread-1) [ x:collection1] o.a.s.u.CommitTracker Hard AutoCommit: disabled
    [junit4] 2> 346276 INFO (coreLoadExecutor-1100-thread-1) [ x:collection1] o.a.s.u.CommitTracker Soft AutoCommit: disabled
    [junit4] 2> 346276 INFO (coreLoadExecutor-1100-thread-1) [ x:collection1] o.a.s.u.RandomMergePolicy RandomMergePolicy wrapping class org.apache.lucene.index.TieredMergePolicy: [TieredMergePolicy: maxMergeAtOnce=28, maxMergeAtOnceExplicit=36, maxMergedSegmentMB=14.318359375, floorSegmentMB=0.544921875, forceMergeDeletesPctAllowed=10.241382891336874, segmentsPerTier=21.0, maxCFSSegmentSizeMB=8.796093022207999E12, noCFSRatio=0.5577642425964823
    [junit4] 2> 346277 INFO (coreLoadExecutor-1100-thread-1) [ x:collection1] o.a.s.c.SolrDeletionPolicy SolrDeletionPolicy.onInit: commits: num=1
    [junit4] 2> commit{dir=MockDirectoryWrapper(RAMDirectory@5c05d80 lockFactory=org.apache.lucene.store.SingleInstanceLockFactory@79d96328),segFN=segments_1,generation=1}
    [junit4] 2> 346277 INFO (coreLoadExecutor-1100-thread-1) [ x:collection1] o.a.s.c.SolrDeletionPolicy newest commit generation = 1
    [junit4] 2> 346277 INFO (coreLoadExecutor-1100-thread-1) [ x:collection1] o.a.s.s.SolrIndexSearcher Opening [Searcher@f0cfd65[collection1] main]
    [junit4] 2> 346277 WARN (coreLoadExecutor-1100-thread-1) [ x:collection1] o.a.s.r.ManagedResourceStorage Cannot write to config directory /export/home/jenkins/workspace/Lucene-Solr-master-Solaris/solr/core/src/test-files/solr/collection1/conf; switching to use InMemory storage instead.
    [junit4] 2> 346278 INFO (coreLoadExecutor-1100-thread-1) [ x:collection1] o.a.s.r.RestManager Initializing RestManager with initArgs: {}
    [junit4] 2> 346278 INFO (coreLoadExecutor-1100-thread-1) [ x:collection1] o.a.s.r.ManagedResourceStorage Reading _rest_managed.json using InMemoryStorage
    [junit4] 2> 346279 INFO (coreLoadExecutor-1100-thread-1) [ x:collection1] o.a.s.r.RestManager Initializing 0 registered ManagedResources
    [junit4] 2> 346279 INFO (coreLoadExecutor-1100-thread-1) [ x:collection1] o.a.s.h.ReplicationHandler Commits will be reserved for 10000
    [junit4] 2> 346279 INFO (coreLoadExecutor-1100-thread-1) [ x:collection1] o.a.s.c.CoreContainer registering core: collection1
    [junit4] 2> 346280 INFO (searcherExecutor-1101-thread-1-processing-x:collection1) [ x:collection1] o.a.s.c.SolrCore [collection1] Registered new searcher Searcher@f0cfd65[collection1] main{ExitableDirectoryReader(UninvertingDirectoryReader())}
    [junit4] 2> 346855 INFO (TEST-SpatialHeatmapFacetsTest.testPng-seed#[84B7C7CDA2E33448]) [ ] o.e.j.s.Server jetty-9.3.8.v20160314
    [junit4] 2> 346856 INFO (TEST-SpatialHeatmapFacetsTest.testPng-seed#[84B7C7CDA2E33448]) [ ] o.e.j.s.h.ContextHandler Started o.e.j.s.ServletContextHandler@238f02f{/,null,AVAILABLE}
    [junit4] 2> 346857 INFO (TEST-SpatialHeatmapFacetsTest.testPng-seed#[84B7C7CDA2E33448]) [ ] o.e.j.s.ServerConnector Started ServerConnector@214c639{HTTP/1.1,[http/1.1]}{127.0.0.1:54477}
    [junit4] 2> 346857 INFO (TEST-SpatialHeatmapFacetsTest.testPng-seed#[84B7C7CDA2E33448]) [ ] o.e.j.s.Server Started @350477ms
    [junit4] 2> 346857 INFO (TEST-SpatialHeatmapFacetsTest.testPng-seed#[84B7C7CDA2E33448]) [ ] o.a.s.c.s.e.JettySolrRunner Jetty properties: {schema=schema-spatial.xml, solrconfig=solrconfig-basic.xml, hostContext=/, hostPort=54477, coreRootDirectory=/export/home/jenkins/workspace/Lucene-Solr-master-Solaris/solr/build/solr-core/test/J0/temp/solr.handler.component.SpatialHeatmapFacetsTest_84B7C7CDA2E33448-001/tempDir-001/shard0/cores}
    [junit4] 2> 346857 INFO (TEST-SpatialHeatmapFacetsTest.testPng-seed#[84B7C7CDA2E33448]) [ ] o.a.s.s.SolrDispatchFilter SolrDispatchFilter.init(): sun.misc.Launcher$AppClassLoader@6d06d69c
    [junit4] 2> 346858 INFO (TEST-SpatialHeatmapFacetsTest.testPng-seed#[84B7C7CDA2E33448]) [ ] o.a.s.c.SolrResourceLoader new SolrResourceLoader for directory: '/export/home/jenkins/workspace/Lucene-Solr-master-Solaris/solr/build/solr-core/test/J0/temp/solr.handler.component.SpatialHeatmapFacetsTest_84B7C7CDA2E33448-001/tempDir-001/shard0'
    [junit4] 2> 346858 INFO (TEST-SpatialHeatmapFacetsTest.testPng-seed#[84B7C7CDA2E33448]) [ ] o.a.s.c.SolrResourceLoader JNDI not configured for solr (NoInitialContextEx)
    [junit4] 2> 346858 INFO (TEST-SpatialHeatmapFacetsTest.testPng-seed#[84B7C7CDA2E33448]) [ ] o.a.s.c.SolrResourceLoader solr home defaulted to 'solr/' (could not find system property or JNDI)
    [junit4] 2> 346858 INFO (TEST-SpatialHeatmapFacetsTest.testPng-seed#[84B7C7CDA2E33448]) [ ] o.a.s.c.SolrXmlConfig Loading container configuration from /export/home/jenkins/workspace/Lucene-Solr-master-Solaris/solr/build/solr-core/test/J0/temp/solr.handler.component.SpatialHeatmapFacetsTest_84B7C7CDA2E33448-001/tempDir-001/shard0/solr.xml
    [junit4] 2> 346868 INFO (TEST-SpatialHeatmapFacetsTest.testPng-seed#[84B7C7CDA2E33448]) [ ] o.a.s.c.CorePropertiesLocator Config-defined core root directory: /export/home/jenkins/workspace/Lucene-Solr-master-Solaris/solr/build/solr-core/test/J0/temp/solr.handler.component.SpatialHeatmapFacetsTest_84B7C7CDA2E33448-001/tempDir-001/shard0/cores
    [junit4] 2> 346868 INFO (TEST-SpatialHeatmapFacetsTest.testPng-seed#[84B7C7CDA2E33448]) [ ] o.a.s.c.CoreContainer New CoreContainer 1548169755
    [junit4] 2> 346868 INFO (TEST-SpatialHeatmapFacetsTest.testPng-seed#[84B7C7CDA2E33448]) [ ] o.a.s.c.CoreContainer Loading cores into CoreContainer [instanceDir=/export/home/jenkins/workspace/Lucene-Solr-master-Solaris/solr/build/solr-core/test/J0/temp/solr.handler.component.SpatialHeatmapFacetsTest_84B7C7CDA2E33448-001/tempDir-001/shard0]
    [junit4] 2> 346868 WARN (TEST-SpatialHeatmapFacetsTest.testPng-seed#[84B7C7CDA2E33448]) [ ] o.a.s.c.CoreContainer Couldn't add files from /export/home/jenkins/workspace/Lucene-Solr-master-Solaris/solr/build/solr-core/test/J0/temp/solr.handler.component.SpatialHeatmapFacetsTest_84B7C7CDA2E33448-001/tempDir-001/shard0/lib to classpath: /export/home/jenkins/workspace/Lucene-Solr-master-Solaris/solr/build/solr-core/test/J0/temp/solr.handler.component.SpatialHeatmapFacetsTest_84B7C7CDA2E33448-001/tempDir-001/shard0/lib
    [junit4] 2> 346868 INFO (TEST-SpatialHeatmapFacetsTest.testPng-seed#[84B7C7CDA2E33448]) [ ] o.a.s.h.c.HttpShardHandlerFactory created with socketTimeout : 90000,urlScheme : ,connTimeout : 15000,maxConnectionsPerHost : 20,maxConnections : 10000,corePoolSize : 0,maximumPoolSize : 2147483647,maxThreadIdleTime : 5,sizeOfQueue : -1,fairnessPolicy : false,
    [junit4] 2> 346870 INFO (TEST-SpatialHeatmapFacetsTest.testPng-seed#[84B7C7CDA2E33448]) [ ] o.a.s.u.UpdateShardHandler Creating UpdateShardHandler HTTP client with params:
    [junit4] 2> 346871 INFO (TEST-SpatialHeatmapFacetsTest.testPng-seed#[84B7C7CDA2E33448]) [ ] o.a.s.l.LogWatcher SLF4J impl is org.slf4j.impl.Log4jLoggerFactory
    [junit4] 2> 346871 INFO (TEST-SpatialHeatmapFacetsTest.testPng-seed#[84B7C7CDA2E33448]) [ ] o.a.s.l.LogWatcher Registering Log Listener [Log4j (org.slf4j.impl.Log4jLoggerFactory)]
    [junit4] 2> 346871 INFO (TEST-SpatialHeatmapFacetsTest.testPng-seed#[84B7C7CDA2E33448]) [ ] o.a.s.c.CoreContainer Security conf doesn't exist. Skipping setup for authorization module.
    [junit4] 2> 346871 INFO (TEST-SpatialHeatmapFacetsTest.testPng-seed#[84B7C7CDA2E33448]) [ ] o.a.s.c.CoreContainer No authentication plugin used.
    [junit4] 2> 346872 INFO (TEST-SpatialHeatmapFacetsTest.testPng-seed#[84B7C7CDA2E33448]) [ ] o.a.s.c.CorePropertiesLocator Looking for core definitions underneath /export/home/jenkins/workspace/Lucene-Solr-master-Solaris/solr/build/solr-core/test/J0/temp/solr.handler.component.SpatialHeatmapFacetsTest_84B7C7CDA2E33448-001/tempDir-001/shard0/cores
    [junit4] 2> 346873 INFO (TEST-SpatialHeatmapFacetsTest.testPng-seed#[84B7C7CDA2E33448]) [ ] o.a.s.c.CoreDescriptor Created CoreDescriptor: {name=collection1, config=solrconfig-basic.xml, loadOnStartup=true, schema=schema-spatial.xml, configSetProperties=configsetprops.json, transient=false, dataDir=data/, configSet=collection1}
    [junit4] 2> 346873 INFO (TEST-SpatialHeatmapFacetsTest.testPng-seed#[84B7C7CDA2E33448]) [ ] o.a.s.c.CorePropertiesLocator Found core collection1 in /export/home/jenkins/workspace/Lucene-Solr-master-Solaris/solr/build/solr-core/test/J0/temp/solr.handler.component.SpatialHeatmapFacetsTest_84B7C7CDA2E33448-001/tempDir-001/shard0/cores/collection1
    [junit4] 2> 346873 INFO (TEST-SpatialHeatmapFacetsTest.testPng-seed#[84B7C7CDA2E33448]) [ ] o.a.s.c.CorePropertiesLocator Found 1 core definitions
    [junit4] 2> 346874 INFO (TEST-SpatialHeatmapFacetsTest.testPng-seed#[84B7C7CDA2E33448]) [ ] o.a.s.s.SolrDispatchFilter user.dir=/export/home/jenkins/workspace/Lucene-Solr-master-Solaris/solr/build/solr-core/test/J0
    [junit4] 2> 346874 INFO (TEST-SpatialHeatmapFacetsTest.testPng-seed#[84B7C7CDA2E33448]) [ ] o.a.s.s.SolrDispatchFilter SolrDispatchFilter.init() done
    [junit4] 2> 346874 INFO (coreLoadExecutor-1110-thread-1) [ ] o.a.s.c.SolrResourceLoader new SolrResourceLoader for directory: '/export/home/jenkins/workspace/Lucene-Solr-master-Solaris/solr/core/src/test-files/solr/collection1'
    [junit4] 2> 346876 INFO (coreLoadExecutor-1110-thread-1) [ ] o.a.s.c.SolrResourceLoader JNDI not configured for solr (NoInitialContextEx)
    [junit4] 2> 346876 INFO (coreLoadExecutor-1110-thread-1) [ ] o.a.s.c.SolrResourceLoader solr home defaulted to 'solr/' (could not find system property or JNDI)
    [junit4] 2> 346877 INFO (coreLoadExecutor-1110-thread-1) [ ] o.a.s.c.SolrResourceLoader Adding 'file:/export/home/jenkins/workspace/Lucene-Solr-master-Solaris/solr/core/src/test-files/solr/collection1/lib/classes/' to classloader
    [junit4] 2> 346877 INFO (coreLoadExecutor-1110-thread-1) [ ] o.a.s.c.SolrResourceLoader Adding 'file:/export/home/jenkins/workspace/Lucene-Solr-master-Solaris/solr/core/src/test-files/solr/collection1/lib/README' to classloader
    [junit4] 2> 346902 INFO (coreLoadExecutor-1110-thread-1) [ ] o.a.s.c.SolrConfig current version of requestparams : -1
    [junit4] 2> 346904 WARN (coreLoadExecutor-1110-thread-1) [ ] o.a.s.c.Config Beginning with Solr 5.5, <mergePolicy> is deprecated, use <mergePolicyFactory> instead.
    [junit4] 2> 346904 INFO (coreLoadExecutor-1110-thread-1) [ ] o.a.s.c.SolrConfig Using Lucene MatchVersion: 7.0.0
    [junit4] 2> 346909 INFO (coreLoadExecutor-1110-thread-1) [ ] o.a.s.c.SolrConfig Loaded SolrConfig: solrconfig-basic.xml
    [junit4] 2> 346912 INFO (coreLoadExecutor-1110-thread-1) [ ] o.a.s.s.IndexSchema [collection1] Schema name=test
    [junit4] 2> 346935 INFO (coreLoadExecutor-1110-thread-1) [ ] o.a.s.s.IndexSchema unique key field: id
    [junit4] 2> 346938 INFO (coreLoadExecutor-1110-thread-1) [ ] o.a.s.c.ConfigSetProperties Did not find ConfigSet properties, assuming default properties: Can't find resource 'configsetprops.json' in classpath or '/export/home/jenkins/workspace/Lucene-Solr-master-Solaris/solr/core/src/test-files/solr/collection1'
    [junit4] 2> 346938 INFO (coreLoadExecutor-1110-thread-1) [ ] o.a.s.c.CoreContainer Creating SolrCore 'collection1' using configuration from configset /export/home/jenkins/workspace/Lucene-Solr-master-Solaris/solr/core/src/test-files/solr/collection1
    [junit4] 2> 346938 INFO (coreLoadExecutor-1110-thread-1) [ x:collection1] o.a.s.c.SolrCore org.apache.solr.core.MockDirectoryFactory
    [junit4] 2> 346939 INFO (coreLoadExecutor-1110-thread-1) [ x:collection1] o.a.s.c.SolrCore [[collection1] ] Opening new SolrCore at [/export/home/jenkins/workspace/Lucene-Solr-master-Solaris/solr/core/src/test-files/solr/collection1], dataDir=[/export/home/jenkins/workspace/Lucene-Solr-master-Solaris/solr/build/solr-core/test/J0/temp/solr.handler.component.SpatialHeatmapFacetsTest_84B7C7CDA2E33448-001/tempDir-001/shard0/cores/collection1/data/]
    [junit4] 2> 346939 INFO (coreLoadExecutor-1110-thread-1) [ x:collection1] o.a.s.c.SolrCore JMX monitoring not detected for core: collection1
    [junit4] 2> 346939 INFO (coreLoadExecutor-1110-thread-1) [ x:collection1] o.a.s.c.CachingDirectoryFactory return new directory for /export/home/jenkins/workspace/Lucene-Solr-master-Solaris/solr/build/solr-core/test/J0/temp/solr.handler.component.SpatialHeatmapFacetsTest_84B7C7CDA2E33448-001/tempDir-001/shard0/cores/collection1/data
    [junit4] 2> 346939 INFO (coreLoadExecutor-1110-thread-1) [ x:collection1] o.a.s.c.SolrCore New index directory detected: old=null new=/export/home/jenkins/workspace/Lucene-Solr-master-Solaris/solr/build/solr-core/test/J0/temp/solr.handler.component.SpatialHeatmapFacetsTest_84B7C7CDA2E33448-001/tempDir-001/shard0/cores/collection1/data/index/
    [junit4] 2> 346939 WARN (coreLoadExecutor-1110-thread-1) [ x:collection1] o.a.s.c.SolrCore [collection1] Solr index directory '/export/home/jenkins/workspace/Lucene-Solr-master-Solaris/solr/build/solr-core/test/J0/temp/solr.handler.component.SpatialHeatmapFacetsTest_84B7C7CDA2E33448-001/tempDir-001/shard0/cores/collection1/data/index' doesn't exist. Creating new index...
    [junit4] 2> 346939 INFO (coreLoadExecutor-1110-thread-1) [ x:collection1] o.a.s.c.CachingDirectoryFactory return new directory for /export/home/jenkins/workspace/Lucene-Solr-master-Solaris/solr/build/solr-core/test/J0/temp/solr.handler.component.SpatialHeatmapFacetsTest_84B7C7CDA2E33448-001/tempDir-001/shard0/cores/collection1/data/index
    [junit4] 2> 346940 INFO (coreLoadExecutor-1110-thread-1) [ x:collection1] o.a.s.u.RandomMergePolicy RandomMergePolicy wrapping class org.apache.lucene.index.LogDocMergePolicy: [LogDocMergePolicy: minMergeSize=1000, mergeFactor=20, maxMergeSize=9223372036854775807, maxMergeSizeForForcedMerge=9223372036854775807, calibrateSizeByDeletes=true, maxMergeDocs=2147483647, maxCFSSegmentSizeMB=8.796093022207999E12, noCFSRatio=0.0]
    [junit4] 2> 346940 INFO (coreLoadExecutor-1110-thread-1) [ x:collection1] o.a.s.c.SolrDeletionPolicy SolrDeletionPolicy.onCommit: commits: num=1
    [junit4] 2> commit{dir=MockDirectoryWrapper(RAMDirectory@161f8f63 lockFactory=org.apache.lucene.store.SingleInstanceLockFactory@32856cf0),segFN=segments_1,generation=1}
    [junit4] 2> 346940 INFO (coreLoadExecutor-1110-thread-1) [ x:collection1] o.a.s.c.SolrDeletionPolicy newest commit generation = 1
    [junit4] 2> 346941 INFO (OldIndexDirectoryCleanupThreadForCore-collection1) [ x:collection1] o.a.s.c.SolrCore Looking for old index directories to cleanup for core collection1 in /export/home/jenkins/workspace/Lucene-Solr-master-Solaris/solr/build/solr-core/test/J0/temp/solr.handler.component.SpatialHeatmapFacetsTest_84B7C7CDA2E33448-001/tempDir-001/shard0/cores/collection1/data/
    [junit4] 2> 346941 WARN (OldIndexDirectoryCleanupThreadForCore-collection1) [ x:collection1] o.a.s.c.DirectoryFactory /export/home/jenkins/workspace/Lucene-Solr-master-Solaris/solr/build/solr-core/test/J0/temp/solr.handler.component.SpatialHeatmapFacetsTest_84B7C7CDA2E33448-001/tempDir-001/shard0/cores/collection1/data/ does not point to a valid data directory; skipping clean-up of old index directories.
    [junit4] 2> 346945 INFO (coreLoadExecutor-1110-thread-1) [ x:collection1] o.a.s.c.SolrCore no updateRequestProcessorChain defined as default, creating implicit default
    [junit4] 2> 346948 INFO (coreLoadExecutor-1110-thread-1) [ x:collection1] o.a.s.h.l.XMLLoader xsltCacheLifetimeSeconds=60
    [junit4] 2> 346949 INFO (coreLoadExecutor-1110-thread-1) [ x:collection1] o.a.s.h.l.XMLLoader xsltCacheLifetimeSeconds=60
    [junit4] 2> 346950 INFO (coreLoadExecutor-1110-thread-1) [ x:collection1] o.a.s.h.l.XMLLoader xsltCacheLifetimeSeconds=60
    [junit4] 2> 346951 INFO (coreLoadExecutor-1110-thread-1) [ x:collection1] o.a.s.h.l.XMLLoader xsltCacheLifetimeSeconds=60
    [junit4] 2> 346954 INFO (coreLoadExecutor-1110-thread-1) [ x:collection1] o.a.s.c.RequestHandlers Registered paths: /admin/mbeans,standard,/update/csv,/sql,/update/json/docs,/admin/luke,/graph,/export,/admin/segments,/get,/admin/system,/replication,/admin/properties,/config,/stream,/schema,/admin/plugins,/admin/logging,/update/json,/admin/ping,/admin/threads,/update,/admin/file
    [junit4] 2> 346954 INFO (coreLoadExecutor-1110-thread-1) [ x:collection1] o.a.s.c.SolrCore Using default statsCache cache: org.apache.solr.search.stats.LocalStatsCache
    [junit4] 2> 346954 INFO (coreLoadExecutor-1110-thread-1) [ x:collection1] o.a.s.u.CommitTracker Hard AutoCommit: disabled
    [junit4] 2> 346954 INFO (coreLoadExecutor-1110-thread-1) [ x:collection1] o.a.s.u.CommitTracker Soft AutoCommit: disabled
    [junit4] 2> 346954 INFO (coreLoadExecutor-1110-thread-1) [ x:collection1] o.a.s.u.RandomMergePolicy RandomMergePolicy wrapping class org.apache.lucene.index.TieredMergePolicy: [TieredMergePolicy: maxMergeAtOnce=28, maxMergeAtOnceExplicit=36, maxMergedSegmentMB=14.318359375, floorSegmentMB=0.544921875, forceMergeDeletesPctAllowed=10.241382891336874, segmentsPerTier=21.0, maxCFSSegmentSizeMB=8.796093022207999E12, noCFSRatio=0.5577642425964823
    [junit4] 2> 346955 INFO (coreLoadExecutor-1110-thread-1) [ x:collection1] o.a.s.c.SolrDeletionPolicy SolrDeletionPolicy.onInit: commits: num=1
    [junit4] 2> commit{dir=MockDirectoryWrapper(RAMDirectory@161f8f63 lockFactory=org.apache.lucene.store.SingleInstanceLockFactory@32856cf0),segFN=segments_1,generation=1}
    [junit4] 2> 346955 INFO (coreLoadExecutor-1110-thread-1) [ x:collection1] o.a.s.c.SolrDeletionPolicy newest commit generation = 1
    [junit4] 2> 346955 INFO (coreLoadExecutor-1110-thread-1) [ x:collection1] o.a.s.s.SolrIndexSearcher Opening [Searcher@221d773e[collection1] main]
    [junit4] 2> 346955 WARN (coreLoadExecutor-1110-thread-1) [ x:collection1] o.a.s.r.ManagedResourceStorage Cannot write to config directory /export/home/jenkins/workspace/Lucene-Solr-master-Solaris/solr/core/src/test-files/solr/collection1/conf; switching to use InMemory storage instead.
    [junit4] 2> 346955 INFO (coreLoadExecutor-1110-thread-1) [ x:collection1] o.a.s.r.RestManager Initializing RestManager with initArgs: {}
    [junit4] 2> 346955 INFO (coreLoadExecutor-1110-thread-1) [ x:collection1] o.a.s.r.ManagedResourceStorage Reading _rest_managed.json using InMemoryStorage
    [junit4] 2> 346955 INFO (coreLoadExecutor-1110-thread-1) [ x:collection1] o.a.s.r.RestManager Initializing 0 registered ManagedResources
    [junit4] 2> 346956 INFO (coreLoadExecutor-1110-thread-1) [ x:collection1] o.a.s.h.ReplicationHandler Commits will be reserved for 10000
    [junit4] 2> 346956 INFO (searcherExecutor-1111-thread-1-processing-x:collection1) [ x:collection1] o.a.s.c.SolrCore [collection1] Registered new searcher Searcher@221d773e[collection1] main{ExitableDirectoryReader(UninvertingDirectoryReader())}
    [junit4] 2> 346956 INFO (coreLoadExecutor-1110-thread-1) [ x:collection1] o.a.s.c.CoreContainer registering core: collection1
    [junit4] 2> 347555 INFO (TEST-SpatialHeatmapFacetsTest.testPng-seed#[84B7C7CDA2E33448]) [ ] o.a.s.SolrTestCaseJ4 Writing core.properties file to /export/home/jenkins/workspace/Lucene-Solr-master-Solaris/solr/build/solr-core/test/J0/temp/solr.handler.component.SpatialHeatmapFacetsTest_84B7C7CDA2E33448-001/tempDir-001/shard1/cores/collection1
    [junit4] 2> 347556 INFO (TEST-SpatialHeatmapFacetsTest.testPng-seed#[84B7C7CDA2E33448]) [ ] o.e.j.s.Server jetty-9.3.8.v20160314
    [junit4] 2> 347559 INFO (TEST-SpatialHeatmapFacetsTest.testPng-seed#[84B7C7CDA2E33448]) [ ] o.e.j.s.h.ContextHandler Started o.e.j.s.ServletContextHandler@1fc1539b{/,null,AVAILABLE}
    [junit4] 2> 347560 INFO (TEST-SpatialHeatmapFacetsTest.testPng-seed#[84B7C7CDA2E33448]) [ ] o.e.j.s.ServerConnector Started ServerConnector@db3b447{HTTP/1.1,[http/1.1]}{127.0.0.1:37978}
    [junit4] 2> 347560 INFO (TEST-SpatialHeatmapFacetsTest.testPng-seed#[84B7C7CDA2E33448]) [ ] o.e.j.s.Server Started @351180ms
    [junit4] 2> 347560 INFO (TEST-SpatialHeatmapFacetsTest.testPng-seed#[84B7C7CDA2E33448]) [ ] o.a.s.c.s.e.JettySolrRunner Jetty properties: {schema=schema-spatial.xml, solrconfig=solrconfig-basic.xml, hostContext=/, hostPort=37978, coreRootDirectory=/export/home/jenkins/workspace/Lucene-Solr-master-Solaris/solr/build/solr-core/test/J0/temp/solr.handler.component.SpatialHeatmapFacetsTest_84B7C7CDA2E33448-001/tempDir-001/shard1/cores}
    [junit4] 2> 347560 INFO (TEST-SpatialHeatmapFacetsTest.testPng-seed#[84B7C7CDA2E33448]) [ ] o.a.s.s.SolrDispatchFilter SolrDispatchFilter.init(): sun.misc.Launcher$AppClassLoader@6d06d69c
    [junit4] 2> 347560 INFO (TEST-SpatialHeatmapFacetsTest.testPng-seed#[84B7C7CDA2E33448]) [ ] o.a.s.c.SolrResourceLoader new SolrResourceLoader for directory: '/export/home/jenkins/workspace/Lucene-Solr-master-Solaris/solr/build/solr-core/test/J0/temp/solr.handler.component.SpatialHeatmapFacetsTest_84B7C7CDA2E33448-001/tempDir-001/shard1'
    [junit4] 2> 347561 INFO (TEST-SpatialHeatmapFacetsTest.testPng-seed#[84B7C7CDA2E33448]) [ ] o.a.s.c.SolrResourceLoader JNDI not configured for solr (NoInitialContextEx)
    [junit4] 2> 347561 INFO (TEST-SpatialHeatmapFacetsTest.testPng-seed#[84B7C7CDA2E33448]) [ ] o.a.s.c.SolrResourceLoader solr home defaulted to 'solr/' (could not find system property or JNDI)
    [junit4] 2> 347561 INFO (TEST-SpatialHeatmapFacetsTest.testPng-seed#[84B7C7CDA2E33448]) [ ] o.a.s.c.SolrXmlConfig Loading container configuration from /export/home/jenkins/workspace/Lucene-Solr-master-Solaris/solr/build/solr-core/test/J0/temp/solr.handler.component.SpatialHeatmapFacetsTest_84B7C7CDA2E33448-001/tempDir-001/shard1/solr.xml
    [junit4] 2> 347567 INFO (TEST-SpatialHeatmapFacetsTest.testPng-seed#[84B7C7CDA2E33448]) [ ] o.a.s.c.CorePropertiesLocator Config-defined core root directory: /export/home/jenkins/workspace/Lucene-Solr-master-Solaris/solr/build/solr-core/test/J0/temp/solr.handler.component.SpatialHeatmapFacetsTest_84B7C7CDA2E33448-001/tempDir-001/shard1/cores
    [junit4] 2> 347567 INFO (TEST-SpatialHeatmapFacetsTest.testPng-seed#[84B7C7CDA2E33448]) [ ] o.a.s.c.CoreContainer New CoreContainer 1698759084
    [junit4] 2> 347567 INFO (TEST-SpatialHeatmapFacetsTest.testPng-seed#[84B7C7CDA2E33448]) [ ] o.a.s.c.CoreContainer Loading cores into CoreContainer [instanceDir=/export/home/jenkins/workspace/Lucene-Solr-master-Solaris/solr/build/solr-core/test/J0/temp/solr.handler.component.SpatialHeatmapFacetsTest_84B7C7CDA2E33448-001/tempDir-001/shard1]
    [junit4] 2> 347567 WARN (TEST-SpatialHeatmapFacetsTest.testPng-seed#[84B7C7CDA2E33448]) [ ] o.a.s.c.CoreContainer Couldn't add files from /export/home/jenkins/workspace/Lucene-Solr-master-Solaris/solr/build/solr-core/test/J0/temp/solr.handler.component.SpatialHeatmapFacetsTest_84B7C7CDA2E33448-001/tempDir-001/shard1/lib to classpath: /export/home/jenkins/workspace/Lucene-Solr-master-Solaris/solr/build/solr-core/test/J0/temp/solr.handler.component.SpatialHeatmapFacetsTest_84B7C7CDA2E33448-001/tempDir-001/shard1/lib
    [junit4] 2> 347567 INFO (TEST-SpatialHeatmapFacetsTest.testPng-seed#[84B7C7CDA2E33448]) [ ] o.a.s.h.c.HttpShardHandlerFactory created with socketTimeout : 90000,urlScheme : ,connTimeout : 15000,maxConnectionsPerHost : 20,maxConnections : 10000,corePoolSize : 0,maximumPoolSize : 2147483647,maxThreadIdleTime : 5,sizeOfQueue : -1,fairnessPolicy : false,
    [junit4] 2> 347569 INFO (TEST-SpatialHeatmapFacetsTest.testPng-seed#[84B7C7CDA2E33448]) [ ] o.a.s.u.UpdateShardHandler Creating UpdateShardHandler HTTP client with params:
    [junit4] 2> 347571 INFO (TEST-SpatialHeatmapFacetsTest.testPng-seed#[84B7C7CDA2E33448]) [ ] o.a.s.l.LogWatcher SLF4J impl is org.slf4j.impl.Log4jLoggerFactory
    [junit4] 2> 347571 INFO (TEST-SpatialHeatmapFacetsTest.testPng-seed#[84B7C7CDA2E33448]) [ ] o.a.s.l.LogWatcher Registering Log Listener [Log4j (org.slf4j.impl.Log4jLoggerFactory)]
    [junit4] 2> 347571 INFO (TEST-SpatialHeatmapFacetsTest.testPng-seed#[84B7C7CDA2E33448]) [ ] o.a.s.c.CoreContainer Security conf doesn't exist. Skipping setup for authorization module.
    [junit4] 2> 347571 INFO (TEST-SpatialHeatmapFacetsTest.testPng-seed#[84B7C7CDA2E33448]) [ ] o.a.s.c.CoreContainer No authentication plugin used.
    [junit4] 2> 347574 INFO (TEST-SpatialHeatmapFacetsTest.testPng-seed#[84B7C7CDA2E33448]) [ ] o.a.s.c.CorePropertiesLocator Looking for core definitions underneath /export/home/jenkins/workspace/Lucene-Solr-master-Solaris/solr/build/solr-core/test/J0/temp/solr.handler.component.SpatialHeatmapFacetsTest_84B7C7CDA2E33448-001/tempDir-001/shard1/cores
    [junit4] 2> 347577 INFO (TEST-SpatialHeatmapFacetsTest.testPng-seed#[84B7C7CDA2E33448]) [ ] o.a.s.c.CoreDescriptor Created CoreDescriptor: {name=collection1, config=solrconfig-basic.xml, loadOnStartup=true, schema=schema-spatial.xml, configSetProperties=configsetprops.json, transient=false, dataDir=data/, configSet=collection1}
    [junit4] 2> 347577 INFO (TEST-SpatialHeatmapFacetsTest.testPng-seed#[84B7C7CDA2E33448]) [ ] o.a.s.c.CorePropertiesLocator Found core collection1 in /export/home/jenkins/workspace/Lucene-Solr-master-Solaris/solr/build/solr-core/test/J0/temp/solr.handler.component.SpatialHeatmapFacetsTest_84B7C7CDA2E33448-001/tempDir-001/shard1/cores/collection1
    [junit4] 2> 347577 INFO (TEST-SpatialHeatmapFacetsTest.testPng-seed#[84B7C7CDA2E33448]) [ ] o.a.s.c.CorePropertiesLocator Found 1 core definitions
    [junit4] 2> 347579 INFO (coreLoadExecutor-1120-thread-1) [ ] o.a.s.c.SolrResourceLoader new SolrResourceLoader for directory: '/export/home/jenkins/workspace/Lucene-Solr-master-Solaris/solr/core/src/test-files/solr/collection1'
    [junit4] 2> 347583 INFO (coreLoadExecutor-1120-thread-1) [ ] o.a.s.c.SolrResourceLoader JNDI not configured for solr (NoInitialContextEx)
    [junit4] 2> 347583 INFO (coreLoadExecutor-1120-thread-1) [ ] o.a.s.c.SolrResourceLoader solr home defaulted to 'solr/' (could not find system property or JNDI)
    [junit4] 2> 347583 INFO (coreLoadExecutor-1120-thread-1) [ ] o.a.s.c.SolrResourceLoader Adding 'file:/export/home/jenkins/workspace/Lucene-Solr-master-Solaris/solr/core/src/test-files/solr/collection1/lib/classes/' to classloader
    [junit4] 2> 347583 INFO (coreLoadExecutor-1120-thread-1) [ ] o.a.s.c.SolrResourceLoader Adding 'file:/export/home/jenkins/workspace/Lucene-Solr-master-Solaris/solr/core/src/test-files/solr/collection1/lib/README' to classloader
    [junit4] 2> 347584 INFO (TEST-SpatialHeatmapFacetsTest.testPng-seed#[84B7C7CDA2E33448]) [ ] o.a.s.s.SolrDispatchFilter user.dir=/export/home/jenkins/workspace/Lucene-Solr-master-Solaris/solr/build/solr-core/test/J0
    [junit4] 2> 347584 INFO (TEST-SpatialHeatmapFacetsTest.testPng-seed#[84B7C7CDA2E33448]) [ ] o.a.s.s.SolrDispatchFilter SolrDispatchFilter.init() done
    [junit4] 2> 347630 INFO (coreLoadExecutor-1120-thread-1) [ ] o.a.s.c.SolrConfig current version of requestparams : -1
    [junit4] 2> 347632 WARN (coreLoadExecutor-1120-thread-1) [ ] o.a.s.c.Config Beginning with Solr 5.5, <mergePolicy> is deprecated, use <mergePolicyFactory> instead.
    [junit4] 2> 347633 INFO (coreLoadExecutor-1120-thread-1) [ ] o.a.s.c.SolrConfig Using Lucene MatchVersion: 7.0.0
    [junit4] 2> 347649 INFO (coreLoadExecutor-1120-thread-1) [ ] o.a.s.c.SolrConfig Loaded SolrConfig: solrconfig-basic.xml
    [junit4] 2> 347653 INFO (coreLoadExecutor-1120-thread-1) [ ] o.a.s.s.IndexSchema [collection1] Schema name=test
    [junit4] 2> 347659 INFO (coreLoadExecutor-1120-thread-1) [ ] o.a.s.s.IndexSchema unique key field: id
    [junit4] 2> 347661 INFO (coreLoadExecutor-1120-thread-1) [ ] o.a.s.c.ConfigSetProperties Did not find ConfigSet properties, assuming default properties: Can't find resource 'configsetprops.json' in classpath or '/export/home/jenkins/workspace/Lucene-Solr-master-Solaris/solr/core/src/test-files/solr/collection1'
    [junit4] 2> 347661 INFO (coreLoadExecutor-1120-thread-1) [ ] o.a.s.c.CoreContainer Creating SolrCore 'collection1' using configuration from configset /export/home/jenkins/workspace/Lucene-Solr-master-Solaris/solr/core/src/test-files/solr/collection1
    [junit4] 2> 347661 INFO (coreLoadExecutor-1120-thread-1) [ x:collection1] o.a.s.c.SolrCore org.apache.solr.core.MockDirectoryFactory
    [junit4] 2> 347661 INFO (coreLoadExecutor-1120-thread-1) [ x:collection1] o.a.s.c.SolrCore [[collection1] ] Opening new SolrCore at [/export/home/jenkins/workspace/Lucene-Solr-master-Solaris/solr/core/src/test-files/solr/collection1], dataDir=[/export/home/jenkins/workspace/Lucene-Solr-master-Solaris/solr/build/solr-core/test/J0/temp/solr.handler.component.SpatialHeatmapFacetsTest_84B7C7CDA2E33448-001/tempDir-001/shard1/cores/collection1/data/]
    [junit4] 2> 347661 INFO (coreLoadExecutor-1120-thread-1) [ x:collection1] o.a.s.c.SolrCore JMX monitoring not detected for core: collection1
    [junit4] 2> 347662 INFO (coreLoadExecutor-1120-thread-1) [ x:collection1] o.a.s.c.CachingDirectoryFactory return new directory for /export/home/jenkins/workspace/Lucene-Solr-master-Solaris/solr/build/solr-core/test/J0/temp/solr.handler.component.SpatialHeatmapFacetsTest_84B7C7CDA2E33448-001/tempDir-001/shard1/cores/collection1/data
    [junit4] 2> 347662 INFO (coreLoadExecutor-1120-thread-1) [ x:collection1] o.a.s.c.SolrCore New index directory detected: old=null new=/export/home/jenkins/workspace/Lucene-Solr-master-Solaris/solr/build/solr-core/test/J0/temp/solr.handler.component.SpatialHeatmapFacetsTest_84B7C7CDA2E33448-001/tempDir-001/shard1/cores/collection1/data/index/
    [junit4] 2> 347662 WARN (coreLoadExecutor-1120-thread-1) [ x:collection1] o.a.s.c.SolrCore [collection1] Solr index directory '/export/home/jenkins/workspace/Lucene-Solr-master-Solaris/solr/build/solr-core/test/J0/temp/solr.handler.component.SpatialHeatmapFacetsTest_84B7C7CDA2E33448-001/tempDir-001/shard1/cores/collection1/data/index' doesn't exist. Creating new index...
    [junit4] 2> 347662 INFO (coreLoadExecutor-1120-thread-1) [ x:collection1] o.a.s.c.CachingDirectoryFactory return new directory for /export/home/jenkins/workspace/Lucene-Solr-master-Solaris/solr/build/solr-core/test/J0/temp/solr.handler.component.SpatialHeatmapFacetsTest_84B7C7CDA2E33448-001/tempDir-001/shard1/cores/collection1/data/index
    [junit4] 2> 347662 INFO (coreLoadExecutor-1120-thread-1) [ x:collection1] o.a.s.u.RandomMergePolicy RandomMergePolicy wrapping class org.apache.lucene.index.LogDocMergePolicy: [LogDocMergePolicy: minMergeSize=1000, mergeFactor=20, maxMergeSize=9223372036854775807, maxMergeSizeForForcedMerge=9223372036854775807, calibrateSizeByDeletes=true, maxMergeDocs=2147483647, maxCFSSegmentSizeMB=8.796093022207999E12, noCFSRatio=0.0]
    [junit4] 2> 347663 INFO (coreLoadExecutor-1120-thread-1) [ x:collection1] o.a.s.c.SolrDeletionPolicy SolrDeletionPolicy.onCommit: commits: num=1
    [junit4] 2> commit{dir=MockDirectoryWr

[...truncated too long message...]

99-thread-1) [ x:collection1] o.a.s.c.CachingDirectoryFactory looking to close /export/home/jenkins/workspace/Lucene-Solr-master-Solaris/solr/build/solr-core/test/J0/temp/solr.handler.component.SpatialHeatmapFacetsTest_84B7C7CDA2E33448-001/tempDir-004/shard1/cores/collection1/data [CachedDir<<refCount=0;path=/export/home/jenkins/workspace/Lucene-Solr-master-Solaris/solr/build/solr-core/test/J0/temp/solr.handler.component.SpatialHeatmapFacetsTest_84B7C7CDA2E33448-001/tempDir-004/shard1/cores/collection1/data;done=false>>]
    [junit4] 2> 7563652 INFO (coreCloseExecutor-1499-thread-1) [ x:collection1] o.a.s.c.CachingDirectoryFactory Closing directory, CoreContainer#isShutdown=true
    [junit4] 2> 7563652 INFO (coreCloseExecutor-1499-thread-1) [ x:collection1] o.a.s.c.CachingDirectoryFactory Closing directory: /export/home/jenkins/workspace/Lucene-Solr-master-Solaris/solr/build/solr-core/test/J0/temp/solr.handler.component.SpatialHeatmapFacetsTest_84B7C7CDA2E33448-001/tempDir-004/shard1/cores/collection1/data
    [junit4] 2> 7563652 INFO (coreCloseExecutor-1499-thread-1) [ x:collection1] o.a.s.c.CachingDirectoryFactory looking to close /export/home/jenkins/workspace/Lucene-Solr-master-Solaris/solr/build/solr-core/test/J0/temp/solr.handler.component.SpatialHeatmapFacetsTest_84B7C7CDA2E33448-001/tempDir-004/shard1/cores/collection1/data/index [CachedDir<<refCount=0;path=/export/home/jenkins/workspace/Lucene-Solr-master-Solaris/solr/build/solr-core/test/J0/temp/solr.handler.component.SpatialHeatmapFacetsTest_84B7C7CDA2E33448-001/tempDir-004/shard1/cores/collection1/data/index;done=false>>]
    [junit4] 2> 7563652 INFO (coreCloseExecutor-1499-thread-1) [ x:collection1] o.a.s.c.CachingDirectoryFactory Closing directory, CoreContainer#isShutdown=true
    [junit4] 2> 7563652 INFO (coreCloseExecutor-1499-thread-1) [ x:collection1] o.a.s.c.CachingDirectoryFactory Closing directory: /export/home/jenkins/workspace/Lucene-Solr-master-Solaris/solr/build/solr-core/test/J0/temp/solr.handler.component.SpatialHeatmapFacetsTest_84B7C7CDA2E33448-001/tempDir-004/shard1/cores/collection1/data/index
    [junit4] 2> 7563662 INFO (TEST-SpatialHeatmapFacetsTest.test-seed#[84B7C7CDA2E33448]) [ ] o.e.j.s.h.ContextHandler Stopped o.e.j.s.ServletContextHandler@71c56833{/,null,UNAVAILABLE}
    [junit4] 2> 7563686 INFO (TEST-SpatialHeatmapFacetsTest.test-seed#[84B7C7CDA2E33448]) [ ] o.e.j.s.ServerConnector Stopped ServerConnector@72320f2d{HTTP/1.1,[http/1.1]}{127.0.0.1:0}
    [junit4] 2> 7563686 INFO (TEST-SpatialHeatmapFacetsTest.test-seed#[84B7C7CDA2E33448]) [ ] o.a.s.c.CoreContainer Shutting down CoreContainer instance=1810766624
    [junit4] 2> 7563686 INFO (coreCloseExecutor-1501-thread-1) [ x:collection1] o.a.s.c.SolrCore [collection1] CLOSING SolrCore org.apache.solr.core.SolrCore@14edbdb6
    [junit4] 2> 7563687 INFO (coreCloseExecutor-1501-thread-1) [ x:collection1] o.a.s.u.DirectUpdateHandler2 closing DirectUpdateHandler2{commits=1,autocommits=0,soft autocommits=0,optimizes=0,rollbacks=0,expungeDeletes=0,docsPending=0,adds=0,deletesById=0,deletesByQuery=0,errors=0,cumulative_adds=2,cumulative_deletesById=0,cumulative_deletesByQuery=0,cumulative_errors=0}
    [junit4] 2> 7563687 INFO (coreCloseExecutor-1501-thread-1) [ x:collection1] o.a.s.u.SolrCoreState Closing SolrCoreState
    [junit4] 2> 7563687 INFO (coreCloseExecutor-1501-thread-1) [ x:collection1] o.a.s.u.DefaultSolrCoreState SolrCoreState ref count has reached 0 - closing IndexWriter
    [junit4] 2> 7563687 INFO (coreCloseExecutor-1501-thread-1) [ x:collection1] o.a.s.u.DefaultSolrCoreState closing IndexWriter with IndexWriterCloser
    [junit4] 2> 7563688 INFO (coreCloseExecutor-1501-thread-1) [ x:collection1] o.a.s.c.SolrCore [collection1] Closing main searcher on request.
    [junit4] 2> 7563688 INFO (coreCloseExecutor-1501-thread-1) [ x:collection1] o.a.s.c.CachingDirectoryFactory Closing MockDirectoryFactory - 2 directories currently being tracked
    [junit4] 2> 7563688 INFO (coreCloseExecutor-1501-thread-1) [ x:collection1] o.a.s.c.CachingDirectoryFactory looking to close /export/home/jenkins/workspace/Lucene-Solr-master-Solaris/solr/build/solr-core/test/J0/temp/solr.handler.component.SpatialHeatmapFacetsTest_84B7C7CDA2E33448-001/tempDir-004/shard2/cores/collection1/data [CachedDir<<refCount=0;path=/export/home/jenkins/workspace/Lucene-Solr-master-Solaris/solr/build/solr-core/test/J0/temp/solr.handler.component.SpatialHeatmapFacetsTest_84B7C7CDA2E33448-001/tempDir-004/shard2/cores/collection1/data;done=false>>]
    [junit4] 2> 7563689 INFO (coreCloseExecutor-1501-thread-1) [ x:collection1] o.a.s.c.CachingDirectoryFactory Closing directory, CoreContainer#isShutdown=true
    [junit4] 2> 7563689 INFO (coreCloseExecutor-1501-thread-1) [ x:collection1] o.a.s.c.CachingDirectoryFactory Closing directory: /export/home/jenkins/workspace/Lucene-Solr-master-Solaris/solr/build/solr-core/test/J0/temp/solr.handler.component.SpatialHeatmapFacetsTest_84B7C7CDA2E33448-001/tempDir-004/shard2/cores/collection1/data
    [junit4] 2> 7563689 INFO (coreCloseExecutor-1501-thread-1) [ x:collection1] o.a.s.c.CachingDirectoryFactory looking to close /export/home/jenkins/workspace/Lucene-Solr-master-Solaris/solr/build/solr-core/test/J0/temp/solr.handler.component.SpatialHeatmapFacetsTest_84B7C7CDA2E33448-001/tempDir-004/shard2/cores/collection1/data/index [CachedDir<<refCount=0;path=/export/home/jenkins/workspace/Lucene-Solr-master-Solaris/solr/build/solr-core/test/J0/temp/solr.handler.component.SpatialHeatmapFacetsTest_84B7C7CDA2E33448-001/tempDir-004/shard2/cores/collection1/data/index;done=false>>]
    [junit4] 2> 7563689 INFO (coreCloseExecutor-1501-thread-1) [ x:collection1] o.a.s.c.CachingDirectoryFactory Closing directory, CoreContainer#isShutdown=true
    [junit4] 2> 7563689 INFO (coreCloseExecutor-1501-thread-1) [ x:collection1] o.a.s.c.CachingDirectoryFactory Closing directory: /export/home/jenkins/workspace/Lucene-Solr-master-Solaris/solr/build/solr-core/test/J0/temp/solr.handler.component.SpatialHeatmapFacetsTest_84B7C7CDA2E33448-001/tempDir-004/shard2/cores/collection1/data/index
    [junit4] 2> 7563689 INFO (TEST-SpatialHeatmapFacetsTest.test-seed#[84B7C7CDA2E33448]) [ ] o.e.j.s.h.ContextHandler Stopped o.e.j.s.ServletContextHandler@7c67aa34{/,null,UNAVAILABLE}
    [junit4] 2> 7563692 INFO (SUITE-SpatialHeatmapFacetsTest-seed#[84B7C7CDA2E33448]-worker) [ ] o.a.s.SolrTestCaseJ4 ###deleteCore
    [junit4] 2> NOTE: leaving temporary files on disk at: /export/home/jenkins/workspace/Lucene-Solr-master-Solaris/solr/build/solr-core/test/J0/temp/solr.handler.component.SpatialHeatmapFacetsTest_84B7C7CDA2E33448-001
    [junit4] 2> Jun 16, 2016 8:31:51 PM com.carrotsearch.randomizedtesting.ThreadLeakControl tryToInterruptAll
    [junit4] 2> INFO: All leaked threads terminated.
    [junit4] 2> NOTE: test params are: codec=Asserting(Lucene62): {id=PostingsFormat(name=Memory doPackFST= true), srpt_quad=PostingsFormat(name=Memory doPackFST= true)}, docValues:{}, maxPointsInLeafNode=1045, maxMBSortInHeap=6.59561090860542, sim=RandomSimilarity(queryNorm=false,coord=crazy): {}, locale=tr, timezone=Europe/Berlin
    [junit4] 2> NOTE: SunOS 5.11 amd64/Oracle Corporation 1.8.0_92 (64-bit)/cpus=3,threads=1,free=50893056,total=189956096
    [junit4] 2> NOTE: All tests run in this JVM: [AtomicUpdatesTest, TestCollapseQParserPlugin, RegexBoostProcessorTest, SolrIndexConfigTest, TestSmileRequest, ZkControllerTest, CloneFieldUpdateProcessorFactoryTest, ConnectionManagerTest, DistributedFacetPivotLongTailTest, ClusterStateTest, TestDefaultSearchFieldResource, TestAddFieldRealTimeGet, TestCoreContainer, TestCloudInspectUtil, LeaderElectionTest, BlockCacheTest, RulesTest, TestLRUCache, MigrateRouteKeyTest, AlternateDirectoryTest, TestTolerantSearch, SpatialFilterTest, LeaderInitiatedRecoveryOnCommitTest, RequiredFieldsTest, CircularListTest, DocValuesMultiTest, PolyFieldTest, SimpleFacetsTest, SpatialHeatmapFacetsTest]
    [junit4] 2> NOTE: reproduce with: ant test -Dtestcase=SpatialHeatmapFacetsTest -Dtests.seed=84B7C7CDA2E33448 -Dtests.slow=true -Dtests.locale=tr -Dtests.timezone=Europe/Berlin -Dtests.asserts=true -Dtests.file.encoding=UTF-8
    [junit4] ERROR 0.00s J0 | SpatialHeatmapFacetsTest (suite) <<<
    [junit4] > Throwable #1: java.lang.Exception: Suite timeout exceeded (>= 7200000 msec).
    [junit4] > at __randomizedtesting.SeedInfo.seed([84B7C7CDA2E33448]:0)
    [junit4] Completed [491/614 (1!)] on J0 in 7220.19s, 4 tests, 2 errors <<< FAILURES!

[...truncated 399 lines...]
BUILD FAILED
/export/home/jenkins/workspace/Lucene-Solr-master-Solaris/build.xml:740: The following error occurred while executing this line:
/export/home/jenkins/workspace/Lucene-Solr-master-Solaris/build.xml:684: The following error occurred while executing this line:
/export/home/jenkins/workspace/Lucene-Solr-master-Solaris/build.xml:59: The following error occurred while executing this line:
/export/home/jenkins/workspace/Lucene-Solr-master-Solaris/solr/build.xml:233: The following error occurred while executing this line:
/export/home/jenkins/workspace/Lucene-Solr-master-Solaris/solr/common-build.xml:531: The following error occurred while executing this line:
/export/home/jenkins/workspace/Lucene-Solr-master-Solaris/lucene/common-build.xml:1427: The following error occurred while executing this line:
/export/home/jenkins/workspace/Lucene-Solr-master-Solaris/lucene/common-build.xml:984: There were test failures: 614 suites (10 ignored), 2584 tests, 1 suite-level error, 1 error, 88 ignored (73 assumptions) [seed: 84B7C7CDA2E33448]

Total time: 174 minutes 20 seconds
Build step 'Invoke Ant' marked build as failure
Archiving artifacts
[WARNINGS] Skipping publisher since build result is FAILURE
Recording test results
Email was triggered for: Failure - Any
Sending email for trigger: Failure - Any

Search Discussions

Discussion Posts

Follow ups

Related Discussions

Discussion Navigation
viewthread | post
posts ‹ prev | 1 of 3 | next ›
Discussion Overview
groupdev @
categorieslucene
postedJun 16, '16 at 9:00p
activeJun 17, '16 at 6:43a
posts3
users3
websitelucene.apache.org

People

Translate

site design / logo © 2017 Grokbase