Grokbase Groups Lucene dev June 2016
FAQ
Build: http://jenkins.thetaphi.de/job/Lucene-Solr-6.x-Solaris/202/
Java: 64bit/jdk1.8.0 -XX:+UseCompressedOops -XX:+UseG1GC

1 tests failed.
FAILED: org.apache.solr.schema.TestManagedSchemaAPI.test

Error Message:
Error from server at http://127.0.0.1:53307/solr/testschemaapi_shard1_replica2: ERROR: [doc=2] unknown field 'myNewField1'

Stack Trace:
org.apache.solr.client.solrj.impl.CloudSolrClient$RouteException: Error from server at http://127.0.0.1:53307/solr/testschemaapi_shard1_replica2: ERROR: [doc=2] unknown field 'myNewField1'
  at __randomizedtesting.SeedInfo.seed([2CE8DE1A020A97C5:A4BCE1C0ACF6FA3D]:0)
  at org.apache.solr.client.solrj.impl.CloudSolrClient.directUpdate(CloudSolrClient.java:697)
  at org.apache.solr.client.solrj.impl.CloudSolrClient.sendRequest(CloudSolrClient.java:1109)
  at org.apache.solr.client.solrj.impl.CloudSolrClient.requestWithRetryOnStaleState(CloudSolrClient.java:998)
  at org.apache.solr.client.solrj.impl.CloudSolrClient.request(CloudSolrClient.java:934)
  at org.apache.solr.schema.TestManagedSchemaAPI.testAddFieldAndDocument(TestManagedSchemaAPI.java:86)
  at org.apache.solr.schema.TestManagedSchemaAPI.test(TestManagedSchemaAPI.java:55)
  at sun.reflect.NativeMethodAccessorImpl.invoke0(Native Method)
  at sun.reflect.NativeMethodAccessorImpl.invoke(NativeMethodAccessorImpl.java:62)
  at sun.reflect.DelegatingMethodAccessorImpl.invoke(DelegatingMethodAccessorImpl.java:43)
  at java.lang.reflect.Method.invoke(Method.java:498)
  at com.carrotsearch.randomizedtesting.RandomizedRunner.invoke(RandomizedRunner.java:1764)
  at com.carrotsearch.randomizedtesting.RandomizedRunner$8.evaluate(RandomizedRunner.java:871)
  at com.carrotsearch.randomizedtesting.RandomizedRunner$9.evaluate(RandomizedRunner.java:907)
  at com.carrotsearch.randomizedtesting.RandomizedRunner$10.evaluate(RandomizedRunner.java:921)
  at com.carrotsearch.randomizedtesting.rules.SystemPropertiesRestoreRule$1.evaluate(SystemPropertiesRestoreRule.java:57)
  at org.apache.lucene.util.TestRuleSetupTeardownChained$1.evaluate(TestRuleSetupTeardownChained.java:49)
  at org.apache.lucene.util.AbstractBeforeAfterRule$1.evaluate(AbstractBeforeAfterRule.java:45)
  at org.apache.lucene.util.TestRuleThreadAndTestName$1.evaluate(TestRuleThreadAndTestName.java:48)
  at org.apache.lucene.util.TestRuleIgnoreAfterMaxFailures$1.evaluate(TestRuleIgnoreAfterMaxFailures.java:64)
  at org.apache.lucene.util.TestRuleMarkFailure$1.evaluate(TestRuleMarkFailure.java:47)
  at com.carrotsearch.randomizedtesting.rules.StatementAdapter.evaluate(StatementAdapter.java:36)
  at com.carrotsearch.randomizedtesting.ThreadLeakControl$StatementRunner.run(ThreadLeakControl.java:367)
  at com.carrotsearch.randomizedtesting.ThreadLeakControl.forkTimeoutingTask(ThreadLeakControl.java:809)
  at com.carrotsearch.randomizedtesting.ThreadLeakControl$3.evaluate(ThreadLeakControl.java:460)
  at com.carrotsearch.randomizedtesting.RandomizedRunner.runSingleTest(RandomizedRunner.java:880)
  at com.carrotsearch.randomizedtesting.RandomizedRunner$5.evaluate(RandomizedRunner.java:781)
  at com.carrotsearch.randomizedtesting.RandomizedRunner$6.evaluate(RandomizedRunner.java:816)
  at com.carrotsearch.randomizedtesting.RandomizedRunner$7.evaluate(RandomizedRunner.java:827)
  at com.carrotsearch.randomizedtesting.rules.StatementAdapter.evaluate(StatementAdapter.java:36)
  at com.carrotsearch.randomizedtesting.rules.SystemPropertiesRestoreRule$1.evaluate(SystemPropertiesRestoreRule.java:57)
  at org.apache.lucene.util.AbstractBeforeAfterRule$1.evaluate(AbstractBeforeAfterRule.java:45)
  at com.carrotsearch.randomizedtesting.rules.StatementAdapter.evaluate(StatementAdapter.java:36)
  at org.apache.lucene.util.TestRuleStoreClassName$1.evaluate(TestRuleStoreClassName.java:41)
  at com.carrotsearch.randomizedtesting.rules.NoShadowingOrOverridesOnMethodsRule$1.evaluate(NoShadowingOrOverridesOnMethodsRule.java:40)
  at com.carrotsearch.randomizedtesting.rules.NoShadowingOrOverridesOnMethodsRule$1.evaluate(NoShadowingOrOverridesOnMethodsRule.java:40)
  at com.carrotsearch.randomizedtesting.rules.StatementAdapter.evaluate(StatementAdapter.java:36)
  at com.carrotsearch.randomizedtesting.rules.StatementAdapter.evaluate(StatementAdapter.java:36)
  at com.carrotsearch.randomizedtesting.rules.StatementAdapter.evaluate(StatementAdapter.java:36)
  at org.apache.lucene.util.TestRuleAssertionsRequired$1.evaluate(TestRuleAssertionsRequired.java:53)
  at org.apache.lucene.util.TestRuleMarkFailure$1.evaluate(TestRuleMarkFailure.java:47)
  at org.apache.lucene.util.TestRuleIgnoreAfterMaxFailures$1.evaluate(TestRuleIgnoreAfterMaxFailures.java:64)
  at org.apache.lucene.util.TestRuleIgnoreTestSuites$1.evaluate(TestRuleIgnoreTestSuites.java:54)
  at com.carrotsearch.randomizedtesting.rules.StatementAdapter.evaluate(StatementAdapter.java:36)
  at com.carrotsearch.randomizedtesting.ThreadLeakControl$StatementRunner.run(ThreadLeakControl.java:367)
  at java.lang.Thread.run(Thread.java:745)
Caused by: org.apache.solr.client.solrj.impl.HttpSolrClient$RemoteSolrException: Error from server at http://127.0.0.1:53307/solr/testschemaapi_shard1_replica2: ERROR: [doc=2] unknown field 'myNewField1'
  at org.apache.solr.client.solrj.impl.HttpSolrClient.executeMethod(HttpSolrClient.java:590)
  at org.apache.solr.client.solrj.impl.HttpSolrClient.request(HttpSolrClient.java:259)
  at org.apache.solr.client.solrj.impl.HttpSolrClient.request(HttpSolrClient.java:248)
  at org.apache.solr.client.solrj.impl.LBHttpSolrClient.doRequest(LBHttpSolrClient.java:403)
  at org.apache.solr.client.solrj.impl.LBHttpSolrClient.request(LBHttpSolrClient.java:356)
  at org.apache.solr.client.solrj.impl.CloudSolrClient.lambda$directUpdate$0(CloudSolrClient.java:674)
  at java.util.concurrent.FutureTask.run(FutureTask.java:266)
  at org.apache.solr.common.util.ExecutorUtil$MDCAwareThreadPoolExecutor.lambda$execute$0(ExecutorUtil.java:229)
  at java.util.concurrent.ThreadPoolExecutor.runWorker(ThreadPoolExecutor.java:1142)
  at java.util.concurrent.ThreadPoolExecutor$Worker.run(ThreadPoolExecutor.java:617)
  ... 1 more




Build Log:
[...truncated 12273 lines...]
    [junit4] Suite: org.apache.solr.schema.TestManagedSchemaAPI
    [junit4] 2> Creating dataDir: /export/home/jenkins/workspace/Lucene-Solr-6.x-Solaris/solr/build/solr-core/test/J1/temp/solr.schema.TestManagedSchemaAPI_2CE8DE1A020A97C5-001/init-core-data-001
    [junit4] 2> 3409565 INFO (SUITE-TestManagedSchemaAPI-seed#[2CE8DE1A020A97C5]-worker) [ ] o.a.s.SolrTestCaseJ4 Randomized ssl (false) and clientAuth (false) via: @org.apache.solr.util.RandomizeSSL(reason=, value=NaN, ssl=NaN, clientAuth=NaN)
    [junit4] 2> 3409565 INFO (SUITE-TestManagedSchemaAPI-seed#[2CE8DE1A020A97C5]-worker) [ ] o.a.s.c.ZkTestServer STARTING ZK TEST SERVER
    [junit4] 2> 3409565 INFO (Thread-10783) [ ] o.a.s.c.ZkTestServer client port:0.0.0.0/0.0.0.0:0
    [junit4] 2> 3409566 INFO (Thread-10783) [ ] o.a.s.c.ZkTestServer Starting server
    [junit4] 2> 3409665 INFO (SUITE-TestManagedSchemaAPI-seed#[2CE8DE1A020A97C5]-worker) [ ] o.a.s.c.ZkTestServer start zk server on port:44872
    [junit4] 2> 3409666 INFO (SUITE-TestManagedSchemaAPI-seed#[2CE8DE1A020A97C5]-worker) [ ] o.a.s.c.c.SolrZkClient Using default ZkCredentialsProvider
    [junit4] 2> 3409666 INFO (SUITE-TestManagedSchemaAPI-seed#[2CE8DE1A020A97C5]-worker) [ ] o.a.s.c.c.ConnectionManager Waiting for client to connect to ZooKeeper
    [junit4] 2> 3409668 INFO (zkCallback-4235-thread-1) [ ] o.a.s.c.c.ConnectionManager Watcher org.apache.solr.common.cloud.ConnectionManager@3f9b9864 name:ZooKeeperConnection Watcher:127.0.0.1:44872 got event WatchedEvent state:SyncConnected type:None path:null path:null type:None
    [junit4] 2> 3409669 INFO (SUITE-TestManagedSchemaAPI-seed#[2CE8DE1A020A97C5]-worker) [ ] o.a.s.c.c.ConnectionManager Client is connected to ZooKeeper
    [junit4] 2> 3409669 INFO (SUITE-TestManagedSchemaAPI-seed#[2CE8DE1A020A97C5]-worker) [ ] o.a.s.c.c.SolrZkClient Using default ZkACLProvider
    [junit4] 2> 3409669 INFO (SUITE-TestManagedSchemaAPI-seed#[2CE8DE1A020A97C5]-worker) [ ] o.a.s.c.c.SolrZkClient makePath: /solr/solr.xml
    [junit4] 2> 3409674 INFO (jetty-launcher-4234-thread-2) [ ] o.e.j.s.Server jetty-9.3.8.v20160314
    [junit4] 2> 3409677 INFO (jetty-launcher-4234-thread-2) [ ] o.e.j.s.h.ContextHandler Started o.e.j.s.ServletContextHandler@15b01777{/solr,null,AVAILABLE}
    [junit4] 2> 3409678 INFO (jetty-launcher-4234-thread-2) [ ] o.e.j.s.ServerConnector Started ServerConnector@79630253{HTTP/1.1,[http/1.1]}{127.0.0.1:53307}
    [junit4] 2> 3409679 INFO (jetty-launcher-4234-thread-2) [ ] o.e.j.s.Server Started @3415106ms
    [junit4] 2> 3409679 INFO (jetty-launcher-4234-thread-2) [ ] o.a.s.c.s.e.JettySolrRunner Jetty properties: {hostContext=/solr, hostPort=53307}
    [junit4] 2> 3409679 INFO (jetty-launcher-4234-thread-2) [ ] o.a.s.s.SolrDispatchFilter SolrDispatchFilter.init(): sun.misc.Launcher$AppClassLoader@6d06d69c
    [junit4] 2> 3409679 INFO (jetty-launcher-4234-thread-2) [ ] o.a.s.c.SolrResourceLoader new SolrResourceLoader for directory: '/export/home/jenkins/workspace/Lucene-Solr-6.x-Solaris/solr/build/solr-core/test/J1/temp/solr.schema.TestManagedSchemaAPI_2CE8DE1A020A97C5-001/tempDir-001/node2'
    [junit4] 2> 3409679 INFO (jetty-launcher-4234-thread-2) [ ] o.a.s.c.SolrResourceLoader JNDI not configured for solr (NoInitialContextEx)
    [junit4] 2> 3409679 INFO (jetty-launcher-4234-thread-2) [ ] o.a.s.c.SolrResourceLoader solr home defaulted to 'solr/' (could not find system property or JNDI)
    [junit4] 2> 3409679 INFO (jetty-launcher-4234-thread-2) [ ] o.a.s.c.c.SolrZkClient Using default ZkCredentialsProvider
    [junit4] 2> 3409680 INFO (jetty-launcher-4234-thread-2) [ ] o.a.s.c.c.ConnectionManager Waiting for client to connect to ZooKeeper
    [junit4] 2> 3409682 INFO (zkCallback-4236-thread-1) [ ] o.a.s.c.c.ConnectionManager Watcher org.apache.solr.common.cloud.ConnectionManager@1cc3722f name:ZooKeeperConnection Watcher:127.0.0.1:44872/solr got event WatchedEvent state:SyncConnected type:None path:null path:null type:None
    [junit4] 2> 3409682 INFO (jetty-launcher-4234-thread-2) [ ] o.a.s.c.c.ConnectionManager Client is connected to ZooKeeper
    [junit4] 2> 3409682 INFO (jetty-launcher-4234-thread-2) [ ] o.a.s.c.c.SolrZkClient Using default ZkACLProvider
    [junit4] 2> 3409683 INFO (jetty-launcher-4234-thread-2) [ ] o.a.s.s.SolrDispatchFilter solr.xml found in ZooKeeper. Loading...
    [junit4] 2> 3409688 INFO (jetty-launcher-4234-thread-2) [ ] o.a.s.c.CorePropertiesLocator Config-defined core root directory: /export/home/jenkins/workspace/Lucene-Solr-6.x-Solaris/solr/build/solr-core/test/J1/temp/solr.schema.TestManagedSchemaAPI_2CE8DE1A020A97C5-001/tempDir-001/node2/.
    [junit4] 2> 3409688 INFO (jetty-launcher-4234-thread-2) [ ] o.a.s.c.CoreContainer New CoreContainer 1891887630
    [junit4] 2> 3409688 INFO (jetty-launcher-4234-thread-2) [ ] o.a.s.c.CoreContainer Loading cores into CoreContainer [instanceDir=/export/home/jenkins/workspace/Lucene-Solr-6.x-Solaris/solr/build/solr-core/test/J1/temp/solr.schema.TestManagedSchemaAPI_2CE8DE1A020A97C5-001/tempDir-001/node2]
    [junit4] 2> 3409688 WARN (jetty-launcher-4234-thread-2) [ ] o.a.s.c.CoreContainer Couldn't add files from /export/home/jenkins/workspace/Lucene-Solr-6.x-Solaris/solr/build/solr-core/test/J1/temp/solr.schema.TestManagedSchemaAPI_2CE8DE1A020A97C5-001/tempDir-001/node2/lib to classpath: /export/home/jenkins/workspace/Lucene-Solr-6.x-Solaris/solr/build/solr-core/test/J1/temp/solr.schema.TestManagedSchemaAPI_2CE8DE1A020A97C5-001/tempDir-001/node2/lib
    [junit4] 2> 3409689 INFO (jetty-launcher-4234-thread-2) [ ] o.a.s.h.c.HttpShardHandlerFactory created with socketTimeout : 90000,urlScheme : ,connTimeout : 15000,maxConnectionsPerHost : 20,maxConnections : 10000,corePoolSize : 0,maximumPoolSize : 2147483647,maxThreadIdleTime : 5,sizeOfQueue : -1,fairnessPolicy : false,useRetries : false,
    [junit4] 2> 3409690 INFO (jetty-launcher-4234-thread-2) [ ] o.a.s.u.UpdateShardHandler Creating UpdateShardHandler HTTP client with params: socketTimeout=340000&connTimeout=45000&retry=true
    [junit4] 2> 3409690 INFO (jetty-launcher-4234-thread-1) [ ] o.e.j.s.Server jetty-9.3.8.v20160314
    [junit4] 2> 3409690 INFO (jetty-launcher-4234-thread-2) [ ] o.a.s.l.LogWatcher SLF4J impl is org.slf4j.impl.Log4jLoggerFactory
    [junit4] 2> 3409690 INFO (jetty-launcher-4234-thread-2) [ ] o.a.s.l.LogWatcher Registering Log Listener [Log4j (org.slf4j.impl.Log4jLoggerFactory)]
    [junit4] 2> 3409690 INFO (jetty-launcher-4234-thread-2) [ ] o.a.s.c.ZkContainer Zookeeper client=127.0.0.1:44872/solr
    [junit4] 2> 3409690 INFO (jetty-launcher-4234-thread-2) [ ] o.a.s.c.ZkController zkHost includes chroot
    [junit4] 2> 3409690 INFO (jetty-launcher-4234-thread-2) [ ] o.a.s.c.c.SolrZkClient Using default ZkCredentialsProvider
    [junit4] 2> 3409691 INFO (jetty-launcher-4234-thread-2) [ ] o.a.s.c.c.ConnectionManager Waiting for client to connect to ZooKeeper
    [junit4] 2> 3409692 INFO (jetty-launcher-4234-thread-1) [ ] o.e.j.s.h.ContextHandler Started o.e.j.s.ServletContextHandler@6dd1df7b{/solr,null,AVAILABLE}
    [junit4] 2> 3409692 INFO (jetty-launcher-4234-thread-1) [ ] o.e.j.s.ServerConnector Started ServerConnector@63e9291a{HTTP/1.1,[http/1.1]}{127.0.0.1:53776}
    [junit4] 2> 3409692 INFO (jetty-launcher-4234-thread-1) [ ] o.e.j.s.Server Started @3415120ms
    [junit4] 2> 3409692 INFO (jetty-launcher-4234-thread-1) [ ] o.a.s.c.s.e.JettySolrRunner Jetty properties: {hostContext=/solr, hostPort=53776}
    [junit4] 2> 3409693 INFO (jetty-launcher-4234-thread-1) [ ] o.a.s.s.SolrDispatchFilter SolrDispatchFilter.init(): sun.misc.Launcher$AppClassLoader@6d06d69c
    [junit4] 2> 3409694 INFO (jetty-launcher-4234-thread-1) [ ] o.a.s.c.SolrResourceLoader new SolrResourceLoader for directory: '/export/home/jenkins/workspace/Lucene-Solr-6.x-Solaris/solr/build/solr-core/test/J1/temp/solr.schema.TestManagedSchemaAPI_2CE8DE1A020A97C5-001/tempDir-001/node1'
    [junit4] 2> 3409694 INFO (jetty-launcher-4234-thread-1) [ ] o.a.s.c.SolrResourceLoader JNDI not configured for solr (NoInitialContextEx)
    [junit4] 2> 3409694 INFO (jetty-launcher-4234-thread-1) [ ] o.a.s.c.SolrResourceLoader solr home defaulted to 'solr/' (could not find system property or JNDI)
    [junit4] 2> 3409694 INFO (zkCallback-4239-thread-1) [ ] o.a.s.c.c.ConnectionManager Watcher org.apache.solr.common.cloud.ConnectionManager@778efec3 name:ZooKeeperConnection Watcher:127.0.0.1:44872 got event WatchedEvent state:SyncConnected type:None path:null path:null type:None
    [junit4] 2> 3409694 INFO (jetty-launcher-4234-thread-1) [ ] o.a.s.c.c.SolrZkClient Using default ZkCredentialsProvider
    [junit4] 2> 3409694 INFO (jetty-launcher-4234-thread-2) [ ] o.a.s.c.c.ConnectionManager Client is connected to ZooKeeper
    [junit4] 2> 3409694 INFO (jetty-launcher-4234-thread-2) [ ] o.a.s.c.c.SolrZkClient Using default ZkACLProvider
    [junit4] 2> 3409695 INFO (jetty-launcher-4234-thread-1) [ ] o.a.s.c.c.ConnectionManager Waiting for client to connect to ZooKeeper
    [junit4] 2> 3409697 INFO (zkCallback-4240-thread-1) [ ] o.a.s.c.c.ConnectionManager Watcher org.apache.solr.common.cloud.ConnectionManager@40b217c1 name:ZooKeeperConnection Watcher:127.0.0.1:44872/solr got event WatchedEvent state:SyncConnected type:None path:null path:null type:None
    [junit4] 2> 3409697 INFO (jetty-launcher-4234-thread-1) [ ] o.a.s.c.c.ConnectionManager Client is connected to ZooKeeper
    [junit4] 2> 3409697 INFO (jetty-launcher-4234-thread-2) [n:127.0.0.1:53307_solr ] o.a.s.c.ZkController Added new OnReconnect listener org.apache.solr.cloud.ZkController$$Lambda$73/469018861@57c8fc06
    [junit4] 2> 3409697 INFO (jetty-launcher-4234-thread-1) [ ] o.a.s.c.c.SolrZkClient Using default ZkACLProvider
    [junit4] 2> 3409697 INFO (jetty-launcher-4234-thread-2) [n:127.0.0.1:53307_solr ] o.a.s.c.c.ConnectionManager Waiting for client to connect to ZooKeeper
    [junit4] 2> 3409698 INFO (jetty-launcher-4234-thread-1) [ ] o.a.s.s.SolrDispatchFilter solr.xml found in ZooKeeper. Loading...
    [junit4] 2> 3409699 INFO (zkCallback-4241-thread-1-processing-n:127.0.0.1:53307_solr) [n:127.0.0.1:53307_solr ] o.a.s.c.c.ConnectionManager Watcher org.apache.solr.common.cloud.ConnectionManager@14c42c6c name:ZooKeeperConnection Watcher:127.0.0.1:44872/solr got event WatchedEvent state:SyncConnected type:None path:null path:null type:None
    [junit4] 2> 3409699 INFO (jetty-launcher-4234-thread-2) [n:127.0.0.1:53307_solr ] o.a.s.c.c.ConnectionManager Client is connected to ZooKeeper
    [junit4] 2> 3409700 INFO (jetty-launcher-4234-thread-2) [n:127.0.0.1:53307_solr ] o.a.s.c.c.SolrZkClient makePath: /overseer/queue
    [junit4] 2> 3409702 INFO (jetty-launcher-4234-thread-1) [ ] o.a.s.c.CorePropertiesLocator Config-defined core root directory: /export/home/jenkins/workspace/Lucene-Solr-6.x-Solaris/solr/build/solr-core/test/J1/temp/solr.schema.TestManagedSchemaAPI_2CE8DE1A020A97C5-001/tempDir-001/node1/.
    [junit4] 2> 3409702 INFO (jetty-launcher-4234-thread-1) [ ] o.a.s.c.CoreContainer New CoreContainer 3383832
    [junit4] 2> 3409702 INFO (jetty-launcher-4234-thread-1) [ ] o.a.s.c.CoreContainer Loading cores into CoreContainer [instanceDir=/export/home/jenkins/workspace/Lucene-Solr-6.x-Solaris/solr/build/solr-core/test/J1/temp/solr.schema.TestManagedSchemaAPI_2CE8DE1A020A97C5-001/tempDir-001/node1]
    [junit4] 2> 3409702 WARN (jetty-launcher-4234-thread-1) [ ] o.a.s.c.CoreContainer Couldn't add files from /export/home/jenkins/workspace/Lucene-Solr-6.x-Solaris/solr/build/solr-core/test/J1/temp/solr.schema.TestManagedSchemaAPI_2CE8DE1A020A97C5-001/tempDir-001/node1/lib to classpath: /export/home/jenkins/workspace/Lucene-Solr-6.x-Solaris/solr/build/solr-core/test/J1/temp/solr.schema.TestManagedSchemaAPI_2CE8DE1A020A97C5-001/tempDir-001/node1/lib
    [junit4] 2> 3409702 INFO (jetty-launcher-4234-thread-1) [ ] o.a.s.h.c.HttpShardHandlerFactory created with socketTimeout : 90000,urlScheme : ,connTimeout : 15000,maxConnectionsPerHost : 20,maxConnections : 10000,corePoolSize : 0,maximumPoolSize : 2147483647,maxThreadIdleTime : 5,sizeOfQueue : -1,fairnessPolicy : false,useRetries : false,
    [junit4] 2> 3409703 INFO (jetty-launcher-4234-thread-2) [n:127.0.0.1:53307_solr ] o.a.s.c.c.SolrZkClient makePath: /overseer/collection-queue-work
    [junit4] 2> 3409703 INFO (jetty-launcher-4234-thread-1) [ ] o.a.s.u.UpdateShardHandler Creating UpdateShardHandler HTTP client with params: socketTimeout=340000&connTimeout=45000&retry=true
    [junit4] 2> 3409704 INFO (jetty-launcher-4234-thread-1) [ ] o.a.s.l.LogWatcher SLF4J impl is org.slf4j.impl.Log4jLoggerFactory
    [junit4] 2> 3409704 INFO (jetty-launcher-4234-thread-1) [ ] o.a.s.l.LogWatcher Registering Log Listener [Log4j (org.slf4j.impl.Log4jLoggerFactory)]
    [junit4] 2> 3409704 INFO (jetty-launcher-4234-thread-1) [ ] o.a.s.c.ZkContainer Zookeeper client=127.0.0.1:44872/solr
    [junit4] 2> 3409704 INFO (jetty-launcher-4234-thread-1) [ ] o.a.s.c.ZkController zkHost includes chroot
    [junit4] 2> 3409704 INFO (jetty-launcher-4234-thread-1) [ ] o.a.s.c.c.SolrZkClient Using default ZkCredentialsProvider
    [junit4] 2> 3409704 INFO (jetty-launcher-4234-thread-1) [ ] o.a.s.c.c.ConnectionManager Waiting for client to connect to ZooKeeper
    [junit4] 2> 3409706 INFO (zkCallback-4244-thread-1) [ ] o.a.s.c.c.ConnectionManager Watcher org.apache.solr.common.cloud.ConnectionManager@645486f9 name:ZooKeeperConnection Watcher:127.0.0.1:44872 got event WatchedEvent state:SyncConnected type:None path:null path:null type:None
    [junit4] 2> 3409706 INFO (jetty-launcher-4234-thread-1) [ ] o.a.s.c.c.ConnectionManager Client is connected to ZooKeeper
    [junit4] 2> 3409706 INFO (jetty-launcher-4234-thread-1) [ ] o.a.s.c.c.SolrZkClient Using default ZkACLProvider
    [junit4] 2> 3409708 INFO (jetty-launcher-4234-thread-1) [n:127.0.0.1:53776_solr ] o.a.s.c.ZkController Added new OnReconnect listener org.apache.solr.cloud.ZkController$$Lambda$73/469018861@1ff7bdd4
    [junit4] 2> 3409708 INFO (jetty-launcher-4234-thread-1) [n:127.0.0.1:53776_solr ] o.a.s.c.c.ConnectionManager Waiting for client to connect to ZooKeeper
    [junit4] 2> 3409709 INFO (jetty-launcher-4234-thread-2) [n:127.0.0.1:53307_solr ] o.a.s.c.c.SolrZkClient makePath: /overseer/collection-map-running
    [junit4] 2> 3409710 INFO (zkCallback-4245-thread-1-processing-n:127.0.0.1:53776_solr) [n:127.0.0.1:53776_solr ] o.a.s.c.c.ConnectionManager Watcher org.apache.solr.common.cloud.ConnectionManager@24567648 name:ZooKeeperConnection Watcher:127.0.0.1:44872/solr got event WatchedEvent state:SyncConnected type:None path:null path:null type:None
    [junit4] 2> 3409710 INFO (jetty-launcher-4234-thread-1) [n:127.0.0.1:53776_solr ] o.a.s.c.c.ConnectionManager Client is connected to ZooKeeper
    [junit4] 2> 3409712 INFO (jetty-launcher-4234-thread-2) [n:127.0.0.1:53307_solr ] o.a.s.c.c.SolrZkClient makePath: /overseer/collection-map-completed
    [junit4] 2> 3409715 INFO (jetty-launcher-4234-thread-2) [n:127.0.0.1:53307_solr ] o.a.s.c.c.SolrZkClient makePath: /overseer/collection-map-failure
    [junit4] 2> 3409717 INFO (jetty-launcher-4234-thread-1) [n:127.0.0.1:53776_solr ] o.a.s.c.c.SolrZkClient makePath: /live_nodes
    [junit4] 2> 3409718 INFO (jetty-launcher-4234-thread-2) [n:127.0.0.1:53307_solr ] o.a.s.c.c.SolrZkClient makePath: /live_nodes
    [junit4] 2> 3409719 INFO (jetty-launcher-4234-thread-2) [n:127.0.0.1:53307_solr ] o.a.s.c.c.SolrZkClient makePath: /collections
    [junit4] 2> 3409720 INFO (jetty-launcher-4234-thread-1) [n:127.0.0.1:53776_solr ] o.a.s.c.c.SolrZkClient makePath: /collections
    [junit4] 2> 3409722 INFO (jetty-launcher-4234-thread-2) [n:127.0.0.1:53307_solr ] o.a.s.c.c.SolrZkClient makePath: /aliases.json
    [junit4] 2> 3409722 INFO (jetty-launcher-4234-thread-1) [n:127.0.0.1:53776_solr ] o.a.s.c.c.SolrZkClient makePath: /aliases.json
    [junit4] 2> 3409724 INFO (jetty-launcher-4234-thread-1) [n:127.0.0.1:53776_solr ] o.a.s.c.c.SolrZkClient makePath: /clusterstate.json
    [junit4] 2> 3409724 INFO (jetty-launcher-4234-thread-2) [n:127.0.0.1:53307_solr ] o.a.s.c.c.SolrZkClient makePath: /clusterstate.json
    [junit4] 2> 3409726 INFO (jetty-launcher-4234-thread-1) [n:127.0.0.1:53776_solr ] o.a.s.c.c.SolrZkClient makePath: /security.json
    [junit4] 2> 3409726 INFO (jetty-launcher-4234-thread-2) [n:127.0.0.1:53307_solr ] o.a.s.c.c.SolrZkClient makePath: /security.json
    [junit4] 2> 3409728 INFO (jetty-launcher-4234-thread-2) [n:127.0.0.1:53307_solr ] o.a.s.c.c.ZkStateReader Updating cluster state from ZooKeeper...
    [junit4] 2> 3409728 INFO (jetty-launcher-4234-thread-1) [n:127.0.0.1:53776_solr ] o.a.s.c.c.ZkStateReader Updating cluster state from ZooKeeper...
    [junit4] 2> 3409729 INFO (jetty-launcher-4234-thread-2) [n:127.0.0.1:53307_solr ] o.a.s.c.c.ZkStateReader Loaded empty cluster properties
    [junit4] 2> 3409729 INFO (jetty-launcher-4234-thread-1) [n:127.0.0.1:53776_solr ] o.a.s.c.c.ZkStateReader Loaded empty cluster properties
    [junit4] 2> 3409730 INFO (jetty-launcher-4234-thread-1) [n:127.0.0.1:53776_solr ] o.a.s.c.c.ZkStateReader Updated live nodes from ZooKeeper... (0) -> (0)
    [junit4] 2> 3409730 INFO (jetty-launcher-4234-thread-2) [n:127.0.0.1:53307_solr ] o.a.s.c.c.ZkStateReader Updated live nodes from ZooKeeper... (0) -> (0)
    [junit4] 2> 3409735 INFO (jetty-launcher-4234-thread-1) [n:127.0.0.1:53776_solr ] o.a.s.c.c.SolrZkClient makePath: /overseer_elect
    [junit4] 2> 3409735 INFO (jetty-launcher-4234-thread-2) [n:127.0.0.1:53307_solr ] o.a.s.c.c.SolrZkClient makePath: /overseer_elect
    [junit4] 2> 3409736 INFO (jetty-launcher-4234-thread-1) [n:127.0.0.1:53776_solr ] o.a.s.c.c.SolrZkClient makePath: /overseer_elect/election
    [junit4] 2> 3409737 INFO (jetty-launcher-4234-thread-2) [n:127.0.0.1:53307_solr ] o.a.s.c.c.SolrZkClient makePath: /overseer_elect/election
    [junit4] 2> 3409738 INFO (jetty-launcher-4234-thread-2) [n:127.0.0.1:53307_solr ] o.a.s.c.Overseer Overseer (id=null) closing
    [junit4] 2> 3409738 INFO (jetty-launcher-4234-thread-1) [n:127.0.0.1:53776_solr ] o.a.s.c.Overseer Overseer (id=null) closing
    [junit4] 2> 3409738 INFO (jetty-launcher-4234-thread-2) [n:127.0.0.1:53307_solr ] o.a.s.c.LeaderElector Joined leadership election with path: /overseer_elect/election/96083350999924740-127.0.0.1:53307_solr-n_0000000000
    [junit4] 2> 3409739 INFO (jetty-launcher-4234-thread-1) [n:127.0.0.1:53776_solr ] o.a.s.c.LeaderElector Joined leadership election with path: /overseer_elect/election/96083350999924742-127.0.0.1:53776_solr-n_0000000001
    [junit4] 2> 3409739 INFO (jetty-launcher-4234-thread-2) [n:127.0.0.1:53307_solr ] o.a.s.c.OverseerElectionContext I am going to be the leader 127.0.0.1:53307_solr
    [junit4] 2> 3409739 INFO (jetty-launcher-4234-thread-2) [n:127.0.0.1:53307_solr ] o.a.s.c.c.SolrZkClient makePath: /overseer_elect/leader
    [junit4] 2> 3409740 INFO (jetty-launcher-4234-thread-1) [n:127.0.0.1:53776_solr ] o.a.s.c.LeaderElector Watching path /overseer_elect/election/96083350999924740-127.0.0.1:53307_solr-n_0000000000 to know if I could be the leader
    [junit4] 2> 3409740 INFO (jetty-launcher-4234-thread-1) [n:127.0.0.1:53776_solr ] o.a.s.c.ZkController Register node as live in ZooKeeper:/live_nodes/127.0.0.1:53776_solr
    [junit4] 2> 3409740 INFO (jetty-launcher-4234-thread-1) [n:127.0.0.1:53776_solr ] o.a.s.c.c.SolrZkClient makePath: /live_nodes/127.0.0.1:53776_solr
    [junit4] 2> 3409743 INFO (zkCallback-4241-thread-1-processing-n:127.0.0.1:53307_solr) [n:127.0.0.1:53307_solr ] o.a.s.c.c.ZkStateReader A live node change: [WatchedEvent state:SyncConnected type:NodeChildrenChanged path:/live_nodes], has occurred - updating... (live nodes size: [0])
    [junit4] 2> 3409743 INFO (zkCallback-4245-thread-1-processing-n:127.0.0.1:53776_solr) [n:127.0.0.1:53776_solr ] o.a.s.c.c.ZkStateReader A live node change: [WatchedEvent state:SyncConnected type:NodeChildrenChanged path:/live_nodes], has occurred - updating... (live nodes size: [0])
    [junit4] 2> 3409745 INFO (zkCallback-4245-thread-1-processing-n:127.0.0.1:53776_solr) [n:127.0.0.1:53776_solr ] o.a.s.c.c.ZkStateReader Updated live nodes from ZooKeeper... (0) -> (1)
    [junit4] 2> 3409746 INFO (zkCallback-4241-thread-1-processing-n:127.0.0.1:53307_solr) [n:127.0.0.1:53307_solr ] o.a.s.c.c.ZkStateReader Updated live nodes from ZooKeeper... (0) -> (1)
    [junit4] 2> 3409747 INFO (jetty-launcher-4234-thread-2) [n:127.0.0.1:53307_solr ] o.a.s.c.Overseer Overseer (id=96083350999924740-127.0.0.1:53307_solr-n_0000000000) starting
    [junit4] 2> 3409749 INFO (jetty-launcher-4234-thread-2) [n:127.0.0.1:53307_solr ] o.a.s.c.c.SolrZkClient makePath: /overseer/queue-work
    [junit4] 2> 3409755 INFO (jetty-launcher-4234-thread-2) [n:127.0.0.1:53307_solr ] o.a.s.c.OverseerAutoReplicaFailoverThread Starting OverseerAutoReplicaFailoverThread autoReplicaFailoverWorkLoopDelay=10000 autoReplicaFailoverWaitAfterExpiration=30000 autoReplicaFailoverBadNodeExpiration=60000
    [junit4] 2> 3409756 INFO (jetty-launcher-4234-thread-2) [n:127.0.0.1:53307_solr ] o.a.s.c.ZkController Publish node=127.0.0.1:53307_solr as DOWN
    [junit4] 2> 3409757 INFO (OverseerCollectionConfigSetProcessor-96083350999924740-127.0.0.1:53307_solr-n_0000000000) [n:127.0.0.1:53307_solr ] o.a.s.c.OverseerTaskProcessor Process current queue of overseer operations
    [junit4] 2> 3409758 INFO (jetty-launcher-4234-thread-1) [n:127.0.0.1:53776_solr ] o.a.s.c.CoreContainer Security conf doesn't exist. Skipping setup for authorization module.
    [junit4] 2> 3409758 INFO (jetty-launcher-4234-thread-1) [n:127.0.0.1:53776_solr ] o.a.s.c.CoreContainer No authentication plugin used.
    [junit4] 2> 3409758 INFO (jetty-launcher-4234-thread-1) [n:127.0.0.1:53776_solr ] o.a.s.c.CorePropertiesLocator Looking for core definitions underneath /export/home/jenkins/workspace/Lucene-Solr-6.x-Solaris/solr/build/solr-core/test/J1/temp/solr.schema.TestManagedSchemaAPI_2CE8DE1A020A97C5-001/tempDir-001/node1/.
    [junit4] 2> 3409759 INFO (jetty-launcher-4234-thread-1) [n:127.0.0.1:53776_solr ] o.a.s.c.CorePropertiesLocator Found 0 core definitions
    [junit4] 2> 3409760 INFO (jetty-launcher-4234-thread-1) [n:127.0.0.1:53776_solr ] o.a.s.s.SolrDispatchFilter user.dir=/export/home/jenkins/workspace/Lucene-Solr-6.x-Solaris/solr/build/solr-core/test/J1
    [junit4] 2> 3409760 INFO (jetty-launcher-4234-thread-1) [n:127.0.0.1:53776_solr ] o.a.s.s.SolrDispatchFilter SolrDispatchFilter.init() done
    [junit4] 2> 3409760 INFO (OverseerStateUpdate-96083350999924740-127.0.0.1:53307_solr-n_0000000000) [n:127.0.0.1:53307_solr ] o.a.s.c.Overseer Starting to work on the main queue
    [junit4] 2> 3409762 INFO (OverseerStateUpdate-96083350999924740-127.0.0.1:53307_solr-n_0000000000) [n:127.0.0.1:53307_solr ] o.a.s.c.c.ZkStateReader Updated live nodes from ZooKeeper... (1) -> (1)
    [junit4] 2> 3409764 INFO (OverseerStateUpdate-96083350999924740-127.0.0.1:53307_solr-n_0000000000) [n:127.0.0.1:53307_solr ] o.a.s.c.Overseer processMessage: queueSize: 1, message = {
    [junit4] 2> "operation":"downnode",
    [junit4] 2> "node_name":"127.0.0.1:53307_solr"} current state version: 0
    [junit4] 2> 3409764 INFO (OverseerStateUpdate-96083350999924740-127.0.0.1:53307_solr-n_0000000000) [n:127.0.0.1:53307_solr ] o.a.s.c.o.NodeMutator DownNode state invoked for node: 127.0.0.1:53307_solr
    [junit4] 2> 3410758 INFO (jetty-launcher-4234-thread-2) [n:127.0.0.1:53307_solr ] o.a.s.c.ZkController Register node as live in ZooKeeper:/live_nodes/127.0.0.1:53307_solr
    [junit4] 2> 3410758 INFO (jetty-launcher-4234-thread-2) [n:127.0.0.1:53307_solr ] o.a.s.c.c.SolrZkClient makePath: /live_nodes/127.0.0.1:53307_solr
    [junit4] 2> 3410761 INFO (zkCallback-4241-thread-1-processing-n:127.0.0.1:53307_solr) [n:127.0.0.1:53307_solr ] o.a.s.c.c.ZkStateReader A live node change: [WatchedEvent state:SyncConnected type:NodeChildrenChanged path:/live_nodes], has occurred - updating... (live nodes size: [1])
    [junit4] 2> 3410761 INFO (zkCallback-4245-thread-1-processing-n:127.0.0.1:53776_solr) [n:127.0.0.1:53776_solr ] o.a.s.c.c.ZkStateReader A live node change: [WatchedEvent state:SyncConnected type:NodeChildrenChanged path:/live_nodes], has occurred - updating... (live nodes size: [1])
    [junit4] 2> 3410761 INFO (zkCallback-4241-thread-1-processing-n:127.0.0.1:53307_solr) [n:127.0.0.1:53307_solr ] o.a.s.c.c.ZkStateReader Updated live nodes from ZooKeeper... (1) -> (2)
    [junit4] 2> 3410783 INFO (zkCallback-4245-thread-1-processing-n:127.0.0.1:53776_solr) [n:127.0.0.1:53776_solr ] o.a.s.c.c.ZkStateReader Updated live nodes from ZooKeeper... (1) -> (2)
    [junit4] 2> 3410795 INFO (jetty-launcher-4234-thread-2) [n:127.0.0.1:53307_solr ] o.a.s.c.CoreContainer Security conf doesn't exist. Skipping setup for authorization module.
    [junit4] 2> 3410795 INFO (jetty-launcher-4234-thread-2) [n:127.0.0.1:53307_solr ] o.a.s.c.CoreContainer No authentication plugin used.
    [junit4] 2> 3410796 INFO (jetty-launcher-4234-thread-2) [n:127.0.0.1:53307_solr ] o.a.s.c.CorePropertiesLocator Looking for core definitions underneath /export/home/jenkins/workspace/Lucene-Solr-6.x-Solaris/solr/build/solr-core/test/J1/temp/solr.schema.TestManagedSchemaAPI_2CE8DE1A020A97C5-001/tempDir-001/node2/.
    [junit4] 2> 3410796 INFO (jetty-launcher-4234-thread-2) [n:127.0.0.1:53307_solr ] o.a.s.c.CorePropertiesLocator Found 0 core definitions
    [junit4] 2> 3410797 INFO (jetty-launcher-4234-thread-2) [n:127.0.0.1:53307_solr ] o.a.s.s.SolrDispatchFilter user.dir=/export/home/jenkins/workspace/Lucene-Solr-6.x-Solaris/solr/build/solr-core/test/J1
    [junit4] 2> 3410797 INFO (jetty-launcher-4234-thread-2) [n:127.0.0.1:53307_solr ] o.a.s.s.SolrDispatchFilter SolrDispatchFilter.init() done
    [junit4] 2> 3410797 INFO (SUITE-TestManagedSchemaAPI-seed#[2CE8DE1A020A97C5]-worker) [ ] o.a.s.c.c.SolrZkClient Using default ZkCredentialsProvider
    [junit4] 2> 3410797 INFO (SUITE-TestManagedSchemaAPI-seed#[2CE8DE1A020A97C5]-worker) [ ] o.a.s.c.c.ConnectionManager Waiting for client to connect to ZooKeeper
    [junit4] 2> 3410798 INFO (zkCallback-4248-thread-1) [ ] o.a.s.c.c.ConnectionManager Watcher org.apache.solr.common.cloud.ConnectionManager@606fa39 name:ZooKeeperConnection Watcher:127.0.0.1:44872 got event WatchedEvent state:SyncConnected type:None path:null path:null type:None
    [junit4] 2> 3410799 INFO (SUITE-TestManagedSchemaAPI-seed#[2CE8DE1A020A97C5]-worker) [ ] o.a.s.c.c.ConnectionManager Client is connected to ZooKeeper
    [junit4] 2> 3410799 INFO (SUITE-TestManagedSchemaAPI-seed#[2CE8DE1A020A97C5]-worker) [ ] o.a.s.c.c.SolrZkClient Using default ZkACLProvider
    [junit4] 2> 3410802 INFO (SUITE-TestManagedSchemaAPI-seed#[2CE8DE1A020A97C5]-worker) [ ] o.a.s.c.s.i.CloudSolrClient Final constructed zkHost string: 127.0.0.1:44872/solr
    [junit4] 2> 3410802 INFO (SUITE-TestManagedSchemaAPI-seed#[2CE8DE1A020A97C5]-worker) [ ] o.a.s.c.c.SolrZkClient Using default ZkCredentialsProvider
    [junit4] 2> 3410802 INFO (SUITE-TestManagedSchemaAPI-seed#[2CE8DE1A020A97C5]-worker) [ ] o.a.s.c.c.ConnectionManager Waiting for client to connect to ZooKeeper
    [junit4] 2> 3410804 INFO (zkCallback-4251-thread-1) [ ] o.a.s.c.c.ConnectionManager Watcher org.apache.solr.common.cloud.ConnectionManager@e230bca name:ZooKeeperConnection Watcher:127.0.0.1:44872/solr got event WatchedEvent state:SyncConnected type:None path:null path:null type:None
    [junit4] 2> 3410804 INFO (SUITE-TestManagedSchemaAPI-seed#[2CE8DE1A020A97C5]-worker) [ ] o.a.s.c.c.ConnectionManager Client is connected to ZooKeeper
    [junit4] 2> 3410804 INFO (SUITE-TestManagedSchemaAPI-seed#[2CE8DE1A020A97C5]-worker) [ ] o.a.s.c.c.SolrZkClient Using default ZkACLProvider
    [junit4] 2> 3410804 INFO (SUITE-TestManagedSchemaAPI-seed#[2CE8DE1A020A97C5]-worker) [ ] o.a.s.c.c.ZkStateReader Updating cluster state from ZooKeeper...
    [junit4] 2> 3410805 INFO (SUITE-TestManagedSchemaAPI-seed#[2CE8DE1A020A97C5]-worker) [ ] o.a.s.c.c.ZkStateReader Loaded empty cluster properties
    [junit4] 2> 3410806 INFO (SUITE-TestManagedSchemaAPI-seed#[2CE8DE1A020A97C5]-worker) [ ] o.a.s.c.c.ZkStateReader Updated live nodes from ZooKeeper... (0) -> (2)
    [junit4] 2> 3410807 INFO (SUITE-TestManagedSchemaAPI-seed#[2CE8DE1A020A97C5]-worker) [ ] o.a.s.c.c.SolrZkClient makePath: /configs/conf1/solrconfig.xml
    [junit4] 2> 3410810 INFO (SUITE-TestManagedSchemaAPI-seed#[2CE8DE1A020A97C5]-worker) [ ] o.a.s.c.c.SolrZkClient makePath: /configs/conf1/managed-schema
    [junit4] 2> 3410830 INFO (TEST-TestManagedSchemaAPI.test-seed#[2CE8DE1A020A97C5]) [ ] o.a.s.SolrTestCaseJ4 ###Starting test
    [junit4] 2> 3410834 INFO (qtp2134498078-26510) [n:127.0.0.1:53776_solr ] o.a.s.h.a.CollectionsHandler Invoked Collection Action :create with params replicationFactor=2&collection.configName=conf1&name=testschemaapi&action=CREATE&numShards=1&wt=javabin&version=2 and sendToOCPQueue=true
    [junit4] 2> 3410837 INFO (OverseerCollectionConfigSetProcessor-96083350999924740-127.0.0.1:53307_solr-n_0000000000) [n:127.0.0.1:53307_solr ] o.a.s.c.OverseerTaskProcessor Overseer Collection Message Handler: Get the message id:/overseer/collection-queue-work/qn-0000000000 message:{
    [junit4] 2> "name":"testschemaapi",
    [junit4] 2> "fromApi":"true",
    [junit4] 2> "replicationFactor":"2",
    [junit4] 2> "collection.configName":"conf1",
    [junit4] 2> "numShards":"1",
    [junit4] 2> "stateFormat":"2",
    [junit4] 2> "operation":"create"}
    [junit4] 2> 3410838 INFO (OverseerThreadFactory-10967-thread-1-processing-n:127.0.0.1:53307_solr) [n:127.0.0.1:53307_solr ] o.a.s.c.OverseerCollectionMessageHandler OverseerCollectionMessageHandler.processMessage : create , {
    [junit4] 2> "name":"testschemaapi",
    [junit4] 2> "fromApi":"true",
    [junit4] 2> "replicationFactor":"2",
    [junit4] 2> "collection.configName":"conf1",
    [junit4] 2> "numShards":"1",
    [junit4] 2> "stateFormat":"2",
    [junit4] 2> "operation":"create"}
    [junit4] 2> 3410838 INFO (OverseerThreadFactory-10967-thread-1-processing-n:127.0.0.1:53307_solr) [n:127.0.0.1:53307_solr ] o.a.s.c.OverseerCollectionMessageHandler Create collection testschemaapi
    [junit4] 2> 3410838 INFO (OverseerThreadFactory-10967-thread-1-processing-n:127.0.0.1:53307_solr) [n:127.0.0.1:53307_solr ] o.a.s.c.OverseerCollectionMessageHandler creating collections conf node /collections/testschemaapi
    [junit4] 2> 3410840 INFO (OverseerThreadFactory-10967-thread-1-processing-n:127.0.0.1:53307_solr) [n:127.0.0.1:53307_solr ] o.a.s.c.c.SolrZkClient makePath: /collections/testschemaapi
    [junit4] 2> 3410842 INFO (zkCallback-4251-thread-1) [ ] o.a.s.c.c.ZkStateReader A collections change: [WatchedEvent state:SyncConnected type:NodeChildrenChanged path:/collections], has occurred - updating...
    [junit4] 2> 3410842 INFO (zkCallback-4245-thread-1-processing-n:127.0.0.1:53776_solr) [n:127.0.0.1:53776_solr ] o.a.s.c.c.ZkStateReader A collections change: [WatchedEvent state:SyncConnected type:NodeChildrenChanged path:/collections], has occurred - updating...
    [junit4] 2> 3410842 INFO (zkCallback-4241-thread-1-processing-n:127.0.0.1:53307_solr) [n:127.0.0.1:53307_solr ] o.a.s.c.c.ZkStateReader A collections change: [WatchedEvent state:SyncConnected type:NodeChildrenChanged path:/collections], has occurred - updating...
    [junit4] 2> 3410845 INFO (OverseerStateUpdate-96083350999924740-127.0.0.1:53307_solr-n_0000000000) [n:127.0.0.1:53307_solr ] o.a.s.c.Overseer processMessage: queueSize: 1, message = {
    [junit4] 2> "name":"testschemaapi",
    [junit4] 2> "fromApi":"true",
    [junit4] 2> "replicationFactor":"2",
    [junit4] 2> "collection.configName":"conf1",
    [junit4] 2> "numShards":"1",
    [junit4] 2> "stateFormat":"2",
    [junit4] 2> "operation":"create"} current state version: 0
    [junit4] 2> 3410845 INFO (OverseerStateUpdate-96083350999924740-127.0.0.1:53307_solr-n_0000000000) [n:127.0.0.1:53307_solr ] o.a.s.c.o.ClusterStateMutator building a new cName: testschemaapi
    [junit4] 2> 3410846 INFO (OverseerStateUpdate-96083350999924740-127.0.0.1:53307_solr-n_0000000000) [n:127.0.0.1:53307_solr ] o.a.s.c.o.ZkStateWriter going to create_collection /collections/testschemaapi/state.json
    [junit4] 2> 3410944 INFO (OverseerThreadFactory-10967-thread-1-processing-n:127.0.0.1:53307_solr) [n:127.0.0.1:53307_solr ] o.a.s.c.OverseerCollectionMessageHandler Creating SolrCores for new collection testschemaapi, shardNames [shard1] , replicationFactor : 2
    [junit4] 2> 3410944 INFO (OverseerThreadFactory-10967-thread-1-processing-n:127.0.0.1:53307_solr) [n:127.0.0.1:53307_solr ] o.a.s.c.OverseerCollectionMessageHandler Creating core testschemaapi_shard1_replica2 as part of shard shard1 of collection testschemaapi on 127.0.0.1:53307_solr
    [junit4] 2> 3410944 INFO (OverseerThreadFactory-10967-thread-1-processing-n:127.0.0.1:53307_solr) [n:127.0.0.1:53307_solr ] o.a.s.c.OverseerCollectionMessageHandler Creating core testschemaapi_shard1_replica1 as part of shard shard1 of collection testschemaapi on 127.0.0.1:53776_solr
    [junit4] 2> 3410947 INFO (qtp2134498078-26512) [n:127.0.0.1:53776_solr ] o.a.s.h.a.CoreAdminOperation core create command qt=/admin/cores&collection.configName=conf1&name=testschemaapi_shard1_replica1&action=CREATE&numShards=1&collection=testschemaapi&shard=shard1&wt=javabin&version=2
    [junit4] 2> 3410948 INFO (qtp2134498078-26512) [n:127.0.0.1:53776_solr ] o.a.s.c.CoreDescriptor Created CoreDescriptor: {name=testschemaapi_shard1_replica1, collection.configName=conf1, config=solrconfig.xml, transient=false, schema=schema.xml, loadOnStartup=true, configSetProperties=configsetprops.json, collection=testschemaapi, numShards=1, dataDir=data/, shard=shard1}
    [junit4] 2> 3410948 INFO (qtp2134498078-26512) [n:127.0.0.1:53776_solr c:testschemaapi s:shard1 x:testschemaapi_shard1_replica1] o.a.s.c.ZkController publishing state=down
    [junit4] 2> 3410951 INFO (qtp1831224587-26496) [n:127.0.0.1:53307_solr ] o.a.s.h.a.CoreAdminOperation core create command qt=/admin/cores&collection.configName=conf1&name=testschemaapi_shard1_replica2&action=CREATE&numShards=1&collection=testschemaapi&shard=shard1&wt=javabin&version=2
    [junit4] 2> 3410951 INFO (qtp2134498078-26512) [n:127.0.0.1:53776_solr c:testschemaapi s:shard1 x:testschemaapi_shard1_replica1] o.a.s.c.ZkController Registering watch for collection testschemaapi
    [junit4] 2> 3410951 INFO (qtp1831224587-26496) [n:127.0.0.1:53307_solr ] o.a.s.c.CoreDescriptor Created CoreDescriptor: {name=testschemaapi_shard1_replica2, collection.configName=conf1, config=solrconfig.xml, transient=false, schema=schema.xml, loadOnStartup=true, configSetProperties=configsetprops.json, collection=testschemaapi, numShards=1, dataDir=data/, shard=shard1}
    [junit4] 2> 3410952 INFO (qtp2134498078-26512) [n:127.0.0.1:53776_solr c:testschemaapi s:shard1 x:testschemaapi_shard1_replica1] o.a.s.c.c.ZkStateReader Add data for [testschemaapi] ver [0]
    [junit4] 2> 3410952 INFO (qtp1831224587-26496) [n:127.0.0.1:53307_solr c:testschemaapi s:shard1 x:testschemaapi_shard1_replica2] o.a.s.c.ZkController publishing state=down
    [junit4] 2> 3410952 INFO (qtp2134498078-26512) [n:127.0.0.1:53776_solr c:testschemaapi s:shard1 x:testschemaapi_shard1_replica1] o.a.s.c.ZkController look for our core node name
    [junit4] 2> 3410953 INFO (qtp1831224587-26496) [n:127.0.0.1:53307_solr c:testschemaapi s:shard1 x:testschemaapi_shard1_replica2] o.a.s.c.ZkController Registering watch for collection testschemaapi
    [junit4] 2> 3410953 INFO (OverseerStateUpdate-96083350999924740-127.0.0.1:53307_solr-n_0000000000) [n:127.0.0.1:53307_solr ] o.a.s.c.Overseer processMessage: queueSize: 1, message = {
    [junit4] 2> "core":"testschemaapi_shard1_replica1",
    [junit4] 2> "roles":null,
    [junit4] 2> "base_url":"http://127.0.0.1:53776/solr",
    [junit4] 2> "node_name":"127.0.0.1:53776_solr",
    [junit4] 2> "numShards":"1",
    [junit4] 2> "state":"down",
    [junit4] 2> "shard":"shard1",
    [junit4] 2> "collection":"testschemaapi",
    [junit4] 2> "operation":"state"} current state version: 0
    [junit4] 2> 3410953 INFO (OverseerStateUpdate-96083350999924740-127.0.0.1:53307_solr-n_0000000000) [n:127.0.0.1:53307_solr ] o.a.s.c.o.ReplicaMutator Update state numShards=1 message={
    [junit4] 2> "core":"testschemaapi_shard1_replica1",
    [junit4] 2> "roles":null,
    [junit4] 2> "base_url":"http://127.0.0.1:53776/solr",
    [junit4] 2> "node_name":"127.0.0.1:53776_solr",
    [junit4] 2> "numShards":"1",
    [junit4] 2> "state":"down",
    [junit4] 2> "shard":"shard1",
    [junit4] 2> "collection":"testschemaapi",
    [junit4] 2> "operation":"state"}
    [junit4] 2> 3410954 INFO (qtp1831224587-26496) [n:127.0.0.1:53307_solr c:testschemaapi s:shard1 x:testschemaapi_shard1_replica2] o.a.s.c.c.ZkStateReader Add data for [testschemaapi] ver [0]
    [junit4] 2> 3410954 INFO (qtp1831224587-26496) [n:127.0.0.1:53307_solr c:testschemaapi s:shard1 x:testschemaapi_shard1_replica2] o.a.s.c.ZkController look for our core node name
    [junit4] 2> 3410957 INFO (OverseerStateUpdate-96083350999924740-127.0.0.1:53307_solr-n_0000000000) [n:127.0.0.1:53307_solr ] o.a.s.c.Overseer processMessage: queueSize: 1, message = {
    [junit4] 2> "core":"testschemaapi_shard1_replica2",
    [junit4] 2> "roles":null,
    [junit4] 2> "base_url":"http://127.0.0.1:53307/solr",
    [junit4] 2> "node_name":"127.0.0.1:53307_solr",
    [junit4] 2> "numShards":"1",
    [junit4] 2> "state":"down",
    [junit4] 2> "shard":"shard1",
    [junit4] 2> "collection":"testschemaapi",
    [junit4] 2> "operation":"state"} current state version: 0
    [junit4] 2> 3410957 INFO (OverseerStateUpdate-96083350999924740-127.0.0.1:53307_solr-n_0000000000) [n:127.0.0.1:53307_solr ] o.a.s.c.o.ReplicaMutator Update state numShards=1 message={
    [junit4] 2> "core":"testschemaapi_shard1_replica2",
    [junit4] 2> "roles":null,
    [junit4] 2> "base_url":"http://127.0.0.1:53307/solr",
    [junit4] 2> "node_name":"127.0.0.1:53307_solr",
    [junit4] 2> "numShards":"1",
    [junit4] 2> "state":"down",
    [junit4] 2> "shard":"shard1",
    [junit4] 2> "collection":"testschemaapi",
    [junit4] 2> "operation":"state"}
    [junit4] 2> 3411060 INFO (OverseerStateUpdate-96083350999924740-127.0.0.1:53307_solr-n_0000000000) [n:127.0.0.1:53307_solr ] o.a.s.c.o.ZkStateWriter going to update_collection /collections/testschemaapi/state.json version: 0
    [junit4] 2> 3411061 INFO (zkCallback-4241-thread-1-processing-n:127.0.0.1:53307_solr) [n:127.0.0.1:53307_solr ] o.a.s.c.c.ZkStateReader A cluster state change: [WatchedEvent state:SyncConnected type:NodeDataChanged path:/collections/testschemaapi/state.json] for collection [testschemaapi] has occurred - updating... (live nodes size: [2])
    [junit4] 2> 3411061 INFO (zkCallback-4245-thread-1-processing-n:127.0.0.1:53776_solr) [n:127.0.0.1:53776_solr ] o.a.s.c.c.ZkStateReader A cluster state change: [WatchedEvent state:SyncConnected type:NodeDataChanged path:/collections/testschemaapi/state.json] for collection [testschemaapi] has occurred - updating... (live nodes size: [2])
    [junit4] 2> 3411062 INFO (zkCallback-4245-thread-1-processing-n:127.0.0.1:53776_solr) [n:127.0.0.1:53776_solr ] o.a.s.c.c.ZkStateReader Updating data for [testschemaapi] from [0] to [1]
    [junit4] 2> 3411062 INFO (zkCallback-4241-thread-1-processing-n:127.0.0.1:53307_solr) [n:127.0.0.1:53307_solr ] o.a.s.c.c.ZkStateReader Updating data for [testschemaapi] from [0] to [1]
    [junit4] 2> 3411953 INFO (qtp2134498078-26512) [n:127.0.0.1:53776_solr c:testschemaapi s:shard1 x:testschemaapi_shard1_replica1] o.a.s.c.ZkController waiting to find shard id in clusterstate for testschemaapi_shard1_replica1
    [junit4] 2> 3411953 INFO (qtp2134498078-26512) [n:127.0.0.1:53776_solr c:testschemaapi s:shard1 x:testschemaapi_shard1_replica1] o.a.s.c.ZkController Check for collection zkNode:testschemaapi
    [junit4] 2> 3411953 INFO (qtp2134498078-26512) [n:127.0.0.1:53776_solr c:testschemaapi s:shard1 x:testschemaapi_shard1_replica1] o.a.s.c.ZkController Collection zkNode exists
    [junit4] 2> 3411954 INFO (qtp2134498078-26512) [n:127.0.0.1:53776_solr c:testschemaapi s:shard1 x:testschemaapi_shard1_replica1] o.a.s.c.c.ZkStateReader Load collection config from: [/collections/testschemaapi]
    [junit4] 2> 3411955 INFO (qtp1831224587-26496) [n:127.0.0.1:53307_solr c:testschemaapi s:shard1 x:testschemaapi_shard1_replica2] o.a.s.c.ZkController waiting to find shard id in clusterstate for testschemaapi_shard1_replica2
    [junit4] 2> 3411955 INFO (qtp1831224587-26496) [n:127.0.0.1:53307_solr c:testschemaapi s:shard1 x:testschemaapi_shard1_replica2] o.a.s.c.ZkController Check for collection zkNode:testschemaapi
    [junit4] 2> 3411955 INFO (qtp2134498078-26512) [n:127.0.0.1:53776_solr c:testschemaapi s:shard1 x:testschemaapi_shard1_replica1] o.a.s.c.c.ZkStateReader path=[/collections/testschemaapi] [configName]=[conf1] specified config exists in ZooKeeper
    [junit4] 2> 3411955 INFO (qtp2134498078-26512) [n:127.0.0.1:53776_solr c:testschemaapi s:shard1 x:testschemaapi_shard1_replica1] o.a.s.c.SolrResourceLoader new SolrResourceLoader for directory: '/export/home/jenkins/workspace/Lucene-Solr-6.x-Solaris/solr/build/solr-core/test/J1/temp/solr.schema.TestManagedSchemaAPI_2CE8DE1A020A97C5-001/tempDir-001/node1/testschemaapi_shard1_replica1'
    [junit4] 2> 3411955 INFO (qtp2134498078-26512) [n:127.0.0.1:53776_solr c:testschemaapi s:shard1 x:testschemaapi_shard1_replica1] o.a.s.c.SolrResourceLoader JNDI not configured for solr (NoInitialContextEx)
    [junit4] 2> 3411955 INFO (qtp2134498078-26512) [n:127.0.0.1:53776_solr c:testschemaapi s:shard1 x:testschemaapi_shard1_replica1] o.a.s.c.SolrResourceLoader solr home defaulted to 'solr/' (could not find system property or JNDI)
    [junit4] 2> 3411956 INFO (qtp1831224587-26496) [n:127.0.0.1:53307_solr c:testschemaapi s:shard1 x:testschemaapi_shard1_replica2] o.a.s.c.ZkController Collection zkNode exists
    [junit4] 2> 3411956 INFO (qtp1831224587-26496) [n:127.0.0.1:53307_solr c:testschemaapi s:shard1 x:testschemaapi_shard1_replica2] o.a.s.c.c.ZkStateReader Load collection config from: [/collections/testschemaapi]
    [junit4] 2> 3411957 INFO (qtp1831224587-26496) [n:127.0.0.1:53307_solr c:testschemaapi s:shard1 x:testschemaapi_shard1_replica2] o.a.s.c.c.ZkStateReader path=[/collections/testschemaapi] [configName]=[conf1] specified config exists in ZooKeeper
    [junit4] 2> 3411957 INFO (qtp1831224587-26496) [n:127.0.0.1:53307_solr c:testschemaapi s:shard1 x:testschemaapi_shard1_replica2] o.a.s.c.SolrResourceLoader new SolrResourceLoader for directory: '/export/home/jenkins/workspace/Lucene-Solr-6.x-Solaris/solr/build/solr-core/test/J1/temp/solr.schema.TestManagedSchemaAPI_2CE8DE1A020A97C5-001/tempDir-001/node2/testschemaapi_shard1_replica2'
    [junit4] 2> 3411957 INFO (qtp1831224587-26496) [n:127.0.0.1:53307_solr c:testschemaapi s:shard1 x:testschemaapi_shard1_replica2] o.a.s.c.SolrResourceLoader JNDI not configured for solr (NoInitialContextEx)
    [junit4] 2> 3411957 INFO (qtp1831224587-26496) [n:127.0.0.1:53307_solr c:testschemaapi s:shard1 x:testschemaapi_shard1_replica2] o.a.s.c.SolrResourceLoader solr home defaulted to 'solr/' (could not find system property or JNDI)
    [junit4] 2> 3411958 INFO (qtp2134498078-26512) [n:127.0.0.1:53776_solr c:testschemaapi s:shard1 x:testschemaapi_shard1_replica1] o.a.s.c.Config loaded config solrconfig.xml with version 0
    [junit4] 2> 3411959 INFO (qtp1831224587-26496) [n:127.0.0.1:53307_solr c:testschemaapi s:shard1 x:testschemaapi_shard1_replica2] o.a.s.c.Config loaded config solrconfig.xml with version 0
    [junit4] 2> 3411961 INFO (qtp2134498078-26512) [n:127.0.0.1:53776_solr c:testschemaapi s:shard1 x:testschemaapi_shard1_replica1] o.a.s.c.SolrConfig current version of requestparams : -1
    [junit4] 2> 3411961 INFO (qtp1831224587-26496) [n:127.0.0.1:53307_solr c:testschemaapi s:shard1 x:testschemaapi_shard1_replica2] o.a.s.c.SolrConfig current version of requestparams : -1
    [junit4] 2> 3411962 INFO (qtp2134498078-26512) [n:127.0.0.1:53776_solr c:testschemaapi s:shard1 x:testschemaapi_shard1_replica1] o.a.s.c.SolrConfig Using Lucene MatchVersion: 6.2.0
    [junit4] 2> 3411963 INFO (qtp1831224587-26496) [n:127.0.0.1:53307_solr c:testschemaapi s:shard1 x:testschemaapi_shard1_replica2] o.a.s.c.SolrConfig Using Lucene MatchVersion: 6.2.0
    [junit4] 2> 3411965 INFO (qtp2134498078-26512) [n:127.0.0.1:53776_solr c:testschemaapi s:shard1 x:testschemaapi_shard1_replica1] o.a.s.c.SolrConfig Loaded SolrConfig: solrconfig.xml
    [junit4] 2> 3411966 INFO (qtp1831224587-26496) [n:127.0.0.1:53307_solr c:testschemaapi s:shard1 x:testschemaapi_shard1_replica2] o.a.s.c.SolrConfig Loaded SolrConfig: solrconfig.xml
    [junit4] 2> 3411969 INFO (qtp2134498078-26512) [n:127.0.0.1:53776_solr c:testschemaapi s:shard1 x:testschemaapi_shard1_replica1] o.a.s.s.IndexSchema [testschemaapi_shard1_replica1] Schema name=minimal
    [junit4] 2> 3411969 INFO (qtp1831224587-26496) [n:127.0.0.1:53307_solr c:testschemaapi s:shard1 x:testschemaapi_shard1_replica2] o.a.s.s.IndexSchema [testschemaapi_shard1_replica2] Schema name=minimal
    [junit4] 2> 3411971 INFO (qtp1831224587-26496) [n:127.0.0.1:53307_solr c:testschemaapi s:shard1 x:testschemaapi_shard1_replica2] o.a.s.s.IndexSchema unique key field: id
    [junit4] 2> 3411971 INFO (qtp2134498078-26512) [n:127.0.0.1:53776_solr c:testschemaapi s:shard1 x:testschemaapi_shard1_replica1] o.a.s.s.IndexSchema unique key field: id
    [junit4] 2> 3411973 INFO (qtp1831224587-26496) [n:127.0.0.1:53307_solr c:testschemaapi s:shard1 x:testschemaapi_shard1_replica2] o.a.s.c.ConfigSetProperties Did not find ConfigSet properties, assuming default properties: Can't find resource 'configsetprops.json' in classpath or '/configs/conf1', cwd=/export/home/jenkins/workspace/Lucene-Solr-6.x-Solaris/solr/build/solr-core/test/J1
    [junit4] 2> 3411973 INFO (qtp1831224587-26496) [n:127.0.0.1:53307_solr c:testschemaapi s:shard1 x:testschemaapi_shard1_replica2] o.a.s.c.CoreContainer Creating SolrCore 'testschemaapi_shard1_replica2' using configuration from collection testschemaapi
    [junit4] 2> 3411973 INFO (qtp2134498078-26512) [n:127.0.0.1:53776_solr c:testschemaapi s:shard1 x:testschemaapi_shard1_replica1] o.a.s.c.ConfigSetProperties Did not find ConfigSet properties, assuming default properties: Can't find resource 'configsetprops.json' in classpath or '/configs/conf1', cwd=/export/home/jenkins/workspace/Lucene-Solr-6.x-Solaris/solr/build/solr-core/test/J1
    [junit4] 2> 3411973 INFO (qtp2134498078-26512) [n:127.0.0.1:53776_solr c:testschemaapi s:shard1 x:testschemaapi_shard1_replica1] o.a.s.c.CoreContainer Creating SolrCore 'testschemaapi_shard1_replica1' using configuration from collection testschemaapi
    [junit4] 2> 3411973 INFO (qtp1831224587-26496) [n:127.0.0.1:53307_solr c:testschemaapi s:shard1 r:core_node2 x:testschemaapi_shard1_replica2] o.a.s.c.SolrCore org.apache.solr.core.MockDirectoryFactory
    [junit4] 2> 3411973 INFO (qtp2134498078-26512) [n:127.0.0.1:53776_solr c:testschemaapi s:shard1 r:core_node1 x:testschemaapi_shard1_replica1] o.a.s.c.SolrCore org.apache.solr.core.MockDirectoryFactory
    [junit4] 2> 3411973 INFO (qtp1831224587-26496) [n:127.0.0.1:53307_solr c:testschemaapi s:shard1 r:core_node2 x:testschemaapi_shard1_replica2] o.a.s.c.SolrCore [[testschemaapi_shard1_replica2] ] Opening new SolrCore at [/export/home/jenkins/workspace/Lucene-Solr-6.x-Solaris/solr/build/solr-core/test/J1/temp/solr.schema.TestManagedSchemaAPI_2CE8DE1A020A97C5-001/tempDir-001/node2/testschemaapi_shard1_replica2], dataDir=[/export/home/jenkins/workspace/Lucene-Solr-6.x-Solaris/solr/build/solr-core/test/J1/temp/solr.schema.TestManagedSchemaAPI_2CE8DE1A020A97C5-001/tempDir-001/node2/./testschemaapi_shard1_replica2/data/]
    [junit4] 2> 3411973 INFO (qtp2134498078-26512) [n:127.0.0.1:53776_solr c:testschemaapi s:shard1 r:core_node1 x:testschemaapi_shard1_replica1] o.a.s.c.SolrCore [[testschemaapi_shard1_replica1] ] Opening new SolrCore at [/export/home/jenkins/workspace/Lucene-Solr-6.x-Solaris/solr/build/solr-core/test/J1/temp/solr.schema.TestManagedSchemaAPI_2CE8DE1A020A97C5-001/tempDir-001/node1/testschemaapi_shard1_replica1], dataDir=[/export/home/jenkins/workspace/Lucene-Solr-6.x-Solaris/solr/build/solr-core/test/J1/temp/solr.schema.TestManagedSchemaAPI_2CE8DE1A020A97C5-001/tempDir-001/node1/./testschemaapi_shard1_replica1/data/]
    [junit4] 2> 3411974 INFO (qtp2134498078-26512) [n:127.0.0.1:53776_solr c:testschemaapi s:shard1 r:core_node1 x:testschemaapi_shard1_replica1] o.a.s.c.SolrCore JMX monitoring not detected for core: testschemaapi_shard1_replica1
    [junit4] 2> 3411973 INFO (qtp1831224587-26496) [n:127.0.0.1:53307_solr c:testschemaapi s:shard1 r:core_node2 x:testschemaapi_shard1_replica2] o.a.s.c.SolrCore JMX monitoring not detected for core: testschemaapi_shard1_replica2
    [junit4] 2> 3411974 INFO (qtp2134498078-26512) [n:127.0.0.1:53776_solr c:testschemaapi s:shard1 r:core_node1 x:testschemaapi_shard1_replica1] o.a.s.c.CachingDirectoryFactory return new directory for /export/home/jenkins/workspace/Lucene-Solr-6.x-Solaris/solr/build/solr-core/test/J1/temp/solr.schema.TestManagedSchemaAPI_2CE8DE1A020A97C5-001/tempDir-001/node1/./testschemaapi_shard1_replica1/data
    [junit4] 2> 3411974 INFO (qtp1831224587-26496) [n:127.0.0.1:53307_solr c:testschemaapi s:shard1 r:core_node2 x:testschemaapi_shard1_replica2] o.a.s.c.CachingDirectoryFactory return new directory for /export/home/jenkins/workspace/Lucene-Solr-6.x-Solaris/solr/build/solr-core/test/J1/temp/solr.schema.TestManagedSchemaAPI_2CE8DE1A020A97C5-001/tempDir-001/node2/./testschemaapi_shard1_replica2/data
    [junit4] 2> 3411974 INFO (qtp2134498078-26512) [n:127.0.0.1:53776_solr c:testschemaapi s:shard1 r:core_node1 x:testschemaapi_shard1_replica1] o.a.s.c.SolrCore New index directory detected: old=null new=/export/home/jenkins/workspace/Lucene-Solr-6.x-Solaris/solr/build/solr-core/test/J1/temp/solr.schema.TestManagedSchemaAPI_2CE8DE1A020A97C5-001/tempDir-001/node1/./testschemaapi_shard1_replica1/data/index/
    [junit4] 2> 3411975 WARN (qtp2134498078-26512) [n:127.0.0.1:53776_solr c:testschemaapi s:shard1 r:core_node1 x:testschemaapi_shard1_replica1] o.a.s.c.SolrCore [testschemaapi_shard1_replica1] Solr index directory '/export/home/jenkins/workspace/Lucene-Solr-6.x-Solaris/solr/build/solr-core/test/J1/temp/solr.schema.TestManagedSchemaAPI_2CE8DE1A020A97C5-001/tempDir-001/node1/./testschemaapi_shard1_replica1/data/index' doesn't exist. Creating new index...
    [junit4] 2> 3411974 INFO (qtp1831224587-26496) [n:127.0.0.1:53307_solr c:testschemaapi s:shard1 r:core_node2 x:testschemaapi_shard1_replica2] o.a.s.c.SolrCore New index directory detected: old=null new=/export/home/jenkins/workspace/Lucene-Solr-6.x-Solaris/solr/build/solr-core/test/J1/temp/solr.schema.TestManagedSchemaAPI_2CE8DE1A020A97C5-001/tempDir-001/node2/./testschemaapi_shard1_replica2/data/index/
    [junit4] 2> 3411975 WARN (qtp1831224587-26496) [n:127.0.0.1:53307_solr c:testschemaapi s:shard1 r:core_node2 x:testschemaapi_shard1_replica2] o.a.s.c.SolrCore [testschemaapi_shard1_replica2] Solr index directory '/export/home/jenkins/workspace/Lucene-Solr-6.x-Solaris/solr/build/solr-core/test/J1/temp/solr.schema.TestManagedSchemaAPI_2CE8DE1A020A97C5-001/tempDir-001/node2/./testschemaapi_shard1_replica2/data/index' doesn't exist. Creating new index...
    [junit4] 2> 3411975 INFO (qtp2134498078-26512) [n:127.0.0.1:53776_solr c:testschemaapi s:shard1 r:core_node1 x:testschemaapi_shard1_replica1] o.a.s.c.CachingDirectoryFactory return new directory for /export/home/jenkins/workspace/Lucene-Solr-6.x-Solaris/solr/build/solr-core/test/J1/temp/solr.schema.TestManagedSchemaAPI_2CE8DE1A020A97C5-001/tempDir-001/node1/./testschemaapi_shard1_replica1/data/index
    [junit4] 2> 3411975 INFO (qtp1831224587-26496) [n:127.0.0.1:53307_solr c:testschemaapi s:shard1 r:core_node2 x:testschemaapi_shard1_replica2] o.a.s.c.CachingDirectoryFactory return new directory for /export/home/jenkins/workspace/Lucene-Solr-6.x-Solaris/solr/build/solr-core/test/J1/temp/solr.schema.TestManagedSchemaAPI_2CE8DE1A020A97C5-001/tempDir-001/node2/./testschemaapi_shard1_replica2/data/index
    [junit4] 2> 3411976 INFO (qtp2134498078-26512) [n:127.0.0.1:53776_solr c:testschemaapi s:shard1 r:core_node1 x:testschemaapi_shard1_replica1] o.a.s.c.SolrDeletionPolicy SolrDeletionPolicy.onCommit: commits: num=1
    [junit4] 2> commit{dir=MockDirectoryWrapper(RAMDirectory@6176d72c lockFactory=org.apache.lucene.store.SingleInstanceLockFactory@535dcef3),segFN=segments_1,generation=1}
    [junit4] 2> 3411976 INFO (qtp2134498078-26512) [n:127.0.0.1:53776_solr c:testschemaapi s:shard1 r:core_node1 x:testschemaapi_shard1_replica1] o.a.s.c.SolrDeletionPolicy newest commit generation = 1
    [junit4] 2> 3411976 INFO (OldIndexDirectoryCleanupThreadForCore-testschemaapi_shard1_replica1) [n:127.0.0.1:53776_solr c:testschemaapi s:shard1 r:core_node1 x:testschemaapi_shard1_replica1] o.a.s.c.SolrCore Looking for old index directories to cleanup for core testschemaapi_shard1_replica1 in /export/home/jenkins/workspace/Lucene-Solr-6.x-Solaris/solr/build/solr-core/test/J1/temp/solr.schema.TestManagedSchemaAPI_2CE8DE1A020A97C5-001/tempDir-001/node1/./testschemaapi_shard1_replica1/data/
    [junit4] 2> 3411976 INFO (qtp1831224587-26496) [n:127.0.0.1:53307_solr c:testschemaapi s:shard1 r:core_node2 x:testschemaapi_shard1_replica2] o.a.s.c.SolrDeletionPolicy SolrDeletionPolicy.onCommit: commits: num=1
    [junit4] 2> commit{dir=MockDirectoryWrapper(RAMDirectory@426c393f lockFactory=org.apache.lucene.store.SingleInstanceLockFactory@18b6b3b),segFN=segments_1,generation=1}
    [junit4] 2> 3411977 INFO (qtp1831224587-26496) [n:127.0.0.1:53307_solr c:testschemaapi s:shard1 r:core_node2 x:testschemaapi_shard1_replica2] o.a.s.c.SolrDeletionPolicy newest commit generation = 1
    [junit4] 2> 3411977 WARN (OldIndexDirectoryCleanupThreadForCore-testschemaapi_shard1_replica1) [n:127.0.0.1:53776_solr c:testschemaapi s:shard1 r:core_node1 x:testschemaapi_shard1_replica1] o.a.s.c.DirectoryFactory /export/home/jenkins/workspace/Lucene-Solr-6.x-Solaris/solr/build/solr-core/test/J1/temp/solr.schema.TestManagedSchemaAPI_2CE8DE1A020A97C5-001/tempDir-001/node1/./testschemaapi_shard1_replica1/data/ does not point to a valid data directory; skipping clean-up of old index directories.
    [junit4] 2> 3411977 INFO (OldIndexDirectoryCleanupThreadForCore-testschemaapi_shard1_replica2) [n:127.0.0.1:53307_solr c:testschemaapi s:shard1 r:core_node2 x:testschemaapi_shard1_replica2] o.a.s.c.SolrCore Looking for old index directories to cleanup for core testschemaapi_shard1_replica2 in /export/home/jenkins/workspace/Lucene-Solr-6.x-Solaris/solr/build/solr-core/test/J1/temp/solr.schema.TestManagedSchemaAPI_2CE8DE1A020A97C5-001/tempDir-001/node2/./testschemaapi_shard1_replica2/data/
    [junit4] 2> 3411977 WARN (OldIndexDirectoryCleanupThreadForCore-testschemaapi_shard1_replica2) [n:127.0.0.1:53307_solr c:testschemaapi s:shard1 r:core_node2 x:testschemaapi_shard1_replica2] o.a.s.c.DirectoryFactory /export/home/jenkins/workspace/Lucene-Solr-6.x-Solaris/solr/build/solr-core/test/J1/temp/solr.schema.TestManagedSchemaAPI_2CE8DE1A020A97C5-001/tempDir-001/node2/./testschemaapi_shard1_replica2/data/ does not point to a valid data directory; skipping clean-up of old index directories.
    [junit4] 2> 3411978 INFO (qtp2134498078-26512) [n:127.0.0.1:53776_solr c:testschemaapi s:shard1 r:core_node1 x:testschemaapi_shard1_replica1] o.a.s.c.SolrCore no updateRequestProcessorChain defined as default, creating implicit default
    [junit4] 2> 3411978 INFO (qtp1831224587-26496) [n:127.0.0.1:53307_solr c:testschemaapi s:shard1 r:core_node2 x:testschemaapi_shard1_replica2] o.a.s.c.SolrCore no updateRequestProcessorChain defined as default, creating implicit default
    [junit4] 2> 3411980 INFO (qtp1831224587-26496) [n:127.0.0.1:53307_solr c:testschemaapi s:shard1 r:core_node2 x:testschemaapi_shard1_replica2] o.a.s.h.l.XMLLoader xsltCacheLifetimeSeconds=60
    [junit4] 2> 3411980 INFO (qtp2134498078-26512) [n:127.0.0.1:53776_solr c:testschemaapi s:shard1 r:core_node1 x:testschemaapi_shard1_replica1] o.a.s.h.l.XMLLoader xsltCacheLifetimeSeconds=60
    [junit4] 2> 3411981 INFO (qtp1831224587-26496) [n:127.0.0.1:53307_solr c:testschemaapi s:shard1 r:core_node2 x:testschemaapi_shard1_replica2] o.a.s.h.l.XMLLoader xsltCacheLifetimeSeconds=60
    [junit4] 2> 3411981 INFO (qtp2134498078-26512) [n:127.0.0.1:53776_solr c:testschemaapi s:shard1 r:core_node1 x:testschemaapi_shard1_replica1] o.a.s.h.l.XMLLoader xsltCacheLifetimeSeconds=60
    [junit4] 2> 3411982 INFO (qtp1831224587-26496) [n:127.0.0.1:53307_solr c:testschemaapi s:shard1 r:core_node2 x:testschemaapi_shard1_replica2] o.a.s.h.l.XMLLoader xsltCacheLifetimeSeconds=60
    [junit4] 2> 3411982 INFO (qtp2134498078-26512) [n:127.0.0.1:53776_solr c:testschemaapi s:shard1 r:core_node1 x:testschemaapi_shard1_replica1] o.a.s.h.l.XMLLoader xsltCacheLifetimeSeconds=60
    [junit4] 2> 3411983 INFO (qtp1831224587-26496) [n:127.0.0.1:53307_solr c:testschemaapi s:shard1 r:core_node2 x:testschemaapi_shard1_replica2] o.a.s.h.l.XMLLoader xsltCacheLifetimeSeconds=60
    [junit4] 2> 3411983 INFO (qtp2134498078-26512) [n:127.0.0.1:53776_solr c:testschemaapi s:shard1 r:core_node1 x:testschemaapi_shard1_replica1] o.a.s.h.l.XMLLoader xsltCacheLifetimeSeconds=60
    [junit4] 2> 3411984 INFO (qtp1831224587-26496) [n:127.0.0.1:53307_solr c:testschemaapi s:shard1 r:core_node2 x:testschemaapi_shard1_replica2] o.a.s.c.RequestHandlers Registered paths: /admin/mbeans,/update/csv,/sql,/update/json/docs,/admin/luke,/graph,/export,/select,/admin/segments,/get,/admin/system,/replication,/admin/properties,/config,/stream,/schema,/admin/plugins,/admin/logging,/update/json,/admin/ping,/admin/threads,/update,/admin/file
    [junit4] 2> 3411985 INFO (qtp1831224587-26496) [n:127.0.0.1:53307_solr c:testschemaapi s:shard1 r:core_node2 x:testschemaapi_shard1_replica2] o.a.s.c.SolrCore Using default statsCache cache: org.apache.solr.search.stats.LocalStatsCache
    [junit4] 2> 3411985 INFO (qtp2134498078-26512) [n:127.0.0.1:53776_solr c:testschemaapi s:shard1 r:core_node1 x:testschemaapi_shard1_replica1] o.a.s.c.RequestHandlers Registered paths: /admin/mbeans,/update/csv,/sql,/update/json/docs,/admin/luke,/graph,/export,/select,/admin/segments,/get,/admin/system,/replication,/admin/properties,/config,/stream,/schema,/admin/plugins,/admin/logging,/update/json,/admin/ping,/admin/threads,/update,/admin/file
    [junit4] 2> 3411985 INFO (qtp2134498078-26512) [n:127.0.0.1:53776_solr c:testschemaapi s:shard1 r:core_node1 x:testschemaapi_shard1_replica1] o.a.s.c.SolrCore Using default statsCache cache: org.apache.solr.search.stats.LocalStatsCache
    [junit4] 2> 3411985 INFO (qtp1831224587-26496) [n:127.0.0.1:53307_solr c:testschemaapi s:shard1 r:core_node2 x:testschemaapi_shard1_replica2] o.a.s.u.UpdateHandler Using UpdateLog implementation: org.apache.solr.update.UpdateLog
    [junit4] 2> 3411985 INFO (qtp1831224587-26496) [n:127.0.0.1:53307_solr c:testschemaapi s:shard1 r:core_node2 x:testschemaapi_shard1_replica2] o.a.s.u.UpdateLog Initializing UpdateLog: dataDir=null defaultSyncLevel=FLUSH numRecordsToKeep=100 maxNumLogsToKeep=10 numVersionBuckets=65536
    [junit4] 2> 3411985 INFO (qtp2134498078-26512) [n:127.0.0.1:53776_solr c:testschemaapi s:shard1 r:core_node1 x:testschemaapi_shard1_replica1] o.a.s.u.UpdateHandler Using UpdateLog implementation: org.apache.solr.update.UpdateLog
    [junit4] 2> 3411986 INFO (qtp2134498078-26512) [n:127.0.0.1:53776_solr c:testschemaapi s:shard1 r:core_node1 x:testschemaapi_shard1_replica1] o.a.s.u.UpdateLog Initializing UpdateLog: dataDir=null defaultSyncLevel=FLUSH numRecordsToKeep=100 maxNumLogsToKeep=10 numVersionBuckets=65536
    [junit4] 2> 3411986 INFO (qtp1831224587-26496) [n:127.0.0.1:53307_solr c:testschemaapi s:shard1 r:core_node2 x:testschemaapi_shard1_replica2] o.a.s.u.CommitTracker Hard AutoCommit: disabled
    [junit4] 2> 3411999 INFO (qtp1831224587-26496) [n:127.0.0.1:53307_solr c:testschemaapi s:shard1 r:core_node2 x:testschemaapi_shard1_replica2] o.a.s.u.CommitTracker Soft AutoCommit: disabled
    [junit4] 2> 3411999 INFO (qtp2134498078-26512) [n:127.0.0.1:53776_solr c:testschemaapi s:shard1 r:core_node1 x:testschemaapi_shard1_replica1] o.a.s.u.CommitTracker Hard AutoCommit: disabled
    [junit4] 2> 3411999 INFO (qtp2134498078-26512) [n:127.0.0.1:53776_solr c:testschemaapi s:shard1 r:core_node1 x:testschemaapi_shard1_replica1] o.a.s.u.CommitTracker Soft AutoCommit: disabled
    [junit4] 2> 3411999 INFO (qtp1831224587-26496) [n:127.0.0.1:53307_solr c:testschemaapi s:shard1 r:core_node2 x:testschemaapi_shard1_replica2] o.a.s.c.SolrDeletionPolicy SolrDeletionPolicy.onInit: commits: num=1
    [junit4] 2> commit{dir=MockDirectoryWrapper(RAMDirectory@426c393f lockFactory=org.apache.lucene.store.SingleInstanceLockFactory@18b6b3b),segFN=segments_1,generation=1}
    [junit4] 2> 3411999 INFO (qtp1831224587-26496) [n:127.0.0.1:53307_solr c:testschemaapi s:shard1 r:core_node2 x:testschemaapi_shard1_replica2] o.a.s.c.SolrDeletionPolicy newest commit generation = 1
    [junit4] 2> 3411999 INFO (qtp2134498078-26512) [n:127.0.0.1:53776_solr c:testschemaapi s:shard1 r:core_node1 x:testschemaapi_shard1_replica1] o.a.s.c.SolrDeletionPolicy SolrDeletionPolicy.onInit: commits: num=1
    [junit4] 2> commit{dir=MockDirectoryWrapper(RAMDirectory@6176d72c lockFactory=org.apache.lucene.store.SingleInstanceLockFactory@535dcef3),segFN=segments_1,generation=1}
    [junit4] 2> 3411999 INFO (qtp1831224587-26496) [n:127.0.0.1:53307_solr c:testschemaapi s:shard1 r:core_node2 x:testschemaapi_shard1_replica2] o.a.s.s.SolrIndexSearcher Opening [Searcher@227888f7[testschemaapi_shard1_replica2] main]
    [junit4] 2> 3412000 INFO (qtp2134498078-26512) [n:127.0.0.1:53776_solr c:testschemaapi s:shard1 r:core_node1 x:testschemaapi_shard1_replica1] o.a.s.c.SolrDeletionPolicy newest commit generation = 1
    [junit4] 2> 3412000 INFO (qtp2134498078-26512) [n:127.0.0.1:53776_solr c:testschemaapi s:shard1 r:core_node1 x:testschemaapi_shard1_replica1] o.a.s.s.SolrIndexSearcher Opening [Searcher@6cbd7f9c[testschemaapi_shard1_replica1] main]
    [junit4] 2> 3412000 INFO (qtp1831224587-26496) [n:127.0.0.1:53307_solr c:testschemaapi s:shard1 r:core_node2 x:testschemaapi_shard1_replica2] o.a.s.c.c.ZkStateReader Load collection config from: [/collections/testschemaapi]
    [junit4] 2> 3412000 INFO (qtp2134498078-26512) [n:127.0.0.1:53776_solr c:testschemaapi s:shard1 r:core_node1 x:testschemaapi_shard1_replica1] o.a.s.c.c.ZkStateReader Load collection config from: [/collections/testschemaapi]
    [junit4] 2> 3412001 INFO (qtp1831224587-26496) [n:127.0.0.1:53307_solr c:testschemaapi s:shard1 r:core_node2 x:testschemaapi_shard1_replica2] o.a.s.c.c.ZkStateReader path=[/collections/testschemaapi] [configName]=[conf1] specified config exists in ZooKeeper
    [junit4] 2> 3412001 INFO (qtp1831224587-26496) [n:127.0.0.1:53307_solr c:testschemaapi s:shard1 r:core_node2 x:testschemaapi_shard1_replica2] o.a.s.r.ManagedResourceStorage Setting up ZooKeeper-based storage for the RestManager with znodeBase: /configs/conf1
    [junit4] 2> 3412002 INFO (qtp1831224587-26496) [n:127.0.0.1:53307_solr c:testschemaapi s:shard1 r:core_node2 x:testschemaapi_shard1_replica2] o.a.s.r.ManagedResourceStorage Configured ZooKeeperStorageIO with znodeBase: /configs/conf1
    [junit4] 2> 3412002 INFO (qtp1831224587-26496) [n:127.0.0.1:53307_solr c:testschemaapi s:shard1 r:core_node2 x:testschemaapi_shard1_replica2] o.a.s.r.RestManager Initializing RestManager with initArgs: {}
    [junit4] 2> 3412002 INFO (qtp1831224587-26496) [n:127.0.0.1:53307_solr c:testschemaapi s:shard1 r:core_node2 x:testschemaapi_shard1_replica2] o.a.s.r.ManagedResourceStorage Reading _rest_managed.json using ZooKeeperStorageIO:path=/configs/conf1
    [junit4] 2> 3412002 INFO (qtp2134498078-26512) [n:127.0.0.1:53776_solr c:testschemaapi s:shard1 r:core_node1 x:testschemaapi_shard1_replica1] o.a.s.c.c.ZkStateReader path=[/collections/testschemaapi] [configName]=[conf1] specified config exists in ZooKeeper
    [junit4] 2> 3412002 INFO (qtp2134498078-26512) [n:127.0.0.1:53776_solr c:testschemaapi s:shard1 r:core_node1 x:testschemaapi_shard1_replica1] o.a.s.r.ManagedResourceStorage Setting up ZooKeeper-based storage for the RestManager with znodeBase: /configs/conf1
    [junit4] 2> 3412002 INFO (qtp1831224587-26496) [n:127.0.0.1:53307_solr c:testschemaapi s:shard1 r:core_node2 x:testschemaapi_shard1_replica2] o.a.s.r.ManagedResourceStorage No data found for znode /configs/conf1/_rest_managed.json
    [junit4] 2> 3412002 INFO (qtp1831224587-26496) [n:127.0.0.1:53307_solr c:testschemaapi s:shard1 r:core_node2 x:testschemaapi_shard1_replica2] o.a.s.r.ManagedResourceStorage Loaded null at path _rest_managed.json using ZooKeeperStorageIO:path=/configs/conf1
    [junit4] 2> 3412002 INFO (qtp1831224587-26496) [n:127.0.0.1:53307_solr c:testschemaapi s:shard1 r:core_node2 x:testschemaapi_shard1_replica2] o.a.s.r.RestManager Initializing 0 registered ManagedResources
    [junit4] 2> 3412002 INFO (qtp1831224587-26496) [n:127.0.0.1:53307_solr c:testschemaapi s:shard1 r:core_node2 x:testschemaapi_shard1_replica2] o.a.s.s.ZkIndexSchemaReader Creating ZooKeeper watch for the managed schema at /configs/conf1/managed-schema
    [junit4] 2> 3412003 INFO (qtp2134498078-26512) [n:127.0.0.1:53776_solr c:testschemaapi s:shard1 r:core_node1 x:testschemaapi_shard1_replica1] o.a.s.r.ManagedResourceStorage Configured ZooKeeperStorageIO with znodeBase: /configs/conf1
    [junit4] 2> 3412003 INFO (qtp1831224587-26496) [n:127.0.0.1:53307_solr c:testschemaapi s:shard1 r:core_node2 x:testschemaapi_shard1_replica2] o.a.s.c.ZkController Added new OnReconnect listener ZkIndexSchemaReader: /configs/conf1/managed-schema, uniqueCoreId: testschemaapi_shard1_replica2:346372385069642
    [junit4] 2> 3412003 INFO (qtp2134498078-26512) [n:127.0.0.1:53776_solr c:testschemaapi s:shard1 r:core_node1 x:testschemaapi_shard1_replica1] o.a.s.r.RestManager Initializing RestManager with initArgs: {}
    [junit4] 2> 3412003 INFO (qtp2134498078-26512) [n:127.0.0.1:53776_solr c:testschemaapi s:shard1 r:core_node1 x:testschemaapi_shard1_replica1] o.a.s.r.ManagedResourceStorage Reading _rest_managed.json using ZooKeeperStorageIO:path=/configs/conf1
    [junit4] 2> 3412003 INFO (qtp1831224587-26496) [n:127.0.0.1:53307_solr c:testschemaapi s:shard1 r:core_node2 x:testschemaapi_shard1_replica2] o.a.s.h.ReplicationHandler Commits will be reserved for 10000
    [junit4] 2> 3412003 INFO (qtp1831224587-26496) [n:127.0.0.1:53307_solr c:testschemaapi s:shard1 r:core_node2 x:testschemaapi_shard1_replica2] o.a.s.u.UpdateLog Looking up max value of version field to seed version buckets
    [junit4] 2> 3412003 INFO (qtp1831224587-26496) [n:127.0.0.1:53307_solr c:testschemaapi s:shard1 r:core_node2 x:testschemaapi_shard1_replica2] o.a.s.u.VersionInfo Refreshing highest value of _version_ for 65536 version buckets from index
    [junit4] 2> 3412004 INFO (qtp1831224587-26496) [n:127.0.0.1:53307_solr c:testschemaapi s:shard1 r:core_node2 x:testschemaapi_shard1_replica2] o.a.s.u.VersionInfo No terms found for _version_, cannot seed version bucket highest value from index
    [junit4] 2> 3412004 INFO (qtp1831224587-26496) [n:127.0.0.1:53307_solr c:testschemaapi s:shard1 r:core_node2 x:testschemaapi_shard1_replica2] o.a.s.u.UpdateLog Could not find max version in index or recent updates, using new clock 1537333618554175488
    [junit4] 2> 3412004 INFO (qtp2134498078-26512) [n:127.0.0.1:53776_solr c:testschemaapi s:shard1 r:core_node1 x:testschemaapi_shard1_replica1] o.a.s.r.ManagedResourceStorage No data found for znode /configs/conf1/_rest_managed.json
    [junit4] 2> 3412004 INFO (qtp2134498078-26512) [n:127.0.0.1:53776_solr c:testschemaapi s:shard1 r:core_node1 x:testschemaapi_shard1_replica1] o.a.s.r.ManagedResourceStorage Loaded null at path _rest_managed.json using ZooKeeperStorageIO:path=/configs/conf1
    [junit4] 2> 3412004 INFO (qtp2134498078-26512) [n:127.0.0.1:53776_solr c:testschemaapi s:shard1 r:core_node1 x:testschemaapi_shard1_replica1] o.a.s.r.RestManager Initializing 0 registered ManagedResources
    [junit4] 2> 3412004 INFO (qtp2134498078-26512) [n:127.0.0.1:53776_solr c:testschemaapi s:shard1 r:core_node1 x:testschemaapi_shard1_replica1] o.a.s.s.ZkIndexSchemaReader Creating ZooKeeper watch for the managed schema at /configs/conf1/managed-schema
    [junit4] 2> 3412004 INFO (qtp2134498078-26512) [n:127.0.0.1:53776_solr c:testschemaapi s:shard1 r:core_node1 x:testschemaapi_shard1_replica1] o.a.s.c.ZkController Added new OnReconnect listener ZkIndexSchemaReader: /configs/conf1/managed-schema, uniqueCoreId: testschemaapi_shard1_replica1:346372385257284
    [junit4] 2> 3412004 INFO (qtp2134498078-26512) [n:127.0.0.1:53776_solr c:testschemaapi s:shard1 r:core_node1 x:testschemaapi_shard1_replica1] o.a.s.h.ReplicationHandler Commits will be reserved for 10000
    [junit4] 2> 3412004 INFO (qtp2134498078-26512) [n:127.0.0.1:53776_solr c:testschemaapi s:shard1 r:core_node1 x:testschemaapi_shard1_replica1] o.a.s.u.UpdateLog Looking up max value of version field to seed version buckets
    [junit4] 2> 3412004 INFO (qtp2134498078-26512) [n:127.0.0.1:53776_solr c:testschemaapi s:shard1 r:core_node1 x:testschemaapi_shard1_replica1] o.a.s.u.VersionInfo Refreshing highest value of _version_ for 65536 version buckets from index
    [junit4] 2> 3412005 INFO (qtp2134498078-26512) [n:127.0.0.1:53776_solr c:testschemaapi s:shard1 r:core_node1 x:testschemaapi_shard1_replica1] o.a.s.u.VersionInfo No terms found for _version_, cannot seed version bucket highest value from index
    [junit4] 2> 3412005 INFO (qtp2134498078-26512) [n:127.0.0.1:53776_solr c:testschemaapi s:shard1 r:core_node1 x:testschemaapi_shard1_replica1] o.a.s.u.UpdateLog Could not find max version in index or recent updates, using new clock 1537333618555224064
    [junit4] 2> 3412005 INFO (qtp1831224587-26496) [n:127.0.0.1:53307_solr c:testschemaapi s:shard1 r:core_node2 x:testschemaapi_shard1_replica2] o.a.s.u.UpdateLog Took 1.0ms to seed version buckets with highest version 1537333618554175488
    [junit4] 2> 3412005 INFO (qtp1831224587-26496) [n:127.0.0.1:53307_solr c:testschemaapi s:shard1 r:core_node2 x:testschemaapi_shard1_replica2] o.a.s.c.ZkController watch zkdir /configs/conf1
    [junit4] 2> 3412006 INFO (searcherExecutor-10972-thread-1-processing-n:127.0.0.1:53307_solr x:testschemaapi_shard1_replica2 s:shard1 c:testschemaapi r:core_node2) [n:127.0.0.1:53307_solr c:testschemaapi s:shard1 r:core_node2 x:testschemaapi_shard1_replica2] o.a.s.c.SolrCore [testschemaapi_shard1_replica2] Registered new searcher Searcher@227888f7[testschemaapi_shard1_replica2] main{ExitableDirectoryReader(UninvertingDirectoryReader())}
    [junit4] 2> 3412006 INFO (searcherExecutor-10973-thread-1-processing-n:127.0.0.1:53776_solr x:testschemaapi_shard1_replica1 s:shard1 c:testschemaapi r:core_node1) [n:127.0.0.1:53776_solr c:testschemaapi s:shard1 r:core_node1 x:testschemaapi_shard1_replica1] o.a.s.c.SolrCore [testschemaapi_shard1_replica1] Registered new searcher Searcher@6cbd7f9c[testschemaapi_shard1_replica1] main{ExitableDirectoryReader(UninvertingDirectoryReader())}
    [junit4] 2> 3412006 INFO (qtp1831224587-26496) [n:127.0.0.1:53307_solr c:testschemaapi s:shard1 r:core_node2 x:testschemaapi_shard1_replica2] o.a.s.c.CoreContainer registering core: testschemaapi_shard1_replica2
    [junit4] 2> 3412006 INFO (qtp2134498078-26512) [n:127.0.0.1:53776_solr c:testschemaapi s:shard1 r:core_node1 x:testschemaapi_shard1_replica1] o.a.s.u.UpdateLog Took 1.0ms to seed version buckets with highest version 1537333618555224064
    [junit4] 2> 3412006 INFO (qtp1831224587-26496) [n:127.0.0.1:53307_solr c:testschemaapi s:shard1 r:core_node2 x:testschemaapi_shard1_replica2] o.a.s.c.ZkController Register replica - core:testschemaapi_shard1_replica2 address:http://127.0.0.1:53307/solr collection:testschemaapi shard:shard1
    [junit4] 2> 3412006 INFO (qtp2134498078-26512) [n:127.0.0.1:53776_solr c:testschemaapi s:shard1 r:core_node1 x:testschemaapi_shard1_replica1] o.a.s.c.ZkController watch zkdir /configs/conf1
    [junit4] 2> 3412007 INFO (qtp2134498078-26512) [n:127.0.0.1:53776_solr c:testschemaapi s:shard1 r:core_node1 x:testschemaapi_shard1_replica1] o.a.s.c.CoreContainer registering core: testschemaapi_shard1_replica1
    [junit4] 2> 3412007 INFO (qtp2134498078-26512) [n:127.0.0.1:53776_solr c:testschemaapi s:shard1 r:core_node1 x:testschemaapi_shard1_replica1] o.a.s.c.ZkController Register replica - core:testschemaapi_shard1_replica1 address:http://127.0.0.1:53776/solr collection:testschemaapi shard:shard1
    [junit4] 2> 3412007 INFO (qtp1831224587-26496) [n:127.0.0.1:53307_solr c:testschemaapi s:shard1 r:core_node2 x:testschemaapi_shard1_replica2] o.a.s.c.c.SolrZkClient makePath: /collections/testschemaapi/leader_elect/shard1/election
    [junit4] 2> 3412010 INFO (qtp1831224587-26496) [n:127.0.0.1:53307_solr c:testschemaapi s:shard1 r:core_node2 x:testschemaapi_shard1_replica2] o.a.s.c.LeaderElector Joined leadership election with path: /collections/testschemaapi/leader_elect/shard1/election/96083350999924740-core_node2-n_0000000000
    [junit4] 2> 3412011 INFO (qtp1831224587-26496) [n:127.0.0.1:53307_solr c:testschemaapi s:shard1 r:core_node2 x:testschemaapi_shard1_replica2] o.a.s.c.ShardLeaderElectionContext Running the leader process for shard=shard1 and weAreReplacement=false and leaderVoteWait=10000
    [junit4] 2> 3412011 INFO (qtp2134498078-26512) [n:127.0.0.1:53776_solr c:testschemaapi s:shard1 r:core_node1 x:testschemaapi_shard1_replica1] o.a.s.c.c.SolrZkClient makePath: /collections/testschemaapi/leader_elect/shard1/election
    [junit4] 2> 3412013 INFO (qtp1831224587-26496) [n:127.0.0.1:53307_solr c:testschemaapi s:shard1 r:core_node2 x:testschemaapi_shard1_replica2] o.a.s.c.ShardLeaderElectionContext Waiting until we see more replicas up for shard shard1: total=2 found=1 timeoutin=9999ms
    [junit4] 2> 3412013 INFO (OverseerStateUpdate-96083350999924740-127.0.0.1:53307_solr-n_0000000000) [n:127.0.0.1:53307_solr ] o.a.s.c.Overseer processMessage: queueSize: 1, message = {
    [junit4] 2> "operation":"leader",
    [junit4] 2> "shard":"shard1",
    [junit4] 2> "collection":"testschemaapi"} current state version: 0
    [junit4] 2> 3412015 INFO (qtp2134498078-26512) [n:127.0.0.1:53776_solr c:testschemaapi s:shard1 r:core_node1 x:testschemaapi_shard1_replica1] o.a.s.c.LeaderElector Joined leadership election with path: /collections/testschemaapi/leader_elect/shard1/election/96083350999924742-core_node1-n_0000000001
    [junit4] 2> 3412016 INFO (qtp2134498078-26512) [n:127.0.0.1:53776_solr c:testschemaapi s:shard1 r:core_node1 x:testschemaapi_shard1_replica1] o.a.s.c.LeaderElector Watching path /collections/testschemaapi/leader_elect/shard1/election/96083350999924740-core_node2-n_0000000000 to know if I could be the leader
    [junit4] 2> 3412118 INFO (OverseerStateUpdate-96083350999924740-127.0.0.1:53307_solr-n_0000000000) [n:127.0.0.1:53307_solr ] o.a.s.c.o.ZkStateWriter going to update_collection /collections/testschemaapi/state.json version: 1
    [junit4] 2> 3412119 INFO (zkCallback-4241-thread-1-processing-n:127.0.0.1:53307_solr) [n:127.0.0.1:53307_solr ] o.a.s.c.c.ZkStateReader A cluster state change: [WatchedEvent state:SyncConnected type:NodeDataChanged path:/collections/testschemaapi/state.json] for collection [testschemaapi] has occurred - updating... (live nodes size: [2])
    [junit4] 2> 3412119 INFO (zkCallback-4245-thread-1-processing-n:127.0.0.1:53776_solr) [n:127.0.0.1:53776_solr ] o.a.s.c.c.ZkStateReader A cluster state change: [WatchedEvent state:SyncConnected type:NodeDataChanged path:/collections/testschemaapi/state.json] for collection [testschemaapi] has occurred - updating... (live nodes size: [2])
    [junit4] 2> 3412119 INFO (zkCallback-4241-thread-1-processing-n:127.0.0.1:53307_solr) [n:127.0.0.1:53307_solr ] o.a.s.c.c.ZkStateReader Updating data for [testschemaapi] from [1] to [2]
    [junit4] 2> 3412120 INFO (zkCallback-4245-thread-1-processing-n:127.0.0.1:53776_solr) [n:127.0.0.1:53776_solr ] o.a.s.c.c.ZkStateReader Updating data for [testschemaapi] from [1] to [2]
    [junit4] 2> 3412515 INFO (qtp1831224587-26496) [n:127.0.0.1:53307_solr c:testschemaapi s:shard1 r:core_node2 x:testschemaapi_shard1_replica2] o.a.s.c.ShardLeaderElectionContext Enough replicas found to continue.
    [junit4] 2> 3412515 INFO (qtp1831224587-26496) [n:127.0.0.1:53307_solr c:testschemaapi s:shard1 r:core_node2 x:testschemaapi_shard1_replica2] o.a.s.c.ShardLeaderElectionContext I may be the new leader - try and sync
    [junit4] 2> 3412515 INFO (qtp1831224587-26496) [n:127.0.0.1:53307_solr c:testschemaapi s:shard1 r:core_node2 x:testschemaapi_shard1_replica2] o.a.s.c.SyncStrategy Sync replicas to http://127.0.0.1:53307/solr/testschemaapi_shard1_replica2/
    [junit4] 2> 3412515 INFO (qtp1831224587-26496) [n:127.0.0.1:53307_solr c:testschemaapi s:shard1 r:core_node2 x:testschemaapi_shard1_replica2] o.a.s.u.PeerSync PeerSync: core=testschemaapi_shard1_replica2 url=http://127.0.0.1:53307/solr START replicas=[http://127.0.0.1:53776/solr/testschemaapi_shard1_replica1/] nUpdates=100
    [junit4] 2> 3412516 INFO (qtp1831224587-26496) [n:127.0.0.1:53307_solr c:testschemaapi s:shard1 r:core_node2 x:testschemaapi_shard1_replica2] o.a.s.u.PeerSync PeerSync: core=testschemaapi_shard1_replica2 url=http://127.0.0.1:53307/solr DONE. We have no versions. sync failed.
    [junit4] 2> 3412516 INFO (qtp1831224587-26496) [n:127.0.0.1:53307_solr c:testschemaapi s:shard1 r:core_node2 x:testschemaapi_shard1_replica2] o.a.s.c.SyncStrategy Leader's attempt to sync with shard failed, moving to the next candidate
    [junit4] 2> 3412516 INFO (qtp1831224587-26496) [n:127.0.0.1:53307_solr c:testschemaapi s:shard1 r:core_node2 x:testschemaapi_shard1_replica2] o.a.s.c.ShardLeaderElectionContext We failed sync, but we have no versions - we can't sync in that case - we were active before, so become leader anyway
    [junit4] 2> 3412518 INFO (qtp1831224587-26496) [n:127.0.0.1:53307_solr c:testschemaapi s:shard1 r:core_node2 x:testschemaapi_shard1_replica2] o.a.s.c.c.SolrZkClient makePath: /collections/testschemaapi/leaders/shard1
    [junit4] 2> 3412518 INFO (qtp2134498078-26513) [n:127.0.0.1:53776_solr c:testschemaapi s:shard1 r:core_node1 x:testschemaapi_shard1_replica1] o.a.s.c.S.Request [testschemaapi_shard1_replica1] webapp=/solr path=/get params={distrib=false&qt=/get&fingerprint=false&getVersions=100&wt=javabin&version=2} status=0 QTime=0
    [junit4] 2> 3412522 INFO (qtp1831224587-26496) [n:127.0.0.1:53307_solr c:testschemaapi s:shard1 r:core_node2 x:testschemaapi_shard1_replica2] o.a.s.c.ShardLeaderElectionContextBase Creating leader registration node /collections/testschemaapi/leaders/shard1/leader after winning as /collections/testschemaapi/leader_elect/shard1/election/96083350999924740-core_node2-n_0000000000
    [junit4] 2> 3412525 INFO (qtp1831224587-26496) [n:127.0.0.1:53307_solr c:testschemaapi s:shard1 r:core_node2 x:testschemaapi_shard1_replica2] o.a.s.c.ShardLeaderElectionContext I am the new leader: http://127.0.0.1:53307/solr/testschemaapi_shard1_replica2/ shard1
    [junit4] 2> 3412525 INFO (OverseerStateUpdate-96083350999924740-127.0.0.1:53307_solr-n_0000000000) [n:127.0.0.1:53307_solr ] o.a.s.c.Overseer processMessage: queueSize: 1, message = {
    [junit4] 2> "operation":"leader",
    [junit4] 2> "shard":"shard1",
    [junit4] 2> "collection":"testschemaapi",
    [junit4] 2> "base_url":"http://127.0.0.1:53307/solr",
    [junit4] 2> "core":"testschemaapi_shard1_replica2",
    [junit4] 2> "state":"active"} current state version: 0
    [junit4] 2> 3412629 INFO (OverseerStateUpdate-96083350999924740-127.0.0.1:53307_solr-n_0000000000) [n:127.0.0.1:53307_solr ] o.a.s.c.o.ZkStateWriter going to update_collection /collections/testschemaapi/state.json version: 2
    [junit4] 2> 3412630 INFO (zkCallback-4245-thread-1-processing-n:127.0.0.1:53776_solr) [n:127.0.0.1:53776_solr ] o.a.s.c.c.ZkStateReader A cluster state change: [WatchedEvent state:SyncConnected type:NodeDataChanged path:/collections/testschemaapi/state.json] for collection [testschemaapi] has occurred - updating... (live nodes size: [2])
    [junit4] 2> 3412630 INFO (zkCallback-4241-thread-3-processing-n:127.0.0.1:53307_solr) [n:127.0.0.1:53307_solr ] o.a.s.c.c.ZkStateReader A cluster state change: [WatchedEvent state:SyncConnected type:NodeDataChanged path:/collections/testschemaapi/state.json] for collection [testschemaapi] has occurred - updating... (live nodes size: [2])
    [junit4] 2> 3412631 INFO (zkCallback-4245-thread-1-processing-n:127.0.0.1:53776_solr) [n:127.0.0.1:53776_solr ] o.a.s.c.c.ZkStateReader Updating data for [testschemaapi] from [2] to [3]
    [junit4] 2> 3412632 INFO (zkCallback-4241-thread-3-processing-n:127.0.0.1:53307_solr) [n:127.0.0.1:53307_solr ] o.a.s.c.c.ZkStateReader Updating data for [testschemaapi] from [2] to [3]
    [junit4] 2> 3412676 INFO (qtp1831224587-26496) [n:127.0.0.1:53307_solr c:testschemaapi s:shard1 r:core_node2 x:testschemaapi_shard1_replica2] o.a.s.c.ZkController We are http://127.0.0.1:53307/solr/testschemaapi_shard1_replica2/ and leader is http://127.0.0.1:53307/solr/testschemaapi_shard1_replica2/
    [junit4] 2> 3412676 INFO (qtp1831224587-26496) [n:127.0.0.1:53307_solr c:testschemaapi s:shard1 r:core_node2 x:testschemaapi_shard1_replica2] o.a.s.c.ZkController No LogReplay needed for core=testschemaapi_shard1_replica2 baseURL=http://127.0.0.1:53307/solr
    [junit4] 2> 3412676 INFO (qtp1831224587-26496) [n:127.0.0.1:53307_solr c:testschemaapi s:shard1 r:core_node2 x:testschemaapi_shard1_replica2] o.a.s.c.ZkController I am the leader, no recovery necessary
    [junit4] 2> 3412676 INFO (qtp1831224587-26496) [n:127.0.0.1:53307_so

[...truncated too long message...]

eader ZooKeeper watch triggered, but Solr cannot talk to ZK: [KeeperErrorCode = Session expired for /live_nodes]
    [junit4] 2> 3423917 INFO (jetty-launcher-4234-thread-2) [ ] o.e.j.s.h.ContextHandler Stopped o.e.j.s.ServletContextHandler@6dd1df7b{/solr,null,UNAVAILABLE}
    [junit4] 2> 3423920 INFO (SUITE-TestManagedSchemaAPI-seed#[2CE8DE1A020A97C5]-worker) [ ] o.a.s.c.ZkTestServer connecting to 127.0.0.1:44872 44872
    [junit4] 2> 3424130 INFO (Thread-10783) [ ] o.a.s.c.ZkTestServer connecting to 127.0.0.1:44872 44872
    [junit4] 2> 3424131 WARN (Thread-10783) [ ] o.a.s.c.ZkTestServer Watch limit violations:
    [junit4] 2> Maximum concurrent create/delete watches above limit:
    [junit4] 2>
    [junit4] 2> 6 /solr/configs/conf1/managed-schema
    [junit4] 2> 5 /solr/configs/conf1
    [junit4] 2> 3 /solr/aliases.json
    [junit4] 2> 3 /solr/clusterprops.json
    [junit4] 2> 2 /solr/security.json
    [junit4] 2>
    [junit4] 2> Maximum concurrent data watches above limit:
    [junit4] 2>
    [junit4] 2> 3 /solr/clusterstate.json
    [junit4] 2> 2 /solr/collections/testschemaapi/state.json
    [junit4] 2>
    [junit4] 2> Maximum concurrent children watches above limit:
    [junit4] 2>
    [junit4] 2> 11 /solr/overseer/queue
    [junit4] 2> 9 /solr/overseer/collection-queue-work
    [junit4] 2> 4 /solr/overseer/queue-work
    [junit4] 2> 3 /solr/live_nodes
    [junit4] 2> 3 /solr/collections
    [junit4] 2>
    [junit4] 2> 3424132 INFO (SUITE-TestManagedSchemaAPI-seed#[2CE8DE1A020A97C5]-worker) [ ] o.a.s.SolrTestCaseJ4 ###deleteCore
    [junit4] 2> NOTE: leaving temporary files on disk at: /export/home/jenkins/workspace/Lucene-Solr-6.x-Solaris/solr/build/solr-core/test/J1/temp/solr.schema.TestManagedSchemaAPI_2CE8DE1A020A97C5-001
    [junit4] 2> Jun 16, 2016 10:19:59 PM com.carrotsearch.randomizedtesting.ThreadLeakControl checkThreadLeaks
    [junit4] 2> WARNING: Will linger awaiting termination of 1 leaked thread(s).
    [junit4] 2> NOTE: test params are: codec=FastCompressingStoredFields(storedFieldsFormat=CompressingStoredFieldsFormat(compressionMode=FAST, chunkSize=24475, maxDocsPerChunk=7, blockSize=1), termVectorsFormat=CompressingTermVectorsFormat(compressionMode=FAST, chunkSize=24475, blockSize=1)), sim=ClassicSimilarity, locale=sl-SI, timezone=Asia/Tokyo
    [junit4] 2> NOTE: SunOS 5.11 amd64/Oracle Corporation 1.8.0_92 (64-bit)/cpus=3,threads=1,free=77010264,total=521142272
    [junit4] 2> NOTE: All tests run in this JVM: [SignatureUpdateProcessorFactoryTest, CSVRequestHandlerTest, TestTestInjection, TestGraphTermsQParserPlugin, VMParamsZkACLAndCredentialsProvidersTest, TestSchemaSimilarityResource, TestSystemIdResolver, SpellPossibilityIteratorTest, SpatialRPTFieldTypeTest, TestMissingGroups, NotRequiredUniqueKeyTest, TestSolrDeletionPolicy2, TestStandardQParsers, CleanupOldIndexTest, FieldAnalysisRequestHandlerTest, TestUninvertingReader, SuggesterWFSTTest, LeaderInitiatedRecoveryOnShardRestartTest, TestGraphMLResponseWriter, TestIndexingPerformance, CurrencyFieldOpenExchangeTest, TolerantUpdateProcessorTest, DeleteInactiveReplicaTest, MultiThreadedOCPTest, GraphQueryTest, TestSerializedLuceneMatchVersion, AnalyticsQueryTest, HdfsChaosMonkeySafeLeaderTest, TestSolrCoreProperties, ExitableDirectoryReaderTest, OverseerRolesTest, TermVectorComponentDistributedTest, TestFieldCacheSanityChecker, TestBinaryResponseWriter, PluginInfoTest, RuleEngineTest, TestSimpleTrackingShardHandler, TestUseDocValuesAsStored2, TestReRankQParserPlugin, MergeStrategyTest, TestRecovery, TestTrieFacet, FileBasedSpellCheckerTest, EchoParamsTest, DateMathParserTest, SmileWriterTest, DirectUpdateHandlerOptimizeTest, TestJoin, BlockJoinFacetRandomTest, TestSchemaNameResource, TestImplicitCoreProperties, HLLSerializationTest, CdcrReplicationHandlerTest, PreAnalyzedUpdateProcessorTest, BinaryUpdateRequestHandlerTest, DistanceFunctionTest, TestReloadDeadlock, CollectionTooManyReplicasTest, OutputWriterTest, BasicZkTest, TestOrdValues, TestOverriddenPrefixQueryForCustomFieldType, TestCSVResponseWriter, BufferStoreTest, TestFieldSortValues, ConfigSetsAPITest, TestRandomFaceting, TestFieldCollectionResource, BasicDistributedZk2Test, UpdateRequestProcessorFactoryTest, BaseCdcrDistributedZkTest, TestSha256AuthenticationProvider, VersionInfoTest, TestExceedMaxTermLength, TestInitQParser, TestReloadAndDeleteDocs, TestCollationField, SortSpecParsingTest, TestSolr4Spatial2, CreateCollectionCleanupTest, TestConfigSetsAPI, DistributedQueryComponentOptimizationTest, TestAtomicUpdateErrorCases, TestQueryTypes, TestPerFieldSimilarity, ShardSplitTest, DistribDocExpirationUpdateProcessorTest, SynonymTokenizerTest, UniqFieldsUpdateProcessorFactoryTest, TestFieldCacheWithThreads, SharedFSAutoReplicaFailoverUtilsTest, TestPerFieldSimilarityWithDefaultOverride, DistributedDebugComponentTest, DistributedQueueTest, TestDistributedMissingSort, SearchHandlerTest, RestartWhileUpdatingTest, TestDynamicFieldCollectionResource, CollectionReloadTest, TestRTGBase, TestRestoreCore, HdfsSyncSliceTest, AliasIntegrationTest, TestAuthenticationFramework, TestSolrXml, TlogReplayBufferedWhileIndexingTest, TestCloudPivotFacet, CopyFieldTest, DeleteReplicaTest, TestTrie, TestJettySolrRunner, TestReload, DistributedMLTComponentTest, HdfsNNFailoverTest, TestSolrJ, SolrInfoMBeanTest, TestSortingResponseWriter, RemoteQueryErrorTest, SolrCoreCheckLockOnStartupTest, NoCacheHeaderTest, MinimalSchemaTest, CoreAdminCreateDiscoverTest, LukeRequestHandlerTest, TestRebalanceLeaders, DebugComponentTest, NumericFieldsTest, TestClassicSimilarityFactory, TermVectorComponentTest, TestNumericTerms32, TestCrossCoreJoin, HighlighterConfigTest, TestCloudManagedSchema, SuggesterTSTTest, TestUtils, TestSSLRandomization, TestInitParams, TestCustomDocTransformer, CollectionsAPIDistributedZkTest, DistanceUnitsTest, TestQueryUtils, DocValuesMissingTest, TestMiniSolrCloudCluster, TestDefaultStatsCache, TestPKIAuthenticationPlugin, AtomicUpdatesTest, TestOmitPositions, SSLMigrationTest, DistributedTermsComponentTest, HdfsRecoveryZkTest, ChaosMonkeySafeLeaderTest, SyncSliceTest, OpenCloseCoreStressTest, OverseerTest, LeaderElectionIntegrationTest, ShardRoutingTest, RecoveryZkTest, FullSolrCloudDistribCmdsTest, TestReplicationHandler, ZkCLITest, ShardRoutingCustomTest, TestDistributedGrouping, TestRangeQuery, TestCoreContainer, TestSolr4Spatial, SpellCheckComponentTest, QueryElevationComponentTest, PeerSyncTest, TestFiltering, TestBadConfig, ShowFileRequestHandlerTest, SimplePostToolTest, TestCoreDiscovery, CoreAdminHandlerTest, SpatialFilterTest, TestCSVLoader, WordBreakSolrSpellCheckerTest, FieldMutatingUpdateProcessorTest, QueryEqualityTest, TestRemoteStreaming, CacheHeaderTest, TestWriterPerf, TestReversedWildcardFilterFactory, PrimitiveFieldTypeTest, DocumentBuilderTest, PathHierarchyTokenizerFactoryTest, FastVectorHighlighterTest, RegexBoostProcessorTest, SolrPluginUtilsTest, JsonLoaderTest, TestPHPSerializedResponseWriter, TestQuerySenderListener, AlternateDirectoryTest, TestQuerySenderNoQuery, TestStressRecovery, ConnectionReuseTest, CdcrReplicationDistributedZkTest, CdcrVersionReplicationTest, CollectionsAPIAsyncDistributedZkTest, CustomCollectionTest, LeaderFailoverAfterPartitionTest, OverriddenZkACLAndCredentialsProvidersTest, OverseerCollectionConfigSetProcessorTest, ReplicationFactorTest, RollingRestartTest, TestCloudBackupRestore, TestCloudDeleteByQuery, TestConfigSetsAPIExclusivity, TestConfigSetsAPIZkFailure, TestDistribDocBasedVersion, TestLeaderElectionZkExpiry, TestLeaderInitiatedRecoveryThread, TestRandomRequestDistribution, TestSolrCloudWithKerberosAlt, TestStressCloudBlindAtomicUpdates, TestTolerantUpdateProcessorRandomCloud, HdfsBasicDistributedZk2Test, HdfsBasicDistributedZkTest, HdfsRecoverLeaseTest, TestClusterStateMutator, ZkStateWriterTest, RulesTest, TestSQLHandler, CoreAdminRequestStatusTest, CoreMergeIndexesAdminHandlerTest, SecurityConfHandlerTest, SegmentsInfoRequestHandlerTest, DistributedFacetPivotLargeTest, DistributedFacetPivotLongTailTest, DistributedFacetPivotWhiteBoxTest, FacetPivotSmallTest, SuggestComponentContextFilterQueryTest, SuggestComponentTest, TestPivotHelperCode, TestTrackingShardHandlerFactory, JavabinLoaderTest, TestSlowCompositeReaderWrapper, CheckHdfsIndexTest, TestManagedResource, TestManagedResourceStorage, TestRestManager, TestBulkSchemaAPI, TestDynamicFieldResource, TestFieldResource, TestFieldTypeResource, TestManagedStopFilterFactory, TestCollationFieldDocValues, TestManagedSchema, TestManagedSchemaAPI]
    [junit4] Completed [558/615 (1!)] on J1 in 14.85s, 1 test, 1 error <<< FAILURES!

[...truncated 203 lines...]
BUILD FAILED
/export/home/jenkins/workspace/Lucene-Solr-6.x-Solaris/build.xml:740: The following error occurred while executing this line:
/export/home/jenkins/workspace/Lucene-Solr-6.x-Solaris/build.xml:684: The following error occurred while executing this line:
/export/home/jenkins/workspace/Lucene-Solr-6.x-Solaris/build.xml:59: The following error occurred while executing this line:
/export/home/jenkins/workspace/Lucene-Solr-6.x-Solaris/solr/build.xml:233: The following error occurred while executing this line:
/export/home/jenkins/workspace/Lucene-Solr-6.x-Solaris/solr/common-build.xml:531: The following error occurred while executing this line:
/export/home/jenkins/workspace/Lucene-Solr-6.x-Solaris/lucene/common-build.xml:1427: The following error occurred while executing this line:
/export/home/jenkins/workspace/Lucene-Solr-6.x-Solaris/lucene/common-build.xml:984: There were test failures: 615 suites (10 ignored), 2591 tests, 1 error, 88 ignored (73 assumptions) [seed: 2CE8DE1A020A97C5]

Total time: 81 minutes 47 seconds
Build step 'Invoke Ant' marked build as failure
Archiving artifacts
[WARNINGS] Skipping publisher since build result is FAILURE
Recording test results
Email was triggered for: Failure - Any
Sending email for trigger: Failure - Any

Search Discussions

Discussion Posts

Previous

Related Discussions

Discussion Navigation
viewthread | post
posts ‹ prev | 4 of 4 | next ›
Discussion Overview
groupdev @
categorieslucene
postedJun 15, '16 at 1:54p
activeJun 16, '16 at 10:24p
posts4
users1
websitelucene.apache.org

1 user in discussion

Policeman Jenkins Server: 4 posts

People

Translate

site design / logo © 2017 Grokbase