Grokbase Groups Lucene dev June 2016
FAQ
Build: http://jenkins.thetaphi.de/job/Lucene-Solr-6.x-Windows/251/
Java: 64bit/jdk1.8.0_92 -XX:-UseCompressedOops -XX:+UseG1GC

1 tests failed.
FAILED: org.apache.solr.handler.TestReqParamsAPI.test

Error Message:
Could not get expected value 'CY val modified' for path 'response/params/y/c' full output: { "responseHeader":{ "status":0, "QTime":0}, "response":{ "znodeVersion":1, "params":{ "x":{ "a":"A val", "b":"B val", "":{"v":0}}, "y":{ "c":"CY val", "b":"BY val", "i":20, "d":[ "val 1", "val 2"], "":{"v":0}}}}}, from server: http://127.0.0.1:58163/_/i/collection1

Stack Trace:
java.lang.AssertionError: Could not get expected value 'CY val modified' for path 'response/params/y/c' full output: {
   "responseHeader":{
     "status":0,
     "QTime":0},
   "response":{
     "znodeVersion":1,
     "params":{
       "x":{
         "a":"A val",
         "b":"B val",
         "":{"v":0}},
       "y":{
         "c":"CY val",
         "b":"BY val",
         "i":20,
         "d":[
           "val 1",
           "val 2"],
         "":{"v":0}}}}}, from server: http://127.0.0.1:58163/_/i/collection1
  at __randomizedtesting.SeedInfo.seed([71A7BE8A84019F72:F9F381502AFDF28A]:0)
  at org.junit.Assert.fail(Assert.java:93)
  at org.junit.Assert.assertTrue(Assert.java:43)
  at org.apache.solr.core.TestSolrConfigHandler.testForResponseElement(TestSolrConfigHandler.java:481)
  at org.apache.solr.handler.TestReqParamsAPI.testReqParams(TestReqParamsAPI.java:194)
  at org.apache.solr.handler.TestReqParamsAPI.test(TestReqParamsAPI.java:61)
  at sun.reflect.NativeMethodAccessorImpl.invoke0(Native Method)
  at sun.reflect.NativeMethodAccessorImpl.invoke(NativeMethodAccessorImpl.java:62)
  at sun.reflect.DelegatingMethodAccessorImpl.invoke(DelegatingMethodAccessorImpl.java:43)
  at java.lang.reflect.Method.invoke(Method.java:498)
  at com.carrotsearch.randomizedtesting.RandomizedRunner.invoke(RandomizedRunner.java:1764)
  at com.carrotsearch.randomizedtesting.RandomizedRunner$8.evaluate(RandomizedRunner.java:871)
  at com.carrotsearch.randomizedtesting.RandomizedRunner$9.evaluate(RandomizedRunner.java:907)
  at com.carrotsearch.randomizedtesting.RandomizedRunner$10.evaluate(RandomizedRunner.java:921)
  at org.apache.solr.BaseDistributedSearchTestCase$ShardsRepeatRule$ShardsFixedStatement.callStatement(BaseDistributedSearchTestCase.java:992)
  at org.apache.solr.BaseDistributedSearchTestCase$ShardsRepeatRule$ShardsStatement.evaluate(BaseDistributedSearchTestCase.java:967)
  at com.carrotsearch.randomizedtesting.rules.SystemPropertiesRestoreRule$1.evaluate(SystemPropertiesRestoreRule.java:57)
  at org.apache.lucene.util.TestRuleSetupTeardownChained$1.evaluate(TestRuleSetupTeardownChained.java:49)
  at org.apache.lucene.util.AbstractBeforeAfterRule$1.evaluate(AbstractBeforeAfterRule.java:45)
  at org.apache.lucene.util.TestRuleThreadAndTestName$1.evaluate(TestRuleThreadAndTestName.java:48)
  at org.apache.lucene.util.TestRuleIgnoreAfterMaxFailures$1.evaluate(TestRuleIgnoreAfterMaxFailures.java:64)
  at org.apache.lucene.util.TestRuleMarkFailure$1.evaluate(TestRuleMarkFailure.java:47)
  at com.carrotsearch.randomizedtesting.rules.StatementAdapter.evaluate(StatementAdapter.java:36)
  at com.carrotsearch.randomizedtesting.ThreadLeakControl$StatementRunner.run(ThreadLeakControl.java:367)
  at com.carrotsearch.randomizedtesting.ThreadLeakControl.forkTimeoutingTask(ThreadLeakControl.java:809)
  at com.carrotsearch.randomizedtesting.ThreadLeakControl$3.evaluate(ThreadLeakControl.java:460)
  at com.carrotsearch.randomizedtesting.RandomizedRunner.runSingleTest(RandomizedRunner.java:880)
  at com.carrotsearch.randomizedtesting.RandomizedRunner$5.evaluate(RandomizedRunner.java:781)
  at com.carrotsearch.randomizedtesting.RandomizedRunner$6.evaluate(RandomizedRunner.java:816)
  at com.carrotsearch.randomizedtesting.RandomizedRunner$7.evaluate(RandomizedRunner.java:827)
  at com.carrotsearch.randomizedtesting.rules.StatementAdapter.evaluate(StatementAdapter.java:36)
  at com.carrotsearch.randomizedtesting.rules.SystemPropertiesRestoreRule$1.evaluate(SystemPropertiesRestoreRule.java:57)
  at org.apache.lucene.util.AbstractBeforeAfterRule$1.evaluate(AbstractBeforeAfterRule.java:45)
  at com.carrotsearch.randomizedtesting.rules.StatementAdapter.evaluate(StatementAdapter.java:36)
  at org.apache.lucene.util.TestRuleStoreClassName$1.evaluate(TestRuleStoreClassName.java:41)
  at com.carrotsearch.randomizedtesting.rules.NoShadowingOrOverridesOnMethodsRule$1.evaluate(NoShadowingOrOverridesOnMethodsRule.java:40)
  at com.carrotsearch.randomizedtesting.rules.NoShadowingOrOverridesOnMethodsRule$1.evaluate(NoShadowingOrOverridesOnMethodsRule.java:40)
  at com.carrotsearch.randomizedtesting.rules.StatementAdapter.evaluate(StatementAdapter.java:36)
  at com.carrotsearch.randomizedtesting.rules.StatementAdapter.evaluate(StatementAdapter.java:36)
  at com.carrotsearch.randomizedtesting.rules.StatementAdapter.evaluate(StatementAdapter.java:36)
  at org.apache.lucene.util.TestRuleAssertionsRequired$1.evaluate(TestRuleAssertionsRequired.java:53)
  at org.apache.lucene.util.TestRuleMarkFailure$1.evaluate(TestRuleMarkFailure.java:47)
  at org.apache.lucene.util.TestRuleIgnoreAfterMaxFailures$1.evaluate(TestRuleIgnoreAfterMaxFailures.java:64)
  at org.apache.lucene.util.TestRuleIgnoreTestSuites$1.evaluate(TestRuleIgnoreTestSuites.java:54)
  at com.carrotsearch.randomizedtesting.rules.StatementAdapter.evaluate(StatementAdapter.java:36)
  at com.carrotsearch.randomizedtesting.ThreadLeakControl$StatementRunner.run(ThreadLeakControl.java:367)
  at java.lang.Thread.run(Thread.java:745)




Build Log:
[...truncated 12218 lines...]
    [junit4] Suite: org.apache.solr.handler.TestReqParamsAPI
    [junit4] 2> Creating dataDir: C:\Users\jenkins\workspace\Lucene-Solr-6.x-Windows\solr\build\solr-core\test\J1\temp\solr.handler.TestReqParamsAPI_71A7BE8A84019F72-001\init-core-data-001
    [junit4] 2> 2958290 INFO (SUITE-TestReqParamsAPI-seed#[71A7BE8A84019F72]-worker) [ ] o.a.s.SolrTestCaseJ4 Randomized ssl (false) and clientAuth (true) via: @org.apache.solr.util.RandomizeSSL(reason=, value=NaN, ssl=NaN, clientAuth=NaN)
    [junit4] 2> 2958291 INFO (SUITE-TestReqParamsAPI-seed#[71A7BE8A84019F72]-worker) [ ] o.a.s.BaseDistributedSearchTestCase Setting hostContext system property: /_/i
    [junit4] 2> 2958294 INFO (TEST-TestReqParamsAPI.test-seed#[71A7BE8A84019F72]) [ ] o.a.s.c.ZkTestServer STARTING ZK TEST SERVER
    [junit4] 2> 2958294 INFO (Thread-7451) [ ] o.a.s.c.ZkTestServer client port:0.0.0.0/0.0.0.0:0
    [junit4] 2> 2958294 INFO (Thread-7451) [ ] o.a.s.c.ZkTestServer Starting server
    [junit4] 2> 2958394 INFO (TEST-TestReqParamsAPI.test-seed#[71A7BE8A84019F72]) [ ] o.a.s.c.ZkTestServer start zk server on port:58024
    [junit4] 2> 2958394 INFO (TEST-TestReqParamsAPI.test-seed#[71A7BE8A84019F72]) [ ] o.a.s.c.c.SolrZkClient Using default ZkCredentialsProvider
    [junit4] 2> 2958395 INFO (TEST-TestReqParamsAPI.test-seed#[71A7BE8A84019F72]) [ ] o.a.s.c.c.ConnectionManager Waiting for client to connect to ZooKeeper
    [junit4] 2> 2958399 INFO (zkCallback-11619-thread-1) [ ] o.a.s.c.c.ConnectionManager Watcher org.apache.solr.common.cloud.ConnectionManager@17646796 name:ZooKeeperConnection Watcher:127.0.0.1:58024 got event WatchedEvent state:SyncConnected type:None path:null path:null type:None
    [junit4] 2> 2958399 INFO (TEST-TestReqParamsAPI.test-seed#[71A7BE8A84019F72]) [ ] o.a.s.c.c.ConnectionManager Client is connected to ZooKeeper
    [junit4] 2> 2958399 INFO (TEST-TestReqParamsAPI.test-seed#[71A7BE8A84019F72]) [ ] o.a.s.c.c.SolrZkClient Using default ZkACLProvider
    [junit4] 2> 2958399 INFO (TEST-TestReqParamsAPI.test-seed#[71A7BE8A84019F72]) [ ] o.a.s.c.c.SolrZkClient makePath: /solr
    [junit4] 2> 2958402 INFO (TEST-TestReqParamsAPI.test-seed#[71A7BE8A84019F72]) [ ] o.a.s.c.c.SolrZkClient Using default ZkCredentialsProvider
    [junit4] 2> 2958402 WARN (NIOServerCxn.Factory:0.0.0.0/0.0.0.0:0) [ ] o.a.z.s.NIOServerCnxn caught end of stream exception
    [junit4] 2> EndOfStreamException: Unable to read additional data from client sessionid 0x1555771c3f60000, likely client has closed socket
    [junit4] 2> at org.apache.zookeeper.server.NIOServerCnxn.doIO(NIOServerCnxn.java:228)
    [junit4] 2> at org.apache.zookeeper.server.NIOServerCnxnFactory.run(NIOServerCnxnFactory.java:208)
    [junit4] 2> at java.lang.Thread.run(Thread.java:745)
    [junit4] 2> 2958403 INFO (TEST-TestReqParamsAPI.test-seed#[71A7BE8A84019F72]) [ ] o.a.s.c.c.ConnectionManager Waiting for client to connect to ZooKeeper
    [junit4] 2> 2958404 INFO (zkCallback-11620-thread-1) [ ] o.a.s.c.c.ConnectionManager Watcher org.apache.solr.common.cloud.ConnectionManager@3ac2f25a name:ZooKeeperConnection Watcher:127.0.0.1:58024/solr got event WatchedEvent state:SyncConnected type:None path:null path:null type:None
    [junit4] 2> 2958404 INFO (TEST-TestReqParamsAPI.test-seed#[71A7BE8A84019F72]) [ ] o.a.s.c.c.ConnectionManager Client is connected to ZooKeeper
    [junit4] 2> 2958405 INFO (TEST-TestReqParamsAPI.test-seed#[71A7BE8A84019F72]) [ ] o.a.s.c.c.SolrZkClient Using default ZkACLProvider
    [junit4] 2> 2958405 INFO (TEST-TestReqParamsAPI.test-seed#[71A7BE8A84019F72]) [ ] o.a.s.c.c.SolrZkClient makePath: /collections/collection1
    [junit4] 2> 2958407 INFO (TEST-TestReqParamsAPI.test-seed#[71A7BE8A84019F72]) [ ] o.a.s.c.c.SolrZkClient makePath: /collections/collection1/shards
    [junit4] 2> 2958409 INFO (TEST-TestReqParamsAPI.test-seed#[71A7BE8A84019F72]) [ ] o.a.s.c.c.SolrZkClient makePath: /collections/control_collection
    [junit4] 2> 2958411 INFO (TEST-TestReqParamsAPI.test-seed#[71A7BE8A84019F72]) [ ] o.a.s.c.c.SolrZkClient makePath: /collections/control_collection/shards
    [junit4] 2> 2958413 INFO (TEST-TestReqParamsAPI.test-seed#[71A7BE8A84019F72]) [ ] o.a.s.c.AbstractZkTestCase put C:\Users\jenkins\workspace\Lucene-Solr-6.x-Windows\solr\core\src\test-files\solr\collection1\conf\solrconfig-tlog.xml to /configs/conf1/solrconfig.xml
    [junit4] 2> 2958413 INFO (TEST-TestReqParamsAPI.test-seed#[71A7BE8A84019F72]) [ ] o.a.s.c.c.SolrZkClient makePath: /configs/conf1/solrconfig.xml
    [junit4] 2> 2958416 INFO (TEST-TestReqParamsAPI.test-seed#[71A7BE8A84019F72]) [ ] o.a.s.c.AbstractZkTestCase put C:\Users\jenkins\workspace\Lucene-Solr-6.x-Windows\solr\core\src\test-files\solr\collection1\conf\schema.xml to /configs/conf1/schema.xml
    [junit4] 2> 2958417 INFO (TEST-TestReqParamsAPI.test-seed#[71A7BE8A84019F72]) [ ] o.a.s.c.c.SolrZkClient makePath: /configs/conf1/schema.xml
    [junit4] 2> 2958419 INFO (TEST-TestReqParamsAPI.test-seed#[71A7BE8A84019F72]) [ ] o.a.s.c.AbstractZkTestCase put C:\Users\jenkins\workspace\Lucene-Solr-6.x-Windows\solr\core\src\test-files\solr\collection1\conf\solrconfig.snippet.randomindexconfig.xml to /configs/conf1/solrconfig.snippet.randomindexconfig.xml
    [junit4] 2> 2958419 INFO (TEST-TestReqParamsAPI.test-seed#[71A7BE8A84019F72]) [ ] o.a.s.c.c.SolrZkClient makePath: /configs/conf1/solrconfig.snippet.randomindexconfig.xml
    [junit4] 2> 2958422 INFO (TEST-TestReqParamsAPI.test-seed#[71A7BE8A84019F72]) [ ] o.a.s.c.AbstractZkTestCase put C:\Users\jenkins\workspace\Lucene-Solr-6.x-Windows\solr\core\src\test-files\solr\collection1\conf\stopwords.txt to /configs/conf1/stopwords.txt
    [junit4] 2> 2958422 INFO (TEST-TestReqParamsAPI.test-seed#[71A7BE8A84019F72]) [ ] o.a.s.c.c.SolrZkClient makePath: /configs/conf1/stopwords.txt
    [junit4] 2> 2958424 INFO (TEST-TestReqParamsAPI.test-seed#[71A7BE8A84019F72]) [ ] o.a.s.c.AbstractZkTestCase put C:\Users\jenkins\workspace\Lucene-Solr-6.x-Windows\solr\core\src\test-files\solr\collection1\conf\protwords.txt to /configs/conf1/protwords.txt
    [junit4] 2> 2958424 INFO (TEST-TestReqParamsAPI.test-seed#[71A7BE8A84019F72]) [ ] o.a.s.c.c.SolrZkClient makePath: /configs/conf1/protwords.txt
    [junit4] 2> 2958426 INFO (TEST-TestReqParamsAPI.test-seed#[71A7BE8A84019F72]) [ ] o.a.s.c.AbstractZkTestCase put C:\Users\jenkins\workspace\Lucene-Solr-6.x-Windows\solr\core\src\test-files\solr\collection1\conf\currency.xml to /configs/conf1/currency.xml
    [junit4] 2> 2958427 INFO (TEST-TestReqParamsAPI.test-seed#[71A7BE8A84019F72]) [ ] o.a.s.c.c.SolrZkClient makePath: /configs/conf1/currency.xml
    [junit4] 2> 2958429 INFO (TEST-TestReqParamsAPI.test-seed#[71A7BE8A84019F72]) [ ] o.a.s.c.AbstractZkTestCase put C:\Users\jenkins\workspace\Lucene-Solr-6.x-Windows\solr\core\src\test-files\solr\collection1\conf\enumsConfig.xml to /configs/conf1/enumsConfig.xml
    [junit4] 2> 2958429 INFO (TEST-TestReqParamsAPI.test-seed#[71A7BE8A84019F72]) [ ] o.a.s.c.c.SolrZkClient makePath: /configs/conf1/enumsConfig.xml
    [junit4] 2> 2958431 INFO (TEST-TestReqParamsAPI.test-seed#[71A7BE8A84019F72]) [ ] o.a.s.c.AbstractZkTestCase put C:\Users\jenkins\workspace\Lucene-Solr-6.x-Windows\solr\core\src\test-files\solr\collection1\conf\open-exchange-rates.json to /configs/conf1/open-exchange-rates.json
    [junit4] 2> 2958432 INFO (TEST-TestReqParamsAPI.test-seed#[71A7BE8A84019F72]) [ ] o.a.s.c.c.SolrZkClient makePath: /configs/conf1/open-exchange-rates.json
    [junit4] 2> 2958434 INFO (TEST-TestReqParamsAPI.test-seed#[71A7BE8A84019F72]) [ ] o.a.s.c.AbstractZkTestCase put C:\Users\jenkins\workspace\Lucene-Solr-6.x-Windows\solr\core\src\test-files\solr\collection1\conf\mapping-ISOLatin1Accent.txt to /configs/conf1/mapping-ISOLatin1Accent.txt
    [junit4] 2> 2958434 INFO (TEST-TestReqParamsAPI.test-seed#[71A7BE8A84019F72]) [ ] o.a.s.c.c.SolrZkClient makePath: /configs/conf1/mapping-ISOLatin1Accent.txt
    [junit4] 2> 2958437 INFO (TEST-TestReqParamsAPI.test-seed#[71A7BE8A84019F72]) [ ] o.a.s.c.AbstractZkTestCase put C:\Users\jenkins\workspace\Lucene-Solr-6.x-Windows\solr\core\src\test-files\solr\collection1\conf\old_synonyms.txt to /configs/conf1/old_synonyms.txt
    [junit4] 2> 2958437 INFO (TEST-TestReqParamsAPI.test-seed#[71A7BE8A84019F72]) [ ] o.a.s.c.c.SolrZkClient makePath: /configs/conf1/old_synonyms.txt
    [junit4] 2> 2958440 INFO (TEST-TestReqParamsAPI.test-seed#[71A7BE8A84019F72]) [ ] o.a.s.c.AbstractZkTestCase put C:\Users\jenkins\workspace\Lucene-Solr-6.x-Windows\solr\core\src\test-files\solr\collection1\conf\synonyms.txt to /configs/conf1/synonyms.txt
    [junit4] 2> 2958440 INFO (TEST-TestReqParamsAPI.test-seed#[71A7BE8A84019F72]) [ ] o.a.s.c.c.SolrZkClient makePath: /configs/conf1/synonyms.txt
    [junit4] 2> 2958443 WARN (NIOServerCxn.Factory:0.0.0.0/0.0.0.0:0) [ ] o.a.z.s.NIOServerCnxn caught end of stream exception
    [junit4] 2> EndOfStreamException: Unable to read additional data from client sessionid 0x1555771c3f60001, likely client has closed socket
    [junit4] 2> at org.apache.zookeeper.server.NIOServerCnxn.doIO(NIOServerCnxn.java:228)
    [junit4] 2> at org.apache.zookeeper.server.NIOServerCnxnFactory.run(NIOServerCnxnFactory.java:208)
    [junit4] 2> at java.lang.Thread.run(Thread.java:745)
    [junit4] 2> 2958996 INFO (TEST-TestReqParamsAPI.test-seed#[71A7BE8A84019F72]) [ ] o.a.s.SolrTestCaseJ4 Writing core.properties file to C:\Users\jenkins\workspace\Lucene-Solr-6.x-Windows\solr\build\solr-core\test\J1\temp\solr.handler.TestReqParamsAPI_71A7BE8A84019F72-001\control-001\cores\collection1
    [junit4] 2> 2958999 INFO (TEST-TestReqParamsAPI.test-seed#[71A7BE8A84019F72]) [ ] o.e.j.s.Server jetty-9.3.8.v20160314
    [junit4] 2> 2959000 INFO (TEST-TestReqParamsAPI.test-seed#[71A7BE8A84019F72]) [ ] o.e.j.s.h.ContextHandler Started o.e.j.s.ServletContextHandler@18288b78{/_/i,null,AVAILABLE}
    [junit4] 2> 2959002 INFO (TEST-TestReqParamsAPI.test-seed#[71A7BE8A84019F72]) [ ] o.e.j.s.ServerConnector Started ServerConnector@57664aef{HTTP/1.1,[http/1.1]}{127.0.0.1:58035}
    [junit4] 2> 2959003 INFO (TEST-TestReqParamsAPI.test-seed#[71A7BE8A84019F72]) [ ] o.e.j.s.Server Started @2964035ms
    [junit4] 2> 2959003 INFO (TEST-TestReqParamsAPI.test-seed#[71A7BE8A84019F72]) [ ] o.a.s.c.s.e.JettySolrRunner Jetty properties: {solr.data.dir=C:\Users\jenkins\workspace\Lucene-Solr-6.x-Windows\solr\build\solr-core\test\J1\temp\solr.handler.TestReqParamsAPI_71A7BE8A84019F72-001\tempDir-001/control/data, hostContext=/_/i, hostPort=58035, coreRootDirectory=C:\Users\jenkins\workspace\Lucene-Solr-6.x-Windows\solr\build\solr-core\test\J1\temp\solr.handler.TestReqParamsAPI_71A7BE8A84019F72-001\control-001\cores}
    [junit4] 2> 2959003 INFO (TEST-TestReqParamsAPI.test-seed#[71A7BE8A84019F72]) [ ] o.a.s.s.SolrDispatchFilter SolrDispatchFilter.init(): sun.misc.Launcher$AppClassLoader@73d16e93
    [junit4] 2> 2959003 INFO (TEST-TestReqParamsAPI.test-seed#[71A7BE8A84019F72]) [ ] o.a.s.c.SolrResourceLoader new SolrResourceLoader for directory: 'C:\Users\jenkins\workspace\Lucene-Solr-6.x-Windows\solr\build\solr-core\test\J1\temp\solr.handler.TestReqParamsAPI_71A7BE8A84019F72-001\control-001'
    [junit4] 2> 2959003 INFO (TEST-TestReqParamsAPI.test-seed#[71A7BE8A84019F72]) [ ] o.a.s.c.SolrResourceLoader JNDI not configured for solr (NoInitialContextEx)
    [junit4] 2> 2959004 INFO (TEST-TestReqParamsAPI.test-seed#[71A7BE8A84019F72]) [ ] o.a.s.c.SolrResourceLoader solr home defaulted to 'solr/' (could not find system property or JNDI)
    [junit4] 2> 2959004 INFO (TEST-TestReqParamsAPI.test-seed#[71A7BE8A84019F72]) [ ] o.a.s.c.c.SolrZkClient Using default ZkCredentialsProvider
    [junit4] 2> 2959005 INFO (TEST-TestReqParamsAPI.test-seed#[71A7BE8A84019F72]) [ ] o.a.s.c.c.ConnectionManager Waiting for client to connect to ZooKeeper
    [junit4] 2> 2959007 INFO (zkCallback-11621-thread-1) [ ] o.a.s.c.c.ConnectionManager Watcher org.apache.solr.common.cloud.ConnectionManager@264d8c52 name:ZooKeeperConnection Watcher:127.0.0.1:58024/solr got event WatchedEvent state:SyncConnected type:None path:null path:null type:None
    [junit4] 2> 2959007 INFO (TEST-TestReqParamsAPI.test-seed#[71A7BE8A84019F72]) [ ] o.a.s.c.c.ConnectionManager Client is connected to ZooKeeper
    [junit4] 2> 2959007 INFO (TEST-TestReqParamsAPI.test-seed#[71A7BE8A84019F72]) [ ] o.a.s.c.c.SolrZkClient Using default ZkACLProvider
    [junit4] 2> 2959008 WARN (NIOServerCxn.Factory:0.0.0.0/0.0.0.0:0) [ ] o.a.z.s.NIOServerCnxn caught end of stream exception
    [junit4] 2> EndOfStreamException: Unable to read additional data from client sessionid 0x1555771c3f60002, likely client has closed socket
    [junit4] 2> at org.apache.zookeeper.server.NIOServerCnxn.doIO(NIOServerCnxn.java:228)
    [junit4] 2> at org.apache.zookeeper.server.NIOServerCnxnFactory.run(NIOServerCnxnFactory.java:208)
    [junit4] 2> at java.lang.Thread.run(Thread.java:745)
    [junit4] 2> 2959008 INFO (TEST-TestReqParamsAPI.test-seed#[71A7BE8A84019F72]) [ ] o.a.s.s.SolrDispatchFilter Loading solr.xml from SolrHome (not found in ZooKeeper)
    [junit4] 2> 2959008 INFO (TEST-TestReqParamsAPI.test-seed#[71A7BE8A84019F72]) [ ] o.a.s.c.SolrXmlConfig Loading container configuration from C:\Users\jenkins\workspace\Lucene-Solr-6.x-Windows\solr\build\solr-core\test\J1\temp\solr.handler.TestReqParamsAPI_71A7BE8A84019F72-001\control-001\solr.xml
    [junit4] 2> 2959021 INFO (TEST-TestReqParamsAPI.test-seed#[71A7BE8A84019F72]) [ ] o.a.s.c.CorePropertiesLocator Config-defined core root directory: C:\Users\jenkins\workspace\Lucene-Solr-6.x-Windows\solr\build\solr-core\test\J1\temp\solr.handler.TestReqParamsAPI_71A7BE8A84019F72-001\control-001\cores
    [junit4] 2> 2959021 INFO (TEST-TestReqParamsAPI.test-seed#[71A7BE8A84019F72]) [ ] o.a.s.c.CoreContainer New CoreContainer 376542620
    [junit4] 2> 2959021 INFO (TEST-TestReqParamsAPI.test-seed#[71A7BE8A84019F72]) [ ] o.a.s.c.CoreContainer Loading cores into CoreContainer [instanceDir=C:\Users\jenkins\workspace\Lucene-Solr-6.x-Windows\solr\build\solr-core\test\J1\temp\solr.handler.TestReqParamsAPI_71A7BE8A84019F72-001\control-001]
    [junit4] 2> 2959022 WARN (TEST-TestReqParamsAPI.test-seed#[71A7BE8A84019F72]) [ ] o.a.s.c.CoreContainer Couldn't add files from C:\Users\jenkins\workspace\Lucene-Solr-6.x-Windows\solr\build\solr-core\test\J1\temp\solr.handler.TestReqParamsAPI_71A7BE8A84019F72-001\control-001\lib to classpath: C:\Users\jenkins\workspace\Lucene-Solr-6.x-Windows\solr\build\solr-core\test\J1\temp\solr.handler.TestReqParamsAPI_71A7BE8A84019F72-001\control-001\lib
    [junit4] 2> 2959022 INFO (TEST-TestReqParamsAPI.test-seed#[71A7BE8A84019F72]) [ ] o.a.s.h.c.HttpShardHandlerFactory created with socketTimeout : 90000,urlScheme : ,connTimeout : 15000,maxConnectionsPerHost : 20,maxConnections : 10000,corePoolSize : 0,maximumPoolSize : 2147483647,maxThreadIdleTime : 5,sizeOfQueue : -1,fairnessPolicy : false,useRetries : false,
    [junit4] 2> 2959025 INFO (TEST-TestReqParamsAPI.test-seed#[71A7BE8A84019F72]) [ ] o.a.s.u.UpdateShardHandler Creating UpdateShardHandler HTTP client with params: socketTimeout=340000&connTimeout=45000&retry=true
    [junit4] 2> 2959026 INFO (TEST-TestReqParamsAPI.test-seed#[71A7BE8A84019F72]) [ ] o.a.s.l.LogWatcher SLF4J impl is org.slf4j.impl.Log4jLoggerFactory
    [junit4] 2> 2959026 INFO (TEST-TestReqParamsAPI.test-seed#[71A7BE8A84019F72]) [ ] o.a.s.l.LogWatcher Registering Log Listener [Log4j (org.slf4j.impl.Log4jLoggerFactory)]
    [junit4] 2> 2959026 INFO (TEST-TestReqParamsAPI.test-seed#[71A7BE8A84019F72]) [ ] o.a.s.c.ZkContainer Zookeeper client=127.0.0.1:58024/solr
    [junit4] 2> 2959026 INFO (TEST-TestReqParamsAPI.test-seed#[71A7BE8A84019F72]) [ ] o.a.s.c.ZkController zkHost includes chroot
    [junit4] 2> 2959026 INFO (TEST-TestReqParamsAPI.test-seed#[71A7BE8A84019F72]) [ ] o.a.s.c.c.SolrZkClient Using default ZkCredentialsProvider
    [junit4] 2> 2959027 INFO (TEST-TestReqParamsAPI.test-seed#[71A7BE8A84019F72]) [ ] o.a.s.c.c.ConnectionManager Waiting for client to connect to ZooKeeper
    [junit4] 2> 2959028 INFO (zkCallback-11624-thread-1) [ ] o.a.s.c.c.ConnectionManager Watcher org.apache.solr.common.cloud.ConnectionManager@5048b293 name:ZooKeeperConnection Watcher:127.0.0.1:58024 got event WatchedEvent state:SyncConnected type:None path:null path:null type:None
    [junit4] 2> 2959028 INFO (TEST-TestReqParamsAPI.test-seed#[71A7BE8A84019F72]) [ ] o.a.s.c.c.ConnectionManager Client is connected to ZooKeeper
    [junit4] 2> 2959028 INFO (TEST-TestReqParamsAPI.test-seed#[71A7BE8A84019F72]) [ ] o.a.s.c.c.SolrZkClient Using default ZkACLProvider
    [junit4] 2> 2959030 INFO (TEST-TestReqParamsAPI.test-seed#[71A7BE8A84019F72]) [n:127.0.0.1:58035__%2Fi ] o.a.s.c.ZkController Added new OnReconnect listener org.apache.solr.cloud.ZkController$$Lambda$33/2119583521@2362a2d1
    [junit4] 2> 2959032 INFO (TEST-TestReqParamsAPI.test-seed#[71A7BE8A84019F72]) [n:127.0.0.1:58035__%2Fi ] o.a.s.c.c.ConnectionManager Waiting for client to connect to ZooKeeper
    [junit4] 2> 2959033 INFO (zkCallback-11625-thread-1-processing-n:127.0.0.1:58035__%2Fi) [n:127.0.0.1:58035__%2Fi ] o.a.s.c.c.ConnectionManager Watcher org.apache.solr.common.cloud.ConnectionManager@68aea447 name:ZooKeeperConnection Watcher:127.0.0.1:58024/solr got event WatchedEvent state:SyncConnected type:None path:null path:null type:None
    [junit4] 2> 2959033 INFO (TEST-TestReqParamsAPI.test-seed#[71A7BE8A84019F72]) [n:127.0.0.1:58035__%2Fi ] o.a.s.c.c.ConnectionManager Client is connected to ZooKeeper
    [junit4] 2> 2959034 INFO (TEST-TestReqParamsAPI.test-seed#[71A7BE8A84019F72]) [n:127.0.0.1:58035__%2Fi ] o.a.s.c.c.SolrZkClient makePath: /overseer/queue
    [junit4] 2> 2959036 INFO (TEST-TestReqParamsAPI.test-seed#[71A7BE8A84019F72]) [n:127.0.0.1:58035__%2Fi ] o.a.s.c.c.SolrZkClient makePath: /overseer/collection-queue-work
    [junit4] 2> 2959040 INFO (TEST-TestReqParamsAPI.test-seed#[71A7BE8A84019F72]) [n:127.0.0.1:58035__%2Fi ] o.a.s.c.c.SolrZkClient makePath: /overseer/collection-map-running
    [junit4] 2> 2959043 INFO (TEST-TestReqParamsAPI.test-seed#[71A7BE8A84019F72]) [n:127.0.0.1:58035__%2Fi ] o.a.s.c.c.SolrZkClient makePath: /overseer/collection-map-completed
    [junit4] 2> 2959046 INFO (TEST-TestReqParamsAPI.test-seed#[71A7BE8A84019F72]) [n:127.0.0.1:58035__%2Fi ] o.a.s.c.c.SolrZkClient makePath: /overseer/collection-map-failure
    [junit4] 2> 2959048 INFO (TEST-TestReqParamsAPI.test-seed#[71A7BE8A84019F72]) [n:127.0.0.1:58035__%2Fi ] o.a.s.c.c.SolrZkClient makePath: /live_nodes
    [junit4] 2> 2959050 INFO (TEST-TestReqParamsAPI.test-seed#[71A7BE8A84019F72]) [n:127.0.0.1:58035__%2Fi ] o.a.s.c.c.SolrZkClient makePath: /aliases.json
    [junit4] 2> 2959052 INFO (TEST-TestReqParamsAPI.test-seed#[71A7BE8A84019F72]) [n:127.0.0.1:58035__%2Fi ] o.a.s.c.c.SolrZkClient makePath: /clusterstate.json
    [junit4] 2> 2959053 INFO (TEST-TestReqParamsAPI.test-seed#[71A7BE8A84019F72]) [n:127.0.0.1:58035__%2Fi ] o.a.s.c.c.SolrZkClient makePath: /security.json
    [junit4] 2> 2959054 INFO (TEST-TestReqParamsAPI.test-seed#[71A7BE8A84019F72]) [n:127.0.0.1:58035__%2Fi ] o.a.s.c.c.ZkStateReader Updating cluster state from ZooKeeper...
    [junit4] 2> 2959055 INFO (TEST-TestReqParamsAPI.test-seed#[71A7BE8A84019F72]) [n:127.0.0.1:58035__%2Fi ] o.a.s.c.c.ZkStateReader Loaded empty cluster properties
    [junit4] 2> 2959056 INFO (TEST-TestReqParamsAPI.test-seed#[71A7BE8A84019F72]) [n:127.0.0.1:58035__%2Fi ] o.a.s.c.c.ZkStateReader Updated live nodes from ZooKeeper... (0) -> (0)
    [junit4] 2> 2959059 INFO (TEST-TestReqParamsAPI.test-seed#[71A7BE8A84019F72]) [n:127.0.0.1:58035__%2Fi ] o.a.s.c.c.SolrZkClient makePath: /overseer_elect
    [junit4] 2> 2959061 INFO (TEST-TestReqParamsAPI.test-seed#[71A7BE8A84019F72]) [n:127.0.0.1:58035__%2Fi ] o.a.s.c.c.SolrZkClient makePath: /overseer_elect/election
    [junit4] 2> 2959063 INFO (TEST-TestReqParamsAPI.test-seed#[71A7BE8A84019F72]) [n:127.0.0.1:58035__%2Fi ] o.a.s.c.Overseer Overseer (id=null) closing
    [junit4] 2> 2959063 INFO (TEST-TestReqParamsAPI.test-seed#[71A7BE8A84019F72]) [n:127.0.0.1:58035__%2Fi ] o.a.s.c.LeaderElector Joined leadership election with path: /overseer_elect/election/96079113188933636-127.0.0.1:58035__%2Fi-n_0000000000
    [junit4] 2> 2959064 INFO (TEST-TestReqParamsAPI.test-seed#[71A7BE8A84019F72]) [n:127.0.0.1:58035__%2Fi ] o.a.s.c.OverseerElectionContext I am going to be the leader 127.0.0.1:58035__%2Fi
    [junit4] 2> 2959064 INFO (TEST-TestReqParamsAPI.test-seed#[71A7BE8A84019F72]) [n:127.0.0.1:58035__%2Fi ] o.a.s.c.c.SolrZkClient makePath: /overseer_elect/leader
    [junit4] 2> 2959065 INFO (TEST-TestReqParamsAPI.test-seed#[71A7BE8A84019F72]) [n:127.0.0.1:58035__%2Fi ] o.a.s.c.Overseer Overseer (id=96079113188933636-127.0.0.1:58035__%2Fi-n_0000000000) starting
    [junit4] 2> 2959068 INFO (TEST-TestReqParamsAPI.test-seed#[71A7BE8A84019F72]) [n:127.0.0.1:58035__%2Fi ] o.a.s.c.c.SolrZkClient makePath: /overseer/queue-work
    [junit4] 2> 2959075 INFO (TEST-TestReqParamsAPI.test-seed#[71A7BE8A84019F72]) [n:127.0.0.1:58035__%2Fi ] o.a.s.c.OverseerAutoReplicaFailoverThread Starting OverseerAutoReplicaFailoverThread autoReplicaFailoverWorkLoopDelay=10000 autoReplicaFailoverWaitAfterExpiration=30000 autoReplicaFailoverBadNodeExpiration=60000
    [junit4] 2> 2959076 INFO (OverseerCollectionConfigSetProcessor-96079113188933636-127.0.0.1:58035__%2Fi-n_0000000000) [n:127.0.0.1:58035__%2Fi ] o.a.s.c.OverseerTaskProcessor Process current queue of overseer operations
    [junit4] 2> 2959076 INFO (TEST-TestReqParamsAPI.test-seed#[71A7BE8A84019F72]) [n:127.0.0.1:58035__%2Fi ] o.a.s.c.ZkController Register node as live in ZooKeeper:/live_nodes/127.0.0.1:58035__%2Fi
    [junit4] 2> 2959076 INFO (OverseerStateUpdate-96079113188933636-127.0.0.1:58035__%2Fi-n_0000000000) [n:127.0.0.1:58035__%2Fi ] o.a.s.c.Overseer Starting to work on the main queue
    [junit4] 2> 2959077 INFO (TEST-TestReqParamsAPI.test-seed#[71A7BE8A84019F72]) [n:127.0.0.1:58035__%2Fi ] o.a.s.c.c.SolrZkClient makePath: /live_nodes/127.0.0.1:58035__%2Fi
    [junit4] 2> 2959079 INFO (zkCallback-11625-thread-1-processing-n:127.0.0.1:58035__%2Fi) [n:127.0.0.1:58035__%2Fi ] o.a.s.c.c.ZkStateReader A live node change: [WatchedEvent state:SyncConnected type:NodeChildrenChanged path:/live_nodes], has occurred - updating... (live nodes size: [0])
    [junit4] 2> 2959080 INFO (OverseerStateUpdate-96079113188933636-127.0.0.1:58035__%2Fi-n_0000000000) [n:127.0.0.1:58035__%2Fi ] o.a.s.c.c.ZkStateReader Updated live nodes from ZooKeeper... (0) -> (1)
    [junit4] 2> 2959080 INFO (zkCallback-11625-thread-1-processing-n:127.0.0.1:58035__%2Fi) [n:127.0.0.1:58035__%2Fi ] o.a.s.c.c.ZkStateReader Updated live nodes from ZooKeeper... (1) -> (1)
    [junit4] 2> 2959087 INFO (TEST-TestReqParamsAPI.test-seed#[71A7BE8A84019F72]) [n:127.0.0.1:58035__%2Fi ] o.a.s.c.CoreContainer Security conf doesn't exist. Skipping setup for authorization module.
    [junit4] 2> 2959087 INFO (TEST-TestReqParamsAPI.test-seed#[71A7BE8A84019F72]) [n:127.0.0.1:58035__%2Fi ] o.a.s.c.CoreContainer No authentication plugin used.
    [junit4] 2> 2959089 INFO (TEST-TestReqParamsAPI.test-seed#[71A7BE8A84019F72]) [n:127.0.0.1:58035__%2Fi ] o.a.s.c.CorePropertiesLocator Looking for core definitions underneath C:\Users\jenkins\workspace\Lucene-Solr-6.x-Windows\solr\build\solr-core\test\J1\temp\solr.handler.TestReqParamsAPI_71A7BE8A84019F72-001\control-001\cores
    [junit4] 2> 2959090 INFO (TEST-TestReqParamsAPI.test-seed#[71A7BE8A84019F72]) [n:127.0.0.1:58035__%2Fi ] o.a.s.c.CoreDescriptor Created CoreDescriptor: {name=collection1, config=solrconfig.xml, transient=false, schema=schema.xml, loadOnStartup=true, configSetProperties=configsetprops.json, collection=control_collection, coreNodeName=, dataDir=data\, shard=}
    [junit4] 2> 2959090 INFO (TEST-TestReqParamsAPI.test-seed#[71A7BE8A84019F72]) [n:127.0.0.1:58035__%2Fi ] o.a.s.c.CorePropertiesLocator Found core collection1 in C:\Users\jenkins\workspace\Lucene-Solr-6.x-Windows\solr\build\solr-core\test\J1\temp\solr.handler.TestReqParamsAPI_71A7BE8A84019F72-001\control-001\cores\collection1
    [junit4] 2> 2959090 INFO (TEST-TestReqParamsAPI.test-seed#[71A7BE8A84019F72]) [n:127.0.0.1:58035__%2Fi ] o.a.s.c.CorePropertiesLocator Found 1 core definitions
    [junit4] 2> 2959091 INFO (TEST-TestReqParamsAPI.test-seed#[71A7BE8A84019F72]) [n:127.0.0.1:58035__%2Fi ] o.a.s.s.SolrDispatchFilter user.dir=C:\Users\jenkins\workspace\Lucene-Solr-6.x-Windows\solr\build\solr-core\test\J1
    [junit4] 2> 2959091 INFO (TEST-TestReqParamsAPI.test-seed#[71A7BE8A84019F72]) [n:127.0.0.1:58035__%2Fi ] o.a.s.s.SolrDispatchFilter SolrDispatchFilter.init() done
    [junit4] 2> 2959091 INFO (coreLoadExecutor-11572-thread-1-processing-n:127.0.0.1:58035__%2Fi) [n:127.0.0.1:58035__%2Fi c:control_collection x:collection1] o.a.s.c.ZkController publishing state=down
    [junit4] 2> 2959092 INFO (coreLoadExecutor-11572-thread-1-processing-n:127.0.0.1:58035__%2Fi) [n:127.0.0.1:58035__%2Fi c:control_collection x:collection1] o.a.s.c.ZkController numShards not found on descriptor - reading it from system property
    [junit4] 2> 2959093 INFO (coreLoadExecutor-11572-thread-1-processing-n:127.0.0.1:58035__%2Fi) [n:127.0.0.1:58035__%2Fi c:control_collection x:collection1] o.a.s.c.ZkController Collection control_collection not visible yet, but flagging it so a watch is registered when it becomes visible
    [junit4] 2> 2959093 INFO (OverseerStateUpdate-96079113188933636-127.0.0.1:58035__%2Fi-n_0000000000) [n:127.0.0.1:58035__%2Fi ] o.a.s.c.Overseer processMessage: queueSize: 1, message = {
    [junit4] 2> "core":"collection1",
    [junit4] 2> "roles":null,
    [junit4] 2> "base_url":"http://127.0.0.1:58035/_/i",
    [junit4] 2> "node_name":"127.0.0.1:58035__%2Fi",
    [junit4] 2> "numShards":"1",
    [junit4] 2> "state":"down",
    [junit4] 2> "shard":null,
    [junit4] 2> "collection":"control_collection",
    [junit4] 2> "operation":"state"} current state version: 0
    [junit4] 2> 2959094 INFO (OverseerStateUpdate-96079113188933636-127.0.0.1:58035__%2Fi-n_0000000000) [n:127.0.0.1:58035__%2Fi ] o.a.s.c.o.ReplicaMutator Update state numShards=1 message={
    [junit4] 2> "core":"collection1",
    [junit4] 2> "roles":null,
    [junit4] 2> "base_url":"http://127.0.0.1:58035/_/i",
    [junit4] 2> "node_name":"127.0.0.1:58035__%2Fi",
    [junit4] 2> "numShards":"1",
    [junit4] 2> "state":"down",
    [junit4] 2> "shard":null,
    [junit4] 2> "collection":"control_collection",
    [junit4] 2> "operation":"state"}
    [junit4] 2> 2959094 INFO (coreLoadExecutor-11572-thread-1-processing-n:127.0.0.1:58035__%2Fi) [n:127.0.0.1:58035__%2Fi c:control_collection x:collection1] o.a.s.c.c.ZkStateReader Deleting data for [control_collection]
    [junit4] 2> 2959094 INFO (OverseerStateUpdate-96079113188933636-127.0.0.1:58035__%2Fi-n_0000000000) [n:127.0.0.1:58035__%2Fi ] o.a.s.c.o.ClusterStateMutator building a new cName: control_collection
    [junit4] 2> 2959095 INFO (coreLoadExecutor-11572-thread-1-processing-n:127.0.0.1:58035__%2Fi) [n:127.0.0.1:58035__%2Fi c:control_collection x:collection1] o.a.s.c.ZkController look for our core node name
    [junit4] 2> 2959095 INFO (OverseerStateUpdate-96079113188933636-127.0.0.1:58035__%2Fi-n_0000000000) [n:127.0.0.1:58035__%2Fi ] o.a.s.c.o.ReplicaMutator Assigning new node to shard shard=shard1
    [junit4] 2> 2959096 INFO (zkCallback-11625-thread-1-processing-n:127.0.0.1:58035__%2Fi) [n:127.0.0.1:58035__%2Fi ] o.a.s.c.c.ZkStateReader A cluster state change: [WatchedEvent state:SyncConnected type:NodeDataChanged path:/clusterstate.json], has occurred - updating... (live nodes size: [1])
    [junit4] 2> 2960096 INFO (coreLoadExecutor-11572-thread-1-processing-n:127.0.0.1:58035__%2Fi) [n:127.0.0.1:58035__%2Fi c:control_collection x:collection1] o.a.s.c.ZkController waiting to find shard id in clusterstate for collection1
    [junit4] 2> 2960096 INFO (coreLoadExecutor-11572-thread-1-processing-n:127.0.0.1:58035__%2Fi) [n:127.0.0.1:58035__%2Fi c:control_collection x:collection1] o.a.s.c.ZkController Check for collection zkNode:control_collection
    [junit4] 2> 2960096 INFO (coreLoadExecutor-11572-thread-1-processing-n:127.0.0.1:58035__%2Fi) [n:127.0.0.1:58035__%2Fi c:control_collection x:collection1] o.a.s.c.ZkController Collection zkNode exists
    [junit4] 2> 2960096 INFO (coreLoadExecutor-11572-thread-1-processing-n:127.0.0.1:58035__%2Fi) [n:127.0.0.1:58035__%2Fi c:control_collection x:collection1] o.a.s.c.c.ZkStateReader Load collection config from: [/collections/control_collection]
    [junit4] 2> 2960097 INFO (coreLoadExecutor-11572-thread-1-processing-n:127.0.0.1:58035__%2Fi) [n:127.0.0.1:58035__%2Fi c:control_collection x:collection1] o.a.s.c.c.ZkStateReader path=[/collections/control_collection] [configName]=[conf1] specified config exists in ZooKeeper
    [junit4] 2> 2960097 INFO (coreLoadExecutor-11572-thread-1-processing-n:127.0.0.1:58035__%2Fi) [n:127.0.0.1:58035__%2Fi c:control_collection x:collection1] o.a.s.c.SolrResourceLoader new SolrResourceLoader for directory: 'C:\Users\jenkins\workspace\Lucene-Solr-6.x-Windows\solr\build\solr-core\test\J1\temp\solr.handler.TestReqParamsAPI_71A7BE8A84019F72-001\control-001\cores\collection1'
    [junit4] 2> 2960097 INFO (coreLoadExecutor-11572-thread-1-processing-n:127.0.0.1:58035__%2Fi) [n:127.0.0.1:58035__%2Fi c:control_collection x:collection1] o.a.s.c.SolrResourceLoader JNDI not configured for solr (NoInitialContextEx)
    [junit4] 2> 2960097 INFO (coreLoadExecutor-11572-thread-1-processing-n:127.0.0.1:58035__%2Fi) [n:127.0.0.1:58035__%2Fi c:control_collection x:collection1] o.a.s.c.SolrResourceLoader solr home defaulted to 'solr/' (could not find system property or JNDI)
    [junit4] 2> 2960100 INFO (coreLoadExecutor-11572-thread-1-processing-n:127.0.0.1:58035__%2Fi) [n:127.0.0.1:58035__%2Fi c:control_collection x:collection1] o.a.s.c.Config loaded config solrconfig.xml with version 0
    [junit4] 2> 2960108 INFO (coreLoadExecutor-11572-thread-1-processing-n:127.0.0.1:58035__%2Fi) [n:127.0.0.1:58035__%2Fi c:control_collection x:collection1] o.a.s.c.SolrConfig current version of requestparams : -1
    [junit4] 2> 2960112 INFO (coreLoadExecutor-11572-thread-1-processing-n:127.0.0.1:58035__%2Fi) [n:127.0.0.1:58035__%2Fi c:control_collection x:collection1] o.a.s.c.SolrConfig Using Lucene MatchVersion: 6.2.0
    [junit4] 2> 2960121 INFO (coreLoadExecutor-11572-thread-1-processing-n:127.0.0.1:58035__%2Fi) [n:127.0.0.1:58035__%2Fi c:control_collection x:collection1] o.a.s.c.SolrConfig Loaded SolrConfig: solrconfig.xml
    [junit4] 2> 2960127 INFO (coreLoadExecutor-11572-thread-1-processing-n:127.0.0.1:58035__%2Fi) [n:127.0.0.1:58035__%2Fi c:control_collection x:collection1] o.a.s.s.IndexSchema [collection1] Schema name=test
    [junit4] 2> 2960232 INFO (coreLoadExecutor-11572-thread-1-processing-n:127.0.0.1:58035__%2Fi) [n:127.0.0.1:58035__%2Fi c:control_collection x:collection1] o.a.s.s.OpenExchangeRatesOrgProvider Initialized with rates=open-exchange-rates.json, refreshInterval=1440.
    [junit4] 2> 2960239 INFO (coreLoadExecutor-11572-thread-1-processing-n:127.0.0.1:58035__%2Fi) [n:127.0.0.1:58035__%2Fi c:control_collection x:collection1] o.a.s.s.IndexSchema default search field in schema is text
    [junit4] 2> 2960240 INFO (coreLoadExecutor-11572-thread-1-processing-n:127.0.0.1:58035__%2Fi) [n:127.0.0.1:58035__%2Fi c:control_collection x:collection1] o.a.s.s.IndexSchema unique key field: id
    [junit4] 2> 2960249 INFO (coreLoadExecutor-11572-thread-1-processing-n:127.0.0.1:58035__%2Fi) [n:127.0.0.1:58035__%2Fi c:control_collection x:collection1] o.a.s.s.FileExchangeRateProvider Reloading exchange rates from file currency.xml
    [junit4] 2> 2960252 INFO (coreLoadExecutor-11572-thread-1-processing-n:127.0.0.1:58035__%2Fi) [n:127.0.0.1:58035__%2Fi c:control_collection x:collection1] o.a.s.s.FileExchangeRateProvider Reloading exchange rates from file currency.xml
    [junit4] 2> 2960254 INFO (coreLoadExecutor-11572-thread-1-processing-n:127.0.0.1:58035__%2Fi) [n:127.0.0.1:58035__%2Fi c:control_collection x:collection1] o.a.s.s.OpenExchangeRatesOrgProvider Reloading exchange rates from open-exchange-rates.json
    [junit4] 2> 2960255 INFO (coreLoadExecutor-11572-thread-1-processing-n:127.0.0.1:58035__%2Fi) [n:127.0.0.1:58035__%2Fi c:control_collection x:collection1] o.a.s.s.OpenExchangeRatesOrgProvider Reloading exchange rates from open-exchange-rates.json
    [junit4] 2> 2960259 INFO (coreLoadExecutor-11572-thread-1-processing-n:127.0.0.1:58035__%2Fi) [n:127.0.0.1:58035__%2Fi c:control_collection x:collection1] o.a.s.c.ConfigSetProperties Did not find ConfigSet properties, assuming default properties: Can't find resource 'configsetprops.json' in classpath or '/configs/conf1', cwd=C:\Users\jenkins\workspace\Lucene-Solr-6.x-Windows\solr\build\solr-core\test\J1
    [junit4] 2> 2960259 INFO (coreLoadExecutor-11572-thread-1-processing-n:127.0.0.1:58035__%2Fi) [n:127.0.0.1:58035__%2Fi c:control_collection x:collection1] o.a.s.c.CoreContainer Creating SolrCore 'collection1' using configuration from collection control_collection
    [junit4] 2> 2960259 INFO (coreLoadExecutor-11572-thread-1-processing-n:127.0.0.1:58035__%2Fi) [n:127.0.0.1:58035__%2Fi c:control_collection s:shard1 r:core_node1 x:collection1] o.a.s.c.SolrCore org.apache.solr.core.MockDirectoryFactory
    [junit4] 2> 2960260 INFO (coreLoadExecutor-11572-thread-1-processing-n:127.0.0.1:58035__%2Fi) [n:127.0.0.1:58035__%2Fi c:control_collection s:shard1 r:core_node1 x:collection1] o.a.s.c.SolrCore [[collection1] ] Opening new SolrCore at [C:\Users\jenkins\workspace\Lucene-Solr-6.x-Windows\solr\build\solr-core\test\J1\temp\solr.handler.TestReqParamsAPI_71A7BE8A84019F72-001\control-001\cores\collection1], dataDir=[C:\Users\jenkins\workspace\Lucene-Solr-6.x-Windows\solr\build\solr-core\test\J1\temp\solr.handler.TestReqParamsAPI_71A7BE8A84019F72-001\control-001\cores\collection1\data\]
    [junit4] 2> 2960260 INFO (coreLoadExecutor-11572-thread-1-processing-n:127.0.0.1:58035__%2Fi) [n:127.0.0.1:58035__%2Fi c:control_collection s:shard1 r:core_node1 x:collection1] o.a.s.c.JmxMonitoredMap JMX monitoring is enabled. Adding Solr mbeans to JMX Server: com.sun.jmx.mbeanserver.JmxMBeanServer@624f3def
    [junit4] 2> 2960260 INFO (coreLoadExecutor-11572-thread-1-processing-n:127.0.0.1:58035__%2Fi) [n:127.0.0.1:58035__%2Fi c:control_collection s:shard1 r:core_node1 x:collection1] o.a.s.c.CachingDirectoryFactory return new directory for C:\Users\jenkins\workspace\Lucene-Solr-6.x-Windows\solr\build\solr-core\test\J1\temp\solr.handler.TestReqParamsAPI_71A7BE8A84019F72-001\control-001\cores\collection1\data\
    [junit4] 2> 2960260 INFO (coreLoadExecutor-11572-thread-1-processing-n:127.0.0.1:58035__%2Fi) [n:127.0.0.1:58035__%2Fi c:control_collection s:shard1 r:core_node1 x:collection1] o.a.s.c.SolrCore New index directory detected: old=null new=C:\Users\jenkins\workspace\Lucene-Solr-6.x-Windows\solr\build\solr-core\test\J1\temp\solr.handler.TestReqParamsAPI_71A7BE8A84019F72-001\control-001\cores\collection1\data\index/
    [junit4] 2> 2960262 WARN (coreLoadExecutor-11572-thread-1-processing-n:127.0.0.1:58035__%2Fi) [n:127.0.0.1:58035__%2Fi c:control_collection s:shard1 r:core_node1 x:collection1] o.a.s.c.SolrCore [collection1] Solr index directory 'C:\Users\jenkins\workspace\Lucene-Solr-6.x-Windows\solr\build\solr-core\test\J1\temp\solr.handler.TestReqParamsAPI_71A7BE8A84019F72-001\control-001\cores\collection1\data\index' doesn't exist. Creating new index...
    [junit4] 2> 2960262 INFO (coreLoadExecutor-11572-thread-1-processing-n:127.0.0.1:58035__%2Fi) [n:127.0.0.1:58035__%2Fi c:control_collection s:shard1 r:core_node1 x:collection1] o.a.s.c.CachingDirectoryFactory return new directory for C:\Users\jenkins\workspace\Lucene-Solr-6.x-Windows\solr\build\solr-core\test\J1\temp\solr.handler.TestReqParamsAPI_71A7BE8A84019F72-001\control-001\cores\collection1\data\index
    [junit4] 2> 2960262 INFO (coreLoadExecutor-11572-thread-1-processing-n:127.0.0.1:58035__%2Fi) [n:127.0.0.1:58035__%2Fi c:control_collection s:shard1 r:core_node1 x:collection1] o.a.s.u.RandomMergePolicy RandomMergePolicy wrapping class org.apache.lucene.index.LogByteSizeMergePolicy: [LogByteSizeMergePolicy: minMergeSize=1677721, mergeFactor=15, maxMergeSize=2147483648, maxMergeSizeForForcedMerge=9223372036854775807, calibrateSizeByDeletes=false, maxMergeDocs=2147483647, maxCFSSegmentSizeMB=8.796093022207999E12, noCFSRatio=0.0]
    [junit4] 2> 2960262 INFO (coreLoadExecutor-11572-thread-1-processing-n:127.0.0.1:58035__%2Fi) [n:127.0.0.1:58035__%2Fi c:control_collection s:shard1 r:core_node1 x:collection1] o.a.s.c.SolrDeletionPolicy SolrDeletionPolicy.onCommit: commits: num=1
    [junit4] 2> commit{dir=MockDirectoryWrapper(RAMDirectory@3d4406e1 lockFactory=org.apache.lucene.store.SingleInstanceLockFactory@1693960c),segFN=segments_1,generation=1}
    [junit4] 2> 2960262 INFO (coreLoadExecutor-11572-thread-1-processing-n:127.0.0.1:58035__%2Fi) [n:127.0.0.1:58035__%2Fi c:control_collection s:shard1 r:core_node1 x:collection1] o.a.s.c.SolrDeletionPolicy newest commit generation = 1
    [junit4] 2> 2960263 INFO (OldIndexDirectoryCleanupThreadForCore-collection1) [n:127.0.0.1:58035__%2Fi c:control_collection s:shard1 r:core_node1 x:collection1] o.a.s.c.SolrCore Looking for old index directories to cleanup for core collection1 in C:\Users\jenkins\workspace\Lucene-Solr-6.x-Windows\solr\build\solr-core\test\J1\temp\solr.handler.TestReqParamsAPI_71A7BE8A84019F72-001\control-001\cores\collection1\data\
    [junit4] 2> 2960263 WARN (OldIndexDirectoryCleanupThreadForCore-collection1) [n:127.0.0.1:58035__%2Fi c:control_collection s:shard1 r:core_node1 x:collection1] o.a.s.c.DirectoryFactory C:\Users\jenkins\workspace\Lucene-Solr-6.x-Windows\solr\build\solr-core\test\J1\temp\solr.handler.TestReqParamsAPI_71A7BE8A84019F72-001\control-001\cores\collection1\data\ does not point to a valid data directory; skipping clean-up of old index directories.
    [junit4] 2> 2960265 INFO (coreLoadExecutor-11572-thread-1-processing-n:127.0.0.1:58035__%2Fi) [n:127.0.0.1:58035__%2Fi c:control_collection s:shard1 r:core_node1 x:collection1] o.a.s.u.p.UpdateRequestProcessorChain creating updateRequestProcessorChain "nodistrib"
    [junit4] 2> 2960265 INFO (coreLoadExecutor-11572-thread-1-processing-n:127.0.0.1:58035__%2Fi) [n:127.0.0.1:58035__%2Fi c:control_collection s:shard1 r:core_node1 x:collection1] o.a.s.u.p.UpdateRequestProcessorChain creating updateRequestProcessorChain "dedupe"
    [junit4] 2> 2960265 INFO (coreLoadExecutor-11572-thread-1-processing-n:127.0.0.1:58035__%2Fi) [n:127.0.0.1:58035__%2Fi c:control_collection s:shard1 r:core_node1 x:collection1] o.a.s.u.p.UpdateRequestProcessorChain inserting DistributedUpdateProcessorFactory into updateRequestProcessorChain "dedupe"
    [junit4] 2> 2960265 INFO (coreLoadExecutor-11572-thread-1-processing-n:127.0.0.1:58035__%2Fi) [n:127.0.0.1:58035__%2Fi c:control_collection s:shard1 r:core_node1 x:collection1] o.a.s.u.p.UpdateRequestProcessorChain creating updateRequestProcessorChain "stored_sig"
    [junit4] 2> 2960265 INFO (coreLoadExecutor-11572-thread-1-processing-n:127.0.0.1:58035__%2Fi) [n:127.0.0.1:58035__%2Fi c:control_collection s:shard1 r:core_node1 x:collection1] o.a.s.u.p.UpdateRequestProcessorChain inserting DistributedUpdateProcessorFactory into updateRequestProcessorChain "stored_sig"
    [junit4] 2> 2960265 INFO (coreLoadExecutor-11572-thread-1-processing-n:127.0.0.1:58035__%2Fi) [n:127.0.0.1:58035__%2Fi c:control_collection s:shard1 r:core_node1 x:collection1] o.a.s.u.p.UpdateRequestProcessorChain creating updateRequestProcessorChain "distrib-dup-test-chain-explicit"
    [junit4] 2> 2960265 INFO (coreLoadExecutor-11572-thread-1-processing-n:127.0.0.1:58035__%2Fi) [n:127.0.0.1:58035__%2Fi c:control_collection s:shard1 r:core_node1 x:collection1] o.a.s.u.p.UpdateRequestProcessorChain creating updateRequestProcessorChain "distrib-dup-test-chain-implicit"
    [junit4] 2> 2960266 INFO (coreLoadExecutor-11572-thread-1-processing-n:127.0.0.1:58035__%2Fi) [n:127.0.0.1:58035__%2Fi c:control_collection s:shard1 r:core_node1 x:collection1] o.a.s.u.p.UpdateRequestProcessorChain inserting DistributedUpdateProcessorFactory into updateRequestProcessorChain "distrib-dup-test-chain-implicit"
    [junit4] 2> 2960266 INFO (coreLoadExecutor-11572-thread-1-processing-n:127.0.0.1:58035__%2Fi) [n:127.0.0.1:58035__%2Fi c:control_collection s:shard1 r:core_node1 x:collection1] o.a.s.c.SolrCore no updateRequestProcessorChain defined as default, creating implicit default
    [junit4] 2> 2960266 WARN (coreLoadExecutor-11572-thread-1-processing-n:127.0.0.1:58035__%2Fi) [n:127.0.0.1:58035__%2Fi c:control_collection s:shard1 r:core_node1 x:collection1] o.a.s.c.RequestHandlers INVALID paramSet a in requestHandler {type = requestHandler,name = /dump,class = DumpRequestHandler,args = {defaults={a=A,b=B}}}
    [junit4] 2> 2960272 INFO (coreLoadExecutor-11572-thread-1-processing-n:127.0.0.1:58035__%2Fi) [n:127.0.0.1:58035__%2Fi c:control_collection s:shard1 r:core_node1 x:collection1] o.a.s.h.l.XMLLoader xsltCacheLifetimeSeconds=60
    [junit4] 2> 2960273 INFO (coreLoadExecutor-11572-thread-1-processing-n:127.0.0.1:58035__%2Fi) [n:127.0.0.1:58035__%2Fi c:control_collection s:shard1 r:core_node1 x:collection1] o.a.s.h.l.XMLLoader xsltCacheLifetimeSeconds=60
    [junit4] 2> 2960275 INFO (coreLoadExecutor-11572-thread-1-processing-n:127.0.0.1:58035__%2Fi) [n:127.0.0.1:58035__%2Fi c:control_collection s:shard1 r:core_node1 x:collection1] o.a.s.h.l.XMLLoader xsltCacheLifetimeSeconds=60
    [junit4] 2> 2960276 INFO (coreLoadExecutor-11572-thread-1-processing-n:127.0.0.1:58035__%2Fi) [n:127.0.0.1:58035__%2Fi c:control_collection s:shard1 r:core_node1 x:collection1] o.a.s.h.l.XMLLoader xsltCacheLifetimeSeconds=60
    [junit4] 2> 2960279 INFO (coreLoadExecutor-11572-thread-1-processing-n:127.0.0.1:58035__%2Fi) [n:127.0.0.1:58035__%2Fi c:control_collection s:shard1 r:core_node1 x:collection1] o.a.s.c.RequestHandlers Registered paths: /admin/mbeans,standard,/update/json/docs,/admin/luke,/export,/get,/admin/properties,/update/json,/admin/threads,/dump,/update/csv,/sql,/graph,/admin/segments,/admin/system,/replication,/config,/stream,/schema,/admin/plugins,/admin/logging,/admin/ping,/update,/admin/file
    [junit4] 2> 2960279 INFO (coreLoadExecutor-11572-thread-1-processing-n:127.0.0.1:58035__%2Fi) [n:127.0.0.1:58035__%2Fi c:control_collection s:shard1 r:core_node1 x:collection1] o.a.s.c.SolrCore Using default statsCache cache: org.apache.solr.search.stats.LocalStatsCache
    [junit4] 2> 2960280 INFO (coreLoadExecutor-11572-thread-1-processing-n:127.0.0.1:58035__%2Fi) [n:127.0.0.1:58035__%2Fi c:control_collection s:shard1 r:core_node1 x:collection1] o.a.s.u.UpdateHandler Using UpdateLog implementation: org.apache.solr.update.UpdateLog
    [junit4] 2> 2960280 INFO (coreLoadExecutor-11572-thread-1-processing-n:127.0.0.1:58035__%2Fi) [n:127.0.0.1:58035__%2Fi c:control_collection s:shard1 r:core_node1 x:collection1] o.a.s.u.UpdateLog Initializing UpdateLog: dataDir= defaultSyncLevel=FLUSH numRecordsToKeep=100 maxNumLogsToKeep=10 numVersionBuckets=65536
    [junit4] 2> 2960282 INFO (coreLoadExecutor-11572-thread-1-processing-n:127.0.0.1:58035__%2Fi) [n:127.0.0.1:58035__%2Fi c:control_collection s:shard1 r:core_node1 x:collection1] o.a.s.u.CommitTracker Hard AutoCommit: disabled
    [junit4] 2> 2960282 INFO (coreLoadExecutor-11572-thread-1-processing-n:127.0.0.1:58035__%2Fi) [n:127.0.0.1:58035__%2Fi c:control_collection s:shard1 r:core_node1 x:collection1] o.a.s.u.CommitTracker Soft AutoCommit: disabled
    [junit4] 2> 2960282 INFO (coreLoadExecutor-11572-thread-1-processing-n:127.0.0.1:58035__%2Fi) [n:127.0.0.1:58035__%2Fi c:control_collection s:shard1 r:core_node1 x:collection1] o.a.s.u.RandomMergePolicy RandomMergePolicy wrapping class org.apache.lucene.index.LogByteSizeMergePolicy: [LogByteSizeMergePolicy: minMergeSize=1677721, mergeFactor=22, maxMergeSize=2147483648, maxMergeSizeForForcedMerge=9223372036854775807, calibrateSizeByDeletes=true, maxMergeDocs=2147483647, maxCFSSegmentSizeMB=8.796093022207999E12, noCFSRatio=0.4348376485287465]
    [junit4] 2> 2960282 INFO (coreLoadExecutor-11572-thread-1-processing-n:127.0.0.1:58035__%2Fi) [n:127.0.0.1:58035__%2Fi c:control_collection s:shard1 r:core_node1 x:collection1] o.a.s.c.SolrDeletionPolicy SolrDeletionPolicy.onInit: commits: num=1
    [junit4] 2> commit{dir=MockDirectoryWrapper(RAMDirectory@3d4406e1 lockFactory=org.apache.lucene.store.SingleInstanceLockFactory@1693960c),segFN=segments_1,generation=1}
    [junit4] 2> 2960282 INFO (coreLoadExecutor-11572-thread-1-processing-n:127.0.0.1:58035__%2Fi) [n:127.0.0.1:58035__%2Fi c:control_collection s:shard1 r:core_node1 x:collection1] o.a.s.c.SolrDeletionPolicy newest commit generation = 1
    [junit4] 2> 2960283 INFO (coreLoadExecutor-11572-thread-1-processing-n:127.0.0.1:58035__%2Fi) [n:127.0.0.1:58035__%2Fi c:control_collection s:shard1 r:core_node1 x:collection1] o.a.s.s.SolrIndexSearcher Opening [Searcher@42b97968[collection1] main]
    [junit4] 2> 2960283 INFO (coreLoadExecutor-11572-thread-1-processing-n:127.0.0.1:58035__%2Fi) [n:127.0.0.1:58035__%2Fi c:control_collection s:shard1 r:core_node1 x:collection1] o.a.s.c.c.ZkStateReader Load collection config from: [/collections/control_collection]
    [junit4] 2> 2960284 INFO (coreLoadExecutor-11572-thread-1-processing-n:127.0.0.1:58035__%2Fi) [n:127.0.0.1:58035__%2Fi c:control_collection s:shard1 r:core_node1 x:collection1] o.a.s.c.c.ZkStateReader path=[/collections/control_collection] [configName]=[conf1] specified config exists in ZooKeeper
    [junit4] 2> 2960284 INFO (coreLoadExecutor-11572-thread-1-processing-n:127.0.0.1:58035__%2Fi) [n:127.0.0.1:58035__%2Fi c:control_collection s:shard1 r:core_node1 x:collection1] o.a.s.r.ManagedResourceStorage Setting up ZooKeeper-based storage for the RestManager with znodeBase: /configs/conf1
    [junit4] 2> 2960284 INFO (coreLoadExecutor-11572-thread-1-processing-n:127.0.0.1:58035__%2Fi) [n:127.0.0.1:58035__%2Fi c:control_collection s:shard1 r:core_node1 x:collection1] o.a.s.r.ManagedResourceStorage Configured ZooKeeperStorageIO with znodeBase: /configs/conf1
    [junit4] 2> 2960284 INFO (coreLoadExecutor-11572-thread-1-processing-n:127.0.0.1:58035__%2Fi) [n:127.0.0.1:58035__%2Fi c:control_collection s:shard1 r:core_node1 x:collection1] o.a.s.r.RestManager Initializing RestManager with initArgs: {}
    [junit4] 2> 2960284 INFO (coreLoadExecutor-11572-thread-1-processing-n:127.0.0.1:58035__%2Fi) [n:127.0.0.1:58035__%2Fi c:control_collection s:shard1 r:core_node1 x:collection1] o.a.s.r.ManagedResourceStorage Reading _rest_managed.json using ZooKeeperStorageIO:path=/configs/conf1
    [junit4] 2> 2960285 INFO (coreLoadExecutor-11572-thread-1-processing-n:127.0.0.1:58035__%2Fi) [n:127.0.0.1:58035__%2Fi c:control_collection s:shard1 r:core_node1 x:collection1] o.a.s.r.ManagedResourceStorage No data found for znode /configs/conf1/_rest_managed.json
    [junit4] 2> 2960285 INFO (coreLoadExecutor-11572-thread-1-processing-n:127.0.0.1:58035__%2Fi) [n:127.0.0.1:58035__%2Fi c:control_collection s:shard1 r:core_node1 x:collection1] o.a.s.r.ManagedResourceStorage Loaded null at path _rest_managed.json using ZooKeeperStorageIO:path=/configs/conf1
    [junit4] 2> 2960285 INFO (coreLoadExecutor-11572-thread-1-processing-n:127.0.0.1:58035__%2Fi) [n:127.0.0.1:58035__%2Fi c:control_collection s:shard1 r:core_node1 x:collection1] o.a.s.r.RestManager Initializing 0 registered ManagedResources
    [junit4] 2> 2960285 INFO (coreLoadExecutor-11572-thread-1-processing-n:127.0.0.1:58035__%2Fi) [n:127.0.0.1:58035__%2Fi c:control_collection s:shard1 r:core_node1 x:collection1] o.a.s.h.ReplicationHandler Commits will be reserved for 10000
    [junit4] 2> 2960286 INFO (searcherExecutor-11573-thread-1-processing-n:127.0.0.1:58035__%2Fi x:collection1 s:shard1 c:control_collection r:core_node1) [n:127.0.0.1:58035__%2Fi c:control_collection s:shard1 r:core_node1 x:collection1] o.a.s.c.SolrCore [collection1] Registered new searcher Searcher@42b97968[collection1] main{ExitableDirectoryReader(UninvertingDirectoryReader())}
    [junit4] 2> 2960286 INFO (coreLoadExecutor-11572-thread-1-processing-n:127.0.0.1:58035__%2Fi) [n:127.0.0.1:58035__%2Fi c:control_collection s:shard1 r:core_node1 x:collection1] o.a.s.u.UpdateLog Looking up max value of version field to seed version buckets
    [junit4] 2> 2960286 INFO (coreLoadExecutor-11572-thread-1-processing-n:127.0.0.1:58035__%2Fi) [n:127.0.0.1:58035__%2Fi c:control_collection s:shard1 r:core_node1 x:collection1] o.a.s.u.VersionInfo Refreshing highest value of _version_ for 65536 version buckets from index
    [junit4] 2> 2960286 INFO (coreLoadExecutor-11572-thread-1-processing-n:127.0.0.1:58035__%2Fi) [n:127.0.0.1:58035__%2Fi c:control_collection s:shard1 r:core_node1 x:collection1] o.a.s.u.VersionInfo No terms found for _version_, cannot seed version bucket highest value from index
    [junit4] 2> 2960286 INFO (coreLoadExecutor-11572-thread-1-processing-n:127.0.0.1:58035__%2Fi) [n:127.0.0.1:58035__%2Fi c:control_collection s:shard1 r:core_node1 x:collection1] o.a.s.u.UpdateLog Could not find max version in index or recent updates, using new clock 1537265813105410048
    [junit4] 2> 2960288 INFO (coreLoadExecutor-11572-thread-1-processing-n:127.0.0.1:58035__%2Fi) [n:127.0.0.1:58035__%2Fi c:control_collection s:shard1 r:core_node1 x:collection1] o.a.s.u.UpdateLog Took 1.0ms to seed version buckets with highest version 1537265813105410048
    [junit4] 2> 2960289 INFO (coreLoadExecutor-11572-thread-1-processing-n:127.0.0.1:58035__%2Fi) [n:127.0.0.1:58035__%2Fi c:control_collection s:shard1 r:core_node1 x:collection1] o.a.s.c.ZkController watch zkdir /configs/conf1
    [junit4] 2> 2960289 INFO (coreLoadExecutor-11572-thread-1-processing-n:127.0.0.1:58035__%2Fi) [n:127.0.0.1:58035__%2Fi c:control_collection s:shard1 r:core_node1 x:collection1] o.a.s.c.CoreContainer registering core: collection1
    [junit4] 2> 2960290 INFO (coreZkRegister-11566-thread-1-processing-n:127.0.0.1:58035__%2Fi x:collection1 s:shard1 c:control_collection r:core_node1) [n:127.0.0.1:58035__%2Fi c:control_collection s:shard1 r:core_node1 x:collection1] o.a.s.c.ZkController Register replica - core:collection1 address:http://127.0.0.1:58035/_/i collection:control_collection shard:shard1
    [junit4] 2> 2960291 INFO (coreZkRegister-11566-thread-1-processing-n:127.0.0.1:58035__%2Fi x:collection1 s:shard1 c:control_collection r:core_node1) [n:127.0.0.1:58035__%2Fi c:control_collection s:shard1 r:core_node1 x:collection1] o.a.s.c.c.SolrZkClient makePath: /collections/control_collection/leader_elect/shard1/election
    [junit4] 2> 2960295 INFO (coreZkRegister-11566-thread-1-processing-n:127.0.0.1:58035__%2Fi x:collection1 s:shard1 c:control_collection r:core_node1) [n:127.0.0.1:58035__%2Fi c:control_collection s:shard1 r:core_node1 x:collection1] o.a.s.c.LeaderElector Joined leadership election with path: /collections/control_collection/leader_elect/shard1/election/96079113188933636-core_node1-n_0000000000
    [junit4] 2> 2960295 INFO (coreZkRegister-11566-thread-1-processing-n:127.0.0.1:58035__%2Fi x:collection1 s:shard1 c:control_collection r:core_node1) [n:127.0.0.1:58035__%2Fi c:control_collection s:shard1 r:core_node1 x:collection1] o.a.s.c.ShardLeaderElectionContext Running the leader process for shard=shard1 and weAreReplacement=false and leaderVoteWait=10000
    [junit4] 2> 2960296 INFO (coreZkRegister-11566-thread-1-processing-n:127.0.0.1:58035__%2Fi x:collection1 s:shard1 c:control_collection r:core_node1) [n:127.0.0.1:58035__%2Fi c:control_collection s:shard1 r:core_node1 x:collection1] o.a.s.c.ShardLeaderElectionContext Enough replicas found to continue.
    [junit4] 2> 2960296 INFO (coreZkRegister-11566-thread-1-processing-n:127.0.0.1:58035__%2Fi x:collection1 s:shard1 c:control_collection r:core_node1) [n:127.0.0.1:58035__%2Fi c:control_collection s:shard1 r:core_node1 x:collection1] o.a.s.c.ShardLeaderElectionContext I may be the new leader - try and sync
    [junit4] 2> 2960297 INFO (coreZkRegister-11566-thread-1-processing-n:127.0.0.1:58035__%2Fi x:collection1 s:shard1 c:control_collection r:core_node1) [n:127.0.0.1:58035__%2Fi c:control_collection s:shard1 r:core_node1 x:collection1] o.a.s.c.SyncStrategy Sync replicas to http://127.0.0.1:58035/_/i/collection1/
    [junit4] 2> 2960297 INFO (coreZkRegister-11566-thread-1-processing-n:127.0.0.1:58035__%2Fi x:collection1 s:shard1 c:control_collection r:core_node1) [n:127.0.0.1:58035__%2Fi c:control_collection s:shard1 r:core_node1 x:collection1] o.a.s.c.SyncStrategy Sync Success - now sync replicas to me
    [junit4] 2> 2960297 INFO (coreZkRegister-11566-thread-1-processing-n:127.0.0.1:58035__%2Fi x:collection1 s:shard1 c:control_collection r:core_node1) [n:127.0.0.1:58035__%2Fi c:control_collection s:shard1 r:core_node1 x:collection1] o.a.s.c.SyncStrategy http://127.0.0.1:58035/_/i/collection1/ has no replicas
    [junit4] 2> 2960297 INFO (OverseerStateUpdate-96079113188933636-127.0.0.1:58035__%2Fi-n_0000000000) [n:127.0.0.1:58035__%2Fi ] o.a.s.c.Overseer processMessage: queueSize: 1, message = {
    [junit4] 2> "operation":"leader",
    [junit4] 2> "shard":"shard1",
    [junit4] 2> "collection":"control_collection"} current state version: 1
    [junit4] 2> 2960299 INFO (coreZkRegister-11566-thread-1-processing-n:127.0.0.1:58035__%2Fi x:collection1 s:shard1 c:control_collection r:core_node1) [n:127.0.0.1:58035__%2Fi c:control_collection s:shard1 r:core_node1 x:collection1] o.a.s.c.c.SolrZkClient makePath: /collections/control_collection/leaders/shard1
    [junit4] 2> 2960302 INFO (coreZkRegister-11566-thread-1-processing-n:127.0.0.1:58035__%2Fi x:collection1 s:shard1 c:control_collection r:core_node1) [n:127.0.0.1:58035__%2Fi c:control_collection s:shard1 r:core_node1 x:collection1] o.a.s.c.ShardLeaderElectionContextBase Creating leader registration node /collections/control_collection/leaders/shard1/leader after winning as /collections/control_collection/leader_elect/shard1/election/96079113188933636-core_node1-n_0000000000
    [junit4] 2> 2960304 INFO (coreZkRegister-11566-thread-1-processing-n:127.0.0.1:58035__%2Fi x:collection1 s:shard1 c:control_collection r:core_node1) [n:127.0.0.1:58035__%2Fi c:control_collection s:shard1 r:core_node1 x:collection1] o.a.s.c.ShardLeaderElectionContext I am the new leader: http://127.0.0.1:58035/_/i/collection1/ shard1
    [junit4] 2> 2960305 INFO (OverseerStateUpdate-96079113188933636-127.0.0.1:58035__%2Fi-n_0000000000) [n:127.0.0.1:58035__%2Fi ] o.a.s.c.Overseer processMessage: queueSize: 1, message = {
    [junit4] 2> "operation":"leader",
    [junit4] 2> "shard":"shard1",
    [junit4] 2> "collection":"control_collection",
    [junit4] 2> "base_url":"http://127.0.0.1:58035/_/i",
    [junit4] 2> "core":"collection1",
    [junit4] 2> "state":"active"} current state version: 1
    [junit4] 2> 2960410 INFO (zkCallback-11625-thread-1-processing-n:127.0.0.1:58035__%2Fi) [n:127.0.0.1:58035__%2Fi ] o.a.s.c.c.ZkStateReader A cluster state change: [WatchedEvent state:SyncConnected type:NodeDataChanged path:/clusterstate.json], has occurred - updating... (live nodes size: [1])
    [junit4] 2> 2960457 INFO (coreZkRegister-11566-thread-1-processing-n:127.0.0.1:58035__%2Fi x:collection1 s:shard1 c:control_collection r:core_node1) [n:127.0.0.1:58035__%2Fi c:control_collection s:shard1 r:core_node1 x:collection1] o.a.s.c.ZkController We are http://127.0.0.1:58035/_/i/collection1/ and leader is http://127.0.0.1:58035/_/i/collection1/
    [junit4] 2> 2960457 INFO (coreZkRegister-11566-thread-1-processing-n:127.0.0.1:58035__%2Fi x:collection1 s:shard1 c:control_collection r:core_node1) [n:127.0.0.1:58035__%2Fi c:control_collection s:shard1 r:core_node1 x:collection1] o.a.s.c.ZkController No LogReplay needed for core=collection1 baseURL=http://127.0.0.1:58035/_/i
    [junit4] 2> 2960457 INFO (coreZkRegister-11566-thread-1-processing-n:127.0.0.1:58035__%2Fi x:collection1 s:shard1 c:control_collection r:core_node1) [n:127.0.0.1:58035__%2Fi c:control_collection s:shard1 r:core_node1 x:collection1] o.a.s.c.ZkController I am the leader, no recovery necessary
    [junit4] 2> 2960457 INFO (coreZkRegister-11566-thread-1-processing-n:127.0.0.1:58035__%2Fi x:collection1 s:shard1 c:control_collection r:core_node1) [n:127.0.0.1:58035__%2Fi c:control_collection s:shard1 r:core_node1 x:collection1] o.a.s.c.ZkController publishing state=active
    [junit4] 2> 2960457 INFO (coreZkRegister-11566-thread-1-processing-n:127.0.0.1:58035__%2Fi x:collection1 s:shard1 c:control_collection r:core_node1) [n:127.0.0.1:58035__%2Fi c:control_collection s:shard1 r:core_node1 x:collection1] o.a.s.c.ZkController numShards not found on descriptor - reading it from system property
    [junit4] 2> 2960460 INFO (OverseerStateUpdate-96079113188933636-127.0.0.1:58035__%2Fi-n_0000000000) [n:127.0.0.1:58035__%2Fi ] o.a.s.c.Overseer processMessage: queueSize: 1, message = {
    [junit4] 2> "core":"collection1",
    [junit4] 2> "core_node_name":"core_node1",
    [junit4] 2> "roles":null,
    [junit4] 2> "base_url":"http://127.0.0.1:58035/_/i",
    [junit4] 2> "node_name":"127.0.0.1:58035__%2Fi",
    [junit4] 2> "numShards":"1",
    [junit4] 2> "state":"active",
    [junit4] 2> "shard":"shard1",
    [junit4] 2> "collection":"control_collection",
    [junit4] 2> "operation":"state"} current state version: 2
    [junit4] 2> 2960460 INFO (OverseerStateUpdate-96079113188933636-127.0.0.1:58035__%2Fi-n_0000000000) [n:127.0.0.1:58035__%2Fi ] o.a.s.c.o.ReplicaMutator Update state numShards=1 message={
    [junit4] 2> "core":"collection1",
    [junit4] 2> "core_node_name":"core_node1",
    [junit4] 2> "roles":null,
    [junit4] 2> "base_url":"http://127.0.0.1:58035/_/i",
    [junit4] 2> "node_name":"127.0.0.1:58035__%2Fi",
    [junit4] 2> "numShards":"1",
    [junit4] 2> "state":"active",
    [junit4] 2> "shard":"shard1",
    [junit4] 2> "collection":"control_collection",
    [junit4] 2> "operation":"state"}
    [junit4] 2> 2960563 INFO (zkCallback-11625-thread-3-processing-n:127.0.0.1:58035__%2Fi) [n:127.0.0.1:58035__%2Fi ] o.a.s.c.c.ZkStateReader A cluster state change: [WatchedEvent state:SyncConnected type:NodeDataChanged path:/clusterstate.json], has occurred - updating... (live nodes size: [1])
    [junit4] 2> 2960593 INFO (TEST-TestReqParamsAPI.test-seed#[71A7BE8A84019F72]) [ ] o.a.s.c.s.i.CloudSolrClient Final constructed zkHost string: 127.0.0.1:58024/solr
    [junit4] 2> 2960594 INFO (TEST-TestReqParamsAPI.test-seed#[71A7BE8A84019F72]) [ ] o.a.s.c.c.SolrZkClient Using default ZkCredentialsProvider
    [junit4] 2> 2960595 INFO (TEST-TestReqParamsAPI.test-seed#[71A7BE8A84019F72]) [ ] o.a.s.c.c.ConnectionManager Waiting for client to connect to ZooKeeper
    [junit4] 2> 2960596 INFO (zkCallback-11629-thread-1) [ ] o.a.s.c.c.ConnectionManager Watcher org.apache.solr.common.cloud.ConnectionManager@62c582db name:ZooKeeperConnection Watcher:127.0.0.1:58024/solr got event WatchedEvent state:SyncConnected type:None path:null path:null type:None
    [junit4] 2> 2960596 INFO (TEST-TestReqParamsAPI.test-seed#[71A7BE8A84019F72]) [ ] o.a.s.c.c.ConnectionManager Client is connected to ZooKeeper
    [junit4] 2> 2960596 INFO (TEST-TestReqParamsAPI.test-seed#[71A7BE8A84019F72]) [ ] o.a.s.c.c.SolrZkClient Using default ZkACLProvider
    [junit4] 2> 2960596 INFO (TEST-TestReqParamsAPI.test-seed#[71A7BE8A84019F72]) [ ] o.a.s.c.c.ZkStateReader Updating cluster state from ZooKeeper...
    [junit4] 2> 2960597 INFO (TEST-TestReqParamsAPI.test-seed#[71A7BE8A84019F72]) [ ] o.a.s.c.c.ZkStateReader Loaded empty cluster properties
    [junit4] 2> 2960599 INFO (TEST-TestReqParamsAPI.test-seed#[71A7BE8A84019F72]) [ ] o.a.s.c.c.ZkStateReader Updated live nodes from ZooKeeper... (0) -> (1)
    [junit4] 2> 2960601 INFO (TEST-TestReqParamsAPI.test-seed#[71A7BE8A84019F72]) [ ] o.a.s.c.ChaosMonkey monkey: init - expire sessions:false cause connection loss:false
    [junit4] 2> 2960601 INFO (TEST-TestReqParamsAPI.test-seed#[71A7BE8A84019F72]) [ ] o.a.s.c.AbstractFullDistribZkTestBase Creating collection1 with stateFormat=2
    [junit4] 2> 2960601 INFO (TEST-TestReqParamsAPI.test-seed#[71A7BE8A84019F72]) [ ] o.a.s.c.c.SolrZkClient Using default ZkCredentialsProvider
    [junit4] 2> 2960603 INFO (TEST-TestReqParamsAPI.test-seed#[71A7BE8A84019F72]) [ ] o.a.s.c.c.ConnectionManager Waiting for client to connect to ZooKeeper
    [junit4] 2> 2960605 INFO (zkCallback-11630-thread-1) [ ] o.a.s.c.c.ConnectionManager Watcher org.apache.solr.common.cloud.ConnectionManager@5a48a9a0 name:ZooKeeperConnection Watcher:127.0.0.1:58024/solr got event WatchedEvent state:SyncConnected type:None path:null path:null type:None
    [junit4] 2> 2960605 INFO (TEST-TestReqParamsAPI.test-seed#[71A7BE8A84019F72]) [ ] o.a.s.c.c.ConnectionManager Client is connected to ZooKeeper
    [junit4] 2> 2960605 INFO (TEST-TestReqParamsAPI.test-seed#[71A7BE8A84019F72]) [ ] o.a.s.c.c.SolrZkClient Using default ZkACLProvider
    [junit4] 2> 2960610 INFO (OverseerStateUpdate-96079113188933636-127.0.0.1:58035__%2Fi-n_0000000000) [n:127.0.0.1:58035__%2Fi ] o.a.s.c.Overseer processMessage: queueSize: 1, message = {
    [junit4] 2> "operation":"create",
    [junit4] 2> "name":"collection1",
    [junit4] 2> "numShards":"2",
    [junit4] 2> "stateFormat":"2"} current state version: 3
    [junit4] 2> 2960610 INFO (OverseerStateUpdate-96079113188933636-127.0.0.1:58035__%2Fi-n_0000000000) [n:127.0.0.1:58035__%2Fi ] o.a.s.c.o.ClusterStateMutator building a new cName: collection1
    [junit4] 2> 2960716 INFO (OverseerStateUpdate-96079113188933636-127.0.0.1:58035__%2Fi-n_0000000000) [n:127.0.0.1:58035__%2Fi ] o.a.s.c.o.ZkStateWriter going to create_collection /collections/collection1/state.json
    [junit4] 2> 2961146 INFO (TEST-TestReqParamsAPI.test-seed#[71A7BE8A84019F72]) [ ] o.a.s.SolrTestCaseJ4 Writing core.properties file to C:\Users\jenkins\workspace\Lucene-Solr-6.x-Windows\solr\build\solr-core\test\J1\temp\solr.handler.TestReqParamsAPI_71A7BE8A84019F72-001\shard-1-001\cores\collection1
    [junit4] 2> 2961150 INFO (TEST-TestReqParamsAPI.test-seed#[71A7BE8A84019F72]) [ ] o.a.s.c.AbstractFullDistribZkTestBase create jetty 1 in directory C:\Users\jenkins\workspace\Lucene-Solr-6.x-Windows\solr\build\solr-core\test\J1\temp\solr.handler.TestReqParamsAPI_71A7BE8A84019F72-001\shard-1-001
    [junit4] 2> 2961151 INFO (TEST-TestReqParamsAPI.test-seed#[71A7BE8A84019F72]) [ ] o.e.j.s.Server jetty-9.3.8.v20160314
    [junit4] 2> 2961152 INFO (TEST-TestReqParamsAPI.test-seed#[71A7BE8A84019F72]) [ ] o.e.j.s.h.ContextHandler Started o.e.j.s.ServletContextHandler@493886f0{/_/i,null,AVAILABLE}
    [junit4] 2> 2961153 INFO (TEST-TestReqParamsAPI.test-seed#[71A7BE8A84019F72]) [ ] o.e.j.s.ServerConnector Started ServerConnector@3149439d{HTTP/1.1,[http/1.1]}{127.0.0.1:58062}
    [junit4] 2> 2961154 INFO (TEST-TestReqParamsAPI.test-seed#[71A7BE8A84019F72]) [ ] o.e.j.s.Server Started @2966186ms
    [junit4] 2> 2961155 INFO (TEST-TestReqParamsAPI.test-seed#[71A7BE8A84019F72]) [ ] o.a.s.c.s.e.JettySolrRunner Jetty properties: {solr.data.dir=C:\Users\jenkins\workspace\Lucene-Solr-6.x-Windows\solr\build\solr-core\test\J1\temp\solr.handler.TestReqParamsAPI_71A7BE8A84019F72-001\tempDir-001/jetty1, solrconfig=solrconfig.xml, hostContext=/_/i, hostPort=58062, coreRootDirectory=C:\Users\jenkins\workspace\Lucene-Solr-6.x-Windows\solr\build\solr-core\test\J1\temp\solr.handler.TestReqParamsAPI_71A7BE8A84019F72-001\shard-1-001\cores}
    [junit4] 2> 2961155 INFO (TEST-TestReqParamsAPI.test-seed#[71A7BE8A84019F72]) [ ] o.a.s.s.SolrDispatchFilter SolrDispatchFilter.init(): sun.misc.Launcher$AppClassLoader@73d16e93
    [junit4] 2> 2961155 INFO (TEST-TestReqParamsAPI.test-seed#[71A7BE8A84019F72]) [ ] o.a.s.c.SolrResourceLoader new SolrResourceLoader for directory: 'C:\Users\jenkins\workspace\Lucene-Solr-6.x-Windows\solr\build\solr-core\test\J1\temp\solr.handler.TestReqParamsAPI_71A7BE8A84019F72-001\shard-1-001'
    [junit4] 2> 2961156 INFO (TEST-TestReqParamsAPI.test-seed#[71A7BE8A84019F72]) [ ] o.a.s.c.SolrResourceLoader JNDI not configured for solr (NoInitialContextEx)
    [junit4] 2> 2961156 INFO (TEST-TestReqParamsAPI.test-seed#[71A7BE8A84019F72]) [ ] o.a.s.c.SolrResourceLoader solr home defaulted to 'solr/' (could not find system property or JNDI)
    [junit4] 2> 2961157 INFO (TEST-TestReqParamsAPI.test-seed#[71A7BE8A84019F72]) [ ] o.a.s.c.c.SolrZkClient Using default ZkCredentialsProvider
    [junit4] 2> 2961158 INFO (TEST-TestReqParamsAPI.test-seed#[71A7BE8A84019F72]) [ ] o.a.s.c.c.ConnectionManager Waiting for client to connect to ZooKeeper
    [junit4] 2> 2961161 INFO (zkCallback-11631-thread-1) [ ] o.a.s.c.c.ConnectionManager Watcher org.apache.solr.common.cloud.ConnectionManager@3ba6e1ca name:ZooKeeperConnection Watcher:127.0.0.1:58024/solr got event WatchedEvent state:SyncConnected type:None path:null path:null type:None
    [junit4] 2> 2961161 INFO (TEST-TestReqParamsAPI.test-seed#[71A7BE8A84019F72]) [ ] o.a.s.c.c.ConnectionManager Client is connected to ZooKeeper
    [junit4] 2> 2961162 INFO (TEST-TestReqParamsAPI.test-seed#[71A7BE8A84019F72]) [ ] o.a.s.c.c.SolrZkClient Using default ZkACLProvider
    [junit4] 2> 2961162 WARN (NIOServerCxn.Factory:0.0.0.0/0.0.0.0:0) [ ] o.a.z.s.NIOServerCnxn caught end of stream exception
    [junit4] 2> EndOfStreamException: Unable to read additional data from client sessionid 0x1555771c3f60007, likely client has closed socket
    [junit4] 2> at org.apache.zookeeper.server.NIOServerCnxn.doIO(NIOServerCnxn.java:228)
    [junit4] 2> at org.apache.zookeeper.server.NIOServerCnxnFactory.run(NIOServerCnxnFactory.java:208)
    [junit4] 2> at java.lang.Thread.run(Thread.java:745)
    [junit4] 2> 2961162 INFO (TEST-TestReqParamsAPI.test-seed#[71A7BE8A84019F72]) [ ] o.a.s.s.SolrDispatchFilter Loading solr.xml from SolrHome (not found in ZooKeeper)
    [junit4] 2> 2961162 INFO (TEST-TestReqParamsAPI.test-seed#[71A7BE8A84019F72]) [ ] o.a.s.c.SolrXmlConfig Loading container configuration from C:\Users\jenkins\workspace\Lucene-Solr-6.x-Windows\solr\build\solr-core\test\J1\temp\solr.handler.TestReqParamsAPI_71A7BE8A84019F72-001\shard-1-001\solr.xml
    [junit4] 2> 2961179 INFO (TEST-TestReqParamsAPI.test-seed#[71A7BE8A84019F72]) [ ] o.a.s.c.CorePropertiesLocator Config-defined core root directory: C:\Users\jenkins\workspace\Lucene-Solr-6.x-Windows\solr\build\solr-core\test\J1\temp\solr.handler.TestReqParamsAPI_71A7BE8A84019F72-001\shard-1-001\cores
    [junit4] 2> 2961179 INFO (TEST-TestReqParamsAPI.test-seed#[71A7BE8A84019F72]) [ ] o.a.s.c.CoreContainer New CoreContainer 107996809
    [junit4] 2> 2961179 INFO (TEST-TestReqParamsAPI.test-seed#[71A7BE8A84019F72]) [ ] o.a.s.c.CoreContainer Loading cores into CoreContainer [instanceDir=C:\Users\jenkins\workspace\Lucene-Solr-6.x-Windows\solr\build\solr-core\test\J1\temp\solr.handler.TestReqParamsAPI_71A7BE8A84019F72-001\shard-1-001]
    [junit4] 2> 2961180 WARN (TEST-TestReqParamsAPI.test-seed#[71A7BE8A84019F72]) [ ] o.a.s.c.CoreContainer Couldn't add files from C:\Users\jenkins\workspace\Lucene-Solr-6.x-Windows\solr\build\solr-core\test\J1\temp\solr.handler.TestReqParamsAPI_71A7BE8A84019F72-001\shard-1-001\lib to classpath: C:\Users\jenkins\workspace\Lucene-Solr-6.x-Windows\solr\build\solr-core\test\J1\temp\solr.handler.TestReqParamsAPI_71A7BE8A84019F72-001\shard-1-001\lib
    [junit4] 2> 2961180 INFO (TEST-TestReqParamsAPI.test-seed#[71A7BE8A84019F72]) [ ] o.a.s.h.c.HttpShardHandlerFactory created with socketTimeout : 90000,urlScheme : ,connTimeout : 15000,maxConnectionsPerHost : 20,maxConnections : 10000,corePoolSize : 0,maximumPoolSize : 2147483647,maxThreadIdleTime : 5,sizeOfQueue : -1,fairnessPolicy : false,useRetries : false,
    [junit4] 2> 2961185 INFO (TEST-TestReqParamsAPI.test-seed#[71A7BE8A84019F72]) [ ] o.a.s.u.UpdateShardHandler Creating UpdateShardHandler HTTP client with params: socketTimeout=340000&connTimeout=45000&retry=true
    [junit4] 2> 2961186 INFO (TEST-TestReqParamsAPI.test-seed#[71A7BE8A84019F72]) [ ] o.a.s.l.LogWatcher SLF4J impl is org.slf4j.impl.Log4jLoggerFactory
    [junit4] 2> 2961186 INFO (TEST-TestReqParamsAPI.test-seed#[71A7BE8A84019F72]) [ ] o.a.s.l.LogWatcher Registering Log Listener [Log4j (org.slf4j.impl.Log4jLoggerFactory)]
    [junit4] 2> 2961186 INFO (TEST-TestReqParamsAPI.test-seed#[71A7BE8A84019F72]) [ ] o.a.s.c.ZkContainer Zookeeper client=127.0.0.1:58024/solr
    [junit4] 2> 2961186 INFO (TEST-TestReqParamsAPI.test-seed#[71A7BE8A84019F72]) [ ] o.a.s.c.ZkController zkHost includes chroot
    [junit4] 2> 2961186 INFO (TEST-TestReqParamsAPI.test-seed#[71A7BE8A84019F72]) [ ] o.a.s.c.c.SolrZkClient Using default ZkCredentialsProvider
    [junit4] 2> 2961187 INFO (TEST-TestReqParamsAPI.test-seed#[71A7BE8A84019F72]) [ ] o.a.s.c.c.ConnectionManager Waiting for client to connect to ZooKeeper
    [junit4] 2> 2961189 INFO (zkCallback-11634-thread-1) [ ] o.a.s.c.c.ConnectionManager Watcher org.apache.solr.common.cloud.ConnectionManager@308f445f name:ZooKeeperConnection Watcher:127.0.0.1:58024 got event WatchedEvent state:SyncConnected type:None path:null path:null type:None
    [junit4] 2> 2961189 INFO (TEST-TestReqParamsAPI.test-seed#[71A7BE8A84019F72]) [ ] o.a.s.c.c.ConnectionManager Client is connected to ZooKeeper
    [junit4] 2> 2961189 INFO (TEST-TestReqParamsAPI.test-seed#[71A7BE8A84019F72]) [ ] o.a.s.c.c.SolrZkClient Using default ZkACLProvider
    [junit4] 2> 2961190 WARN (NIOServerCxn.Factory:0.0.0.0/0.0.0.0:0) [ ] o.a.z.s.NIOServerCnxn caught end of stream exception
    [junit4] 2> EndOfStreamException: Unable to read additional data from client sessionid 0x1555771c3f60008, likely client has closed socket
    [junit4] 2> at org.apache.zookeeper.server.NIOServerCnxn.doIO(NIOServerCnxn.java:228)
    [junit4] 2> at org.apache.zookeeper.server.NIOServerCnxnFactory.run(NIOServerCnxnFactory.java:208)
    [junit4] 2> at java.lang.Thread.run(Thread.java:745)
    [junit4] 2> 2961192 INFO (TEST-TestReqParamsAPI.test-seed#[71A7BE8A84019F72]) [n:127.0.0.1:58062__%2Fi ] o.a.s.c.ZkController Added new OnReconnect listener org.apache.solr.cloud.ZkController$$Lambda$33/2119583521@5ebde13d
    [junit4] 2> 2961193 INFO (TEST-TestReqParamsAPI.test-seed#[71A7BE8A84019F72]) [n:127.0.0.1:58062__%2Fi ] o.a.s.c.c.ConnectionManager Waiting for client to connect to ZooKeeper
    [junit4] 2> 2961195 INFO (zkCallback-11635-thread-1-processing-n:127.0.0.1:58062__%2Fi) [n:127.0.0.1:58062__%2Fi ] o.a.s.c.c.ConnectionManager Watcher org.apache.solr.common.cloud.ConnectionManager@6b99050 name:ZooKeeperConnection Watcher:127.0.0.1:58024/solr got event WatchedEvent state:SyncConnected type:None path:null path:null type:None
    [junit4] 2> 2961195 INFO (TEST-TestReqParamsAPI.test-seed#[71A7BE8A84019F72]) [n:127.0.0.1:58062__%2Fi ] o.a.s.c.c.ConnectionManager Client is connected to ZooKeeper
    [junit4] 2> 2961205 INFO (TEST-TestReqParamsAPI.test-seed#[71A7BE8A84019F72]) [n:127.0.0.1:58062__%2Fi ] o.a.s.c.c.ZkStateReader Updating cluster state from ZooKeeper...
    [junit4] 2> 2961206 INFO (TEST-TestReqParamsAPI.test-seed#[71A7BE8A84019F72]) [n:127.0.0.1:58062__%2Fi ] o.a.s.c.c.ZkStateReader Loaded empty cluster properties
    [junit4] 2> 2961207 INFO (TEST-TestReqParamsAPI.test-seed#[71A7BE8A84019F72]) [n:127.0.0.1:58062__%2Fi ] o.a.s.c.c.ZkStateReader Updated live nodes from ZooKeeper... (0) -> (1)
    [junit4] 2> 2961212 INFO (TEST-TestReqParamsAPI.test-seed#[71A7BE8A84019F72]) [n:127.0.0.1:58062__%2Fi ] o.a.s.c.Overseer Overseer (id=null) closing
    [junit4] 2> 2961213 INFO (TEST-TestReqParamsAPI.test-seed#[71A7BE8A84019F72]) [n:127.0.0.1:58062__%2Fi ] o.a.s.c.LeaderElector Joined leadership election with path: /overseer_elect/election/96079113188933641-127.0.0.1:58062__%2Fi-n_0000000001
    [junit4] 2> 2961213 INFO (TEST-TestReqParamsAPI.test-seed#[71A7BE8A84019F72]) [n:127.0.0.1:58062__%2Fi ] o.a.s.c.LeaderElector Watching path /overseer_elect/election/96079113188933636-127.0.0.1:58035__%2Fi-n_0000000000 to know if I could be the leader
    [junit4] 2> 2961213 INFO (TEST-TestReqParamsAPI.test-seed#[71A7BE8A84019F72]) [n:127.0.0.1:58062__%2Fi ] o.a.s.c.ZkController Publish node=127.0.0.1:58062__%2Fi as DOWN
    [junit4] 2> 2961217 INFO (OverseerStateUpdate-96079113188933636-127.0.0.1:58035__%2Fi-n_0000000000) [n:127.0.0.1:58035__%2Fi ] o.a.s.c.Overseer processMessage: queueSize: 1, message = {
    [junit4] 2> "operation":"downnode",
    [junit4] 2> "node_name":"127.0.0.1:58062__%2Fi"} current state version: 3
    [junit4] 2> 2961217 INFO (OverseerStateUpdate-96079113188933636-127.0.0.1:58035__%2Fi-n_0000000000) [n:127.0.0.1:58035__%2Fi ] o.a.s.c.o.NodeMutator DownNode state invoked for node: 127.0.0.1:58062__%2Fi
    [junit4] 2> 2961220 INFO (zkCallback-11629-thread-1) [ ] o.a.s.c.c.ZkStateReader A cluster state change: [WatchedEvent state:SyncConnected type:NodeDataChanged path:/clusterstate.json], has occurred - updating... (live nodes size: [1])
    [junit4] 2> 2961220 INFO (zkCallback-11625-thread-1-processing-n:127.0.0.1:58035__%2Fi) [n:127.0.0.1:58035__%2Fi ] o.a.s.c.c.ZkStateReader A cluster state change: [WatchedEvent state:SyncConnected type:NodeDataChanged path:/clusterstate.json], has occurred - updating... (live nodes size: [1])
    [junit4] 2> 2961220 INFO (zkCallback-11635-thread-1-processing-n:127.0.0.1:58062__%2Fi) [n:127.0.0.1:58062__%2Fi ] o.a.s.c.c.ZkStateReader A cluster state change: [WatchedEvent state:SyncConnected type:NodeDataChanged path:/clusterstate.json], has occurred - updating... (live nodes size: [1])
    [junit4] 2> 2961328 INFO (OverseerStateUpdate-96079113188933636-127.0.0.1:58035__%2Fi-n_0000000000) [n:127.0.0.1:58035__%2Fi ] o.a.s.c.o.ZkStateWriter going to update_collection /collections/collection1/state.json version: 0
    [junit4] 2> 2962216 INFO (TEST-TestReqParamsAPI.test-seed#[71A7BE8A84019F72]) [n:127.0.0.1:58062__%2Fi ] o.a.s.c.ZkController Register node as live in ZooKeeper:/live_nodes/127.0.0.1:58062__%2Fi
    [junit4] 2> 2962217 INFO (TEST-TestReqParamsAPI.test-seed#[71A7BE8A84019F72]) [n:127.0.0.1:58062__%2Fi ] o.a.s.c.c.SolrZkClient makePath: /live_nodes/127.0.0.1:58062__%2Fi
    [junit4] 2> 2962219 INFO (zkCallback-11629-thread-1) [ ] o.a.s.c.c.ZkStateReader A live node change: [WatchedEvent state:SyncConnected type:NodeChildrenChanged path:/live_nodes], has occurred - updating... (live nodes size: [1])
    [junit4] 2> 2962219 INFO (zkCallback-11635-thread-1-processing-n:127.0.0.1:58062__%2Fi) [n:127.0.0.1:58062__%2Fi ] o.a.s.c.c.ZkStateReader A live node change: [WatchedEvent state:SyncConnected type:NodeChildrenChanged path:/live_nodes], has occurred - updating... (live nodes size: [1])
    [junit4] 2> 2962219 INFO (zkCallback-11625-thread-1-processing-n:127.0.0.1:58035__%2Fi) [n:127.0.0.1:58035__%2Fi ] o.a.s.c.c.ZkStateReader A live node change: [WatchedEvent state:SyncConnected type:NodeChildrenChanged path:/live_nodes], has occurred - updating... (live nodes size: [1])
    [junit4] 2> 2962220 INFO (zkCallback-11629-thread-1) [ ] o.a.s.c.c.ZkStateReader Updated live nodes from ZooKeeper... (1) -> (2)
    [junit4] 2> 2962220 INFO (zkCallback-11635-thread-1-processing-n:127.0.0.1:58062__%2Fi) [n:127.0.0.1:58062__%2Fi ] o.a.s.c.c.ZkStateReader Updated live nodes from ZooKeeper... (1) -> (2)
    [junit4] 2> 2962220 INFO (zkCallback-11625-thread-1-processing-n:127.0.0.1:58035__%2Fi) [n:127.0.0.1:58035__%2Fi ] o.a.s.c.c.ZkStateReader Updated live nodes from ZooKeeper... (1) -> (2)
    [junit4] 2> 2962229 INFO (TEST-TestReqParamsAPI.test-seed#[71A7BE8A84019F72]) [n:127.0.0.1:58062__%2Fi ] o.a.s.c.CoreContainer Security conf doesn't exist. Skipping setup for authorization module.
    [junit4] 2> 2962229 INFO (TEST-TestReqParamsAPI.test-seed#[71A7BE8A84019F72]) [n:127.0.0.1:58062__%2Fi ] o.a.s.c.CoreContainer No authentication plugin used.
    [junit4] 2> 2962230 INFO (TEST-TestReqParamsAPI.test-seed#[71A7BE8A84019F72]) [n:127.0.0.1:58062__%2Fi ] o.a.s.c.CorePropertiesLocator Looking for core definitions underneath C:\Users\jenkins\workspace\Lucene-Solr-6.x-Windows\solr\build\solr-core\test\J1\temp\solr.handler.TestReqParamsAPI_71A7BE8A84019F72-001\shard-1-001\cores
    [junit4] 2> 2962232 INFO (TEST-TestReqParamsAPI.test-seed#[71A7BE8A84019F72]) [n:127.0.0.1:58062__%2Fi ] o.a.s.c.CoreDescriptor Created CoreDescriptor: {name=collection1, config=solrconfig.xml, transient=false, schema=schema.xml, loadOnStartup=true, configSetProperties=configsetprops.json, collection=collection1, coreNodeName=, dataDir=data\, shard=}
    [junit4] 2> 2962232 INFO (TEST-TestReqParamsAPI.test-seed#[71A7BE8A84019F72]) [n:127.0.0.1:58062__%2Fi ] o.a.s.c.CorePropertiesLocator Found core collection1 in C:\Users\jenkins\workspace\Lucene-Solr-6.x-Windows\solr\build\solr-core\test\J1\temp\solr.handler.TestReqParamsAPI_71A7BE8A84019F72-001\shard-1-001\cores\collection1
    [junit4] 2> 2962232 INFO (TEST-TestReqParamsAPI.test-seed#[71A7BE8A84019F72]) [n:127.0.0.1:58062__%2Fi ] o.a.s.c.CorePropertiesLocator Found 1 core definitions
    [junit4] 2> 2962234 INFO (TEST-TestReqParamsAPI.test-seed#[71A7BE8A84019F72]) [n:127.0.0.1:58062__%2Fi ] o.a.s.s.SolrDispatchFilter user.dir=C:\Users\jenkins\workspace\Lucene-Solr-6.x-Windows\solr\build\solr-core\test\J1
    [junit4] 2> 2962234 INFO (TEST-TestReqParamsAPI.test-seed#[71A7BE8A84019F72]) [n:127.0.0.1:58062__%2Fi ] o.a.s.s.SolrDispatchFilter SolrDispatchFilter.init() done
    [junit4] 2> 2962234 INFO (coreLoadExecutor-11583-thread-1-processing-n:127.0.0.1:58062__%2Fi) [n:127.0.0.1:58062__%2Fi c:collection1 x:collection1] o.a.s.c.ZkController publishing state=down
    [junit4] 2> 2962234 INFO (coreLoadExecutor-11583-thread-1-processing-n:127.0.0.1:58062__%2Fi) [n:127.0.0.1:58062__%2Fi c:collection1 x:collection1] o.a.s.c.ZkController numShards not found on descriptor - reading it from system property
    [junit4] 2> 2962236 INFO (OverseerStateUpdate-96079113188933636-127.0.0.1:58035__%2Fi-n_0000000000) [n:127.0.0.1:58035__%2Fi ] o.a.s.c.Overseer processMessage: queueSize: 1, message = {
    [junit4] 2> "core":"collection1",
    [junit4] 2> "roles":null,
    [junit4] 2> "base_url":"http://127.0.0.1:58062/_/i",
    [junit4] 2> "node_name":"127.0.0.1:58062__%2Fi",
    [junit4] 2> "numShards":"2",
    [junit4] 2> "state":"down",
    [junit4] 2> "shard":null,
    [junit4] 2> "collection":"collection1",
    [junit4] 2> "operation":"state"} current state version: 4
    [junit4] 2> 2962236 INFO (OverseerStateUpdate-96079113188933636-127.0.0.1:58035__%2Fi-n_0000000000) [n:127.0.0.1:58035__%2Fi ] o.a.s.c.o.ReplicaMutator Update state numShards=2 message={
    [junit4] 2> "core":"collection1",
    [junit4] 2> "roles":null,
    [junit4] 2> "base_url":"http://127.0.0.1:58062/_/i",
    [junit4] 2> "node_name":"127.0.0.1:58062__%2Fi",
    [junit4] 2> "numShards":"2",
    [junit4] 2> "state":"down",
    [junit4] 2> "shard":null,
    [junit4] 2> "collection":"collection1",
    [junit4] 2> "operation":"state"}
    [junit4] 2> 2962236 INFO (OverseerStateUpdate-96079113188933636-127.0.0.1:58035__%2Fi-n_0000000000) [n:127.0.0.1:58035__%2Fi ] o.a.s.c.o.ReplicaMutator Collection already exists with numShards=2
    [junit4] 2> 2962236 INFO (OverseerStateUpdate-96079113188933636-127.0.0.1:58035__%2Fi-n_0000000000) [n:127.0.0.1:58035__%2Fi ] o.a.s.c.o.ReplicaMutator Assigning new node to shard shard=shard2
    [junit4] 2> 2962238 INFO (coreLoadExecutor-11583-thread-1-processing-n:127.0.0.1:58062__%2Fi) [n:127.0.0.1:58062__%2Fi c:collection1 x:collection1] o.a.s.c.ZkController Registering watch for collection collection1
    [junit4] 2> 2962239 INFO (coreLoadExecutor-11583-thread-1-processing-n:127.0.0.1:58062__%2Fi) [n:127.0.0.1:58062__%2Fi c:collection1 x:collection1] o.a.s.c.c.ZkStateReader Add data for [collection1] ver [1]
    [junit4] 2> 2962239 INFO (coreLoadExecutor-11583-thread-1-processing-n:127.0.0.1:58062__%2Fi) [n:127.0.0.1:58062__%2Fi c:collection1 x:collection1] o.a.s.c.ZkController look for our core node name
    [junit4] 2> 2962341 INFO (OverseerStateUpdate-96079113188933636-127.0.0.1:58035__%2Fi-n_0000000000) [n:127.0.0.1:58035__%2Fi ] o.a.s.c.o.ZkStateWriter going to update_collection /collections/collection1/state.json version: 1
    [junit4] 2> 2962342 INFO (zkCallback-11635-thread-1-processing-n:127.0.0.1:58062__%2Fi) [n:127.0.0.1:58062__%2Fi ] o.a.s.c.c.ZkStateReader A cluster state change: [WatchedEvent state:SyncConnected type:NodeDataChanged path:/collections/collection1/state.json] for collection [collection1] has occurred - updating... (live nodes size: [2])
    [junit4] 2> 2962343 INFO (zkCallback-11635-thread-1-processing-n:127.0.0.1:58062__%2Fi) [n:127.0.0.1:58062__%2Fi ] o.a.s.c.c.ZkStateReader Updating data for [collection1] from [1] to [2]
    [junit4] 2> 2963240 INFO (coreLoadExecutor-11583-thread-1-processing-n:127.0.0.1:58062__%2Fi) [n:127.0.0.1:58062__%2Fi c:collection1 x:collection1] o.a.s.c.ZkController waiting to find shard id in clusterstate for collection1
    [junit4] 2> 2963240 INFO (coreLoadExecutor-11583-thread-1-processing-n:127.0.0.1:58062__%2Fi) [n:127.0.0.1:58062__%2Fi c:collection1 x:collection1] o.a.s.c.ZkController Check for collection zkNode:collection1
    [junit4] 2> 2963241 INFO (coreLoadExecutor-11583-thread-1-processing-n:127.0.0.1:58062__%2Fi) [n:127.0.0.1:58062__%2Fi c:collection1 x:collection1] o.a.s.c.ZkController Collection zkNode exists
    [junit4] 2> 2963241 INFO (coreLoadExecutor-11583-thread-1-processing-n:127.0.0.1:58062__%2Fi) [n:127.0.0.1:58062__%2Fi c:collection1 x:collection1] o.a.s.c.c.ZkStateReader Load collection config from: [/collections/collection1]
    [junit4] 2> 2963242 INFO (coreLoadExecutor-11583-thread-1-processing-n:127.0.0.1:58062__%2Fi) [n:127.0.0.1:58062__%2Fi c:collection1 x:collection1] o.a.s.c.c.ZkSt

[...truncated too long message...]

    [junit4] > Throwable #1: java.lang.AssertionError: Could not get expected value 'CY val modified' for path 'response/params/y/c' full output: {
    [junit4] > "responseHeader":{
    [junit4] > "status":0,
    [junit4] > "QTime":0},
    [junit4] > "response":{
    [junit4] > "znodeVersion":1,
    [junit4] > "params":{
    [junit4] > "x":{
    [junit4] > "a":"A val",
    [junit4] > "b":"B val",
    [junit4] > "":{"v":0}},
    [junit4] > "y":{
    [junit4] > "c":"CY val",
    [junit4] > "b":"BY val",
    [junit4] > "i":20,
    [junit4] > "d":[
    [junit4] > "val 1",
    [junit4] > "val 2"],
    [junit4] > "":{"v":0}}}}}, from server: http://127.0.0.1:58163/_/i/collection1
    [junit4] > at __randomizedtesting.SeedInfo.seed([71A7BE8A84019F72:F9F381502AFDF28A]:0)
    [junit4] > at org.apache.solr.core.TestSolrConfigHandler.testForResponseElement(TestSolrConfigHandler.java:481)
    [junit4] > at org.apache.solr.handler.TestReqParamsAPI.testReqParams(TestReqParamsAPI.java:194)
    [junit4] > at org.apache.solr.handler.TestReqParamsAPI.test(TestReqParamsAPI.java:61)
    [junit4] > at org.apache.solr.BaseDistributedSearchTestCase$ShardsRepeatRule$ShardsFixedStatement.callStatement(BaseDistributedSearchTestCase.java:992)
    [junit4] > at org.apache.solr.BaseDistributedSearchTestCase$ShardsRepeatRule$ShardsStatement.evaluate(BaseDistributedSearchTestCase.java:967)
    [junit4] > at java.lang.Thread.run(Thread.java:745)
    [junit4] 2> 2988490 INFO (SUITE-TestReqParamsAPI-seed#[71A7BE8A84019F72]-worker) [ ] o.a.s.SolrTestCaseJ4 ###deleteCore
    [junit4] 2> NOTE: leaving temporary files on disk at: C:\Users\jenkins\workspace\Lucene-Solr-6.x-Windows\solr\build\solr-core\test\J1\temp\solr.handler.TestReqParamsAPI_71A7BE8A84019F72-001
    [junit4] 2> Jun 16, 2016 4:22:31 AM com.carrotsearch.randomizedtesting.ThreadLeakControl checkThreadLeaks
    [junit4] 2> WARNING: Will linger awaiting termination of 2 leaked thread(s).
    [junit4] 2> NOTE: test params are: codec=FastCompressingStoredFields(storedFieldsFormat=CompressingStoredFieldsFormat(compressionMode=FAST, chunkSize=8, maxDocsPerChunk=351, blockSize=323), termVectorsFormat=CompressingTermVectorsFormat(compressionMode=FAST, chunkSize=8, blockSize=323)), sim=RandomSimilarity(queryNorm=true,coord=crazy): {}, locale=sr-Latn-ME, timezone=Asia/Irkutsk
    [junit4] 2> NOTE: Windows 10 10.0 amd64/Oracle Corporation 1.8.0_92 (64-bit)/cpus=3,threads=1,free=284740984,total=536870912
    [junit4] 2> NOTE: All tests run in this JVM: [TestSchemaSimilarityResource, SolrCoreCheckLockOnStartupTest, ExitableDirectoryReaderTest, AsyncCallRequestStatusResponseTest, SortByFunctionTest, LoggingHandlerTest, HdfsBasicDistributedZkTest, CurrencyFieldOpenExchangeTest, DateMathParserTest, RAMDirectoryFactoryTest, HdfsChaosMonkeySafeLeaderTest, TestCopyFieldCollectionResource, SuggestComponentContextFilterQueryTest, TestSimpleTrackingShardHandler, AtomicUpdatesTest, TestSolrQueryParserResource, TestIndexingPerformance, TestSolrIndexConfig, DistributedIntervalFacetingTest, DistributedFacetPivotSmallAdvancedTest, TestImplicitCoreProperties, DistribDocExpirationUpdateProcessorTest, BlockJoinFacetRandomTest, TestSubQueryTransformerDistrib, TestLeaderInitiatedRecoveryThread, FacetPivotSmallTest, TestRestoreCore, TestManagedSchema, LeaderElectionIntegrationTest, ZkSolrClientTest, TestQueryUtils, SpatialRPTFieldTypeTest, TestComplexPhraseQParserPlugin, TestCharFilters, TestOnReconnectListenerSupport, DistributedTermsComponentTest, ResourceLoaderTest, TestValueSourceCache, TestSolrXml, FileBasedSpellCheckerTest, TestSolr4Spatial, TestSolrJ, TestConfigSets, TestCloudManagedSchema, TestTrie, OverseerRolesTest, HdfsRecoveryZkTest, AnalysisErrorHandlingTest, MultiTermTest, TestFuzzyAnalyzedSuggestions, CopyFieldTest, TestRTimerTree, TestPerFieldSimilarityWithDefaultOverride, TestRequestForwarding, TestBinaryField, OutputWriterTest, MultiThreadedOCPTest, TestStandardQParsers, DirectSolrConnectionTest, TestDistributedStatsComponentCardinality, ExplicitHLLTest, IndexSchemaRuntimeFieldTest, WordBreakSolrSpellCheckerTest, TestSSLRandomization, TestQueryTypes, ConvertedLegacyTest, TestPHPSerializedResponseWriter, DistributedFacetPivotWhiteBoxTest, SpellingQueryConverterTest, CloudMLTQParserTest, FieldMutatingUpdateProcessorTest, TestBulkSchemaAPI, IgnoreCommitOptimizeUpdateProcessorFactoryTest, FileUtilsTest, TestSolrConfigHandlerCloud, TestSubQueryTransformer, DistributedDebugComponentTest, TestDefaultStatsCache, TestFastWriter, ChangedSchemaMergeTest, TestDistributedMissingSort, ConjunctionSolrSpellCheckerTest, TestQuerySenderListener, SolrCmdDistributorTest, SolrInfoMBeanTest, CdcrReplicationHandlerTest, UniqFieldsUpdateProcessorFactoryTest, ForceLeaderTest, TestNonDefinedSimilarityFactory, SearchHandlerTest, ChaosMonkeySafeLeaderTest, TestSolrDeletionPolicy2, ZkStateWriterTest, TestReload, NumericFieldsTest, RequestHandlersTest, LukeRequestHandlerTest, TestSerializedLuceneMatchVersion, TestFieldSortValues, TestRangeQuery, TestStressRecovery, TestOmitPositions, LeaderInitiatedRecoveryOnShardRestartTest, PKIAuthenticationIntegrationTest, SignatureUpdateProcessorFactoryTest, LeaderFailoverAfterPartitionTest, QueryResultKeyTest, TestSchemaManager, TestLRUStatsCache, OpenCloseCoreStressTest, GraphQueryTest, CdcrVersionReplicationTest, CSVRequestHandlerTest, SolrPluginUtilsTest, TestSlowCompositeReaderWrapper, TestIntervalFaceting, TestClusterStateMutator, SparseHLLTest, TestCollationField, FullSolrCloudDistribCmdsTest, ConfigSetsAPITest, TestJsonFacets, CoreMergeIndexesAdminHandlerTest, BJQParserTest, DistributedFacetPivotLargeTest, BasicZkTest, TestCloudPivotFacet, TestGraphTermsQParserPlugin, NoCacheHeaderTest, CollectionsAPISolrJTest, TestSolrQueryParser, TestSizeLimitedDistributedMap, CleanupOldIndexTest, TestReRankQParserPlugin, BasicDistributedZk2Test, TestDynamicFieldCollectionResource, TestSuggestSpellingConverter, MinimalSchemaTest, TestCoreDiscovery, SpellCheckComponentTest, AliasIntegrationTest, UpdateRequestProcessorFactoryTest, TestLMJelinekMercerSimilarityFactory, TestRandomCollapseQParserPlugin, TestManagedResourceStorage, TestSchemaNameResource, OverriddenZkACLAndCredentialsProvidersTest, TestManagedStopFilterFactory, SSLMigrationTest, TestNumericTerms32, PluginInfoTest, TestFieldCacheSortRandom, CoreAdminHandlerTest, BasicDistributedZkTest, CollectionsAPIDistributedZkTest, TestReplicationHandler, TestZkChroot, ZkCLITest, ShardRoutingCustomTest, TestDistributedSearch, BadIndexSchemaTest, TestSort, BasicFunctionalityTest, TestIndexSearcher, ShowFileRequestHandlerTest, AnalysisAfterCoreReloadTest, TestFoldingMultitermQuery, SuggesterTSTTest, SpatialFilterTest, TestCSVLoader, TestUpdate, TestAtomicUpdateErrorCases, DefaultValueUpdateProcessorTest, DistanceFunctionTest, DebugComponentTest, IndexBasedSpellCheckerTest, StandardRequestHandlerTest, TestWriterPerf, DocumentAnalysisRequestHandlerTest, XmlUpdateRequestHandlerTest, MoreLikeThisHandlerTest, FastVectorHighlighterTest, TestJmxIntegration, QueryParsingTest, BinaryUpdateRequestHandlerTest, PingRequestHandlerTest, HighlighterConfigTest, SOLR749Test, ResponseLogComponentTest, SolrIndexConfigTest, BadComponentTest, TestMergePolicyConfig, SampleTest, TestElisionMultitermQuery, NotRequiredUniqueKeyTest, SpellPossibilityIteratorTest, SynonymTokenizerTest, TestPerFieldSimilarity, TestFastOutputStream, OpenExchangeRatesOrgProviderTest, TestSystemIdResolver, DateFieldTest, ClusterStateTest, TestUtils, SliceStateTest, SystemInfoHandlerTest, CircularListTest, DistributedMLTComponentTest, TestCrossCoreJoin, ConnectionReuseTest, CollectionReloadTest, CollectionsAPIAsyncDistributedZkTest, CreateCollectionCleanupTest, DeleteInactiveReplicaTest, DeleteStatusTest, DistribCursorPagingTest, DistributedQueueTest, LeaderInitiatedRecoveryOnCommitTest, OutOfBoxZkACLAndCredentialsProvidersTest, OverseerTaskQueueTest, ReplicationFactorTest, RestartWhileUpdatingTest, RollingRestartTest, ShardSplitTest, TestCloudBackupRestore, TestCloudDeleteByQuery, TestCloudInspectUtil, TestCollectionAPI, TestDistribDocBasedVersion, TestLockTree, TestMiniSolrCloudCluster, TestRequestStatusCollectionAPI, TestStressLiveNodes, DirectoryFactoryTest, HdfsDirectoryFactoryTest, TestConfigSetImmutable, TestInfoStreamLogging, TestInitParams, TestReloadAndDeleteDocs, TestSolrConfigHandler, TestBlobHandler, TestReqParamsAPI]
    [junit4] Completed [509/615 (1!)] on J1 in 30.73s, 1 test, 1 failure <<< FAILURES!

[...truncated 332 lines...]
BUILD FAILED
C:\Users\jenkins\workspace\Lucene-Solr-6.x-Windows\build.xml:740: The following error occurred while executing this line:
C:\Users\jenkins\workspace\Lucene-Solr-6.x-Windows\build.xml:684: The following error occurred while executing this line:
C:\Users\jenkins\workspace\Lucene-Solr-6.x-Windows\build.xml:59: The following error occurred while executing this line:
C:\Users\jenkins\workspace\Lucene-Solr-6.x-Windows\solr\build.xml:233: The following error occurred while executing this line:
C:\Users\jenkins\workspace\Lucene-Solr-6.x-Windows\solr\common-build.xml:531: The following error occurred while executing this line:
C:\Users\jenkins\workspace\Lucene-Solr-6.x-Windows\lucene\common-build.xml:1427: The following error occurred while executing this line:
C:\Users\jenkins\workspace\Lucene-Solr-6.x-Windows\lucene\common-build.xml:984: There were test failures: 615 suites (10 ignored), 2591 tests, 1 failure, 127 ignored (83 assumptions) [seed: 71A7BE8A84019F72]

Total time: 79 minutes 54 seconds
Build step 'Invoke Ant' marked build as failure
Archiving artifacts
[WARNINGS] Skipping publisher since build result is FAILURE
Recording test results
Email was triggered for: Failure - Any
Sending email for trigger: Failure - Any

Search Discussions

Discussion Posts

Previous

Follow ups

Related Discussions

Discussion Navigation
viewthread | post
posts ‹ prev | 3 of 7 | next ›
Discussion Overview
groupdev @
categorieslucene
postedJun 15, '16 at 5:53a
activeJun 17, '16 at 1:34a
posts7
users3
websitelucene.apache.org

People

Translate

site design / logo © 2017 Grokbase