Grokbase Groups Lucene dev June 2016
FAQ
Build: http://jenkins.thetaphi.de/job/Lucene-Solr-5.5-Linux/290/
Java: 64bit/jdk1.7.0_80 -XX:+UseCompressedOops -XX:+UseConcMarkSweepGC

1 tests failed.
FAILED: org.apache.solr.schema.TestManagedSchemaAPI.test

Error Message:
Error from server at http://127.0.0.1:33751/solr/testschemaapi_shard1_replica2: ERROR: [doc=2] unknown field 'myNewField1'

Stack Trace:
org.apache.solr.client.solrj.impl.CloudSolrClient$RouteException: Error from server at http://127.0.0.1:33751/solr/testschemaapi_shard1_replica2: ERROR: [doc=2] unknown field 'myNewField1'
  at __randomizedtesting.SeedInfo.seed([FD031B74A0EC974:87840E6DE4F2A48C]:0)
  at org.apache.solr.client.solrj.impl.CloudSolrClient.directUpdate(CloudSolrClient.java:632)
  at org.apache.solr.client.solrj.impl.CloudSolrClient.sendRequest(CloudSolrClient.java:981)
  at org.apache.solr.client.solrj.impl.CloudSolrClient.requestWithRetryOnStaleState(CloudSolrClient.java:870)
  at org.apache.solr.client.solrj.impl.CloudSolrClient.request(CloudSolrClient.java:806)
  at org.apache.solr.schema.TestManagedSchemaAPI.testAddFieldAndDocument(TestManagedSchemaAPI.java:101)
  at org.apache.solr.schema.TestManagedSchemaAPI.test(TestManagedSchemaAPI.java:69)
  at sun.reflect.NativeMethodAccessorImpl.invoke0(Native Method)
  at sun.reflect.NativeMethodAccessorImpl.invoke(NativeMethodAccessorImpl.java:57)
  at sun.reflect.DelegatingMethodAccessorImpl.invoke(DelegatingMethodAccessorImpl.java:43)
  at java.lang.reflect.Method.invoke(Method.java:606)
  at com.carrotsearch.randomizedtesting.RandomizedRunner.invoke(RandomizedRunner.java:1764)
  at com.carrotsearch.randomizedtesting.RandomizedRunner$8.evaluate(RandomizedRunner.java:871)
  at com.carrotsearch.randomizedtesting.RandomizedRunner$9.evaluate(RandomizedRunner.java:907)
  at com.carrotsearch.randomizedtesting.RandomizedRunner$10.evaluate(RandomizedRunner.java:921)
  at com.carrotsearch.randomizedtesting.rules.SystemPropertiesRestoreRule$1.evaluate(SystemPropertiesRestoreRule.java:57)
  at org.apache.lucene.util.TestRuleSetupTeardownChained$1.evaluate(TestRuleSetupTeardownChained.java:49)
  at org.apache.lucene.util.AbstractBeforeAfterRule$1.evaluate(AbstractBeforeAfterRule.java:45)
  at org.apache.lucene.util.TestRuleThreadAndTestName$1.evaluate(TestRuleThreadAndTestName.java:48)
  at org.apache.lucene.util.TestRuleIgnoreAfterMaxFailures$1.evaluate(TestRuleIgnoreAfterMaxFailures.java:64)
  at org.apache.lucene.util.TestRuleMarkFailure$1.evaluate(TestRuleMarkFailure.java:47)
  at com.carrotsearch.randomizedtesting.rules.StatementAdapter.evaluate(StatementAdapter.java:36)
  at com.carrotsearch.randomizedtesting.ThreadLeakControl$StatementRunner.run(ThreadLeakControl.java:367)
  at com.carrotsearch.randomizedtesting.ThreadLeakControl.forkTimeoutingTask(ThreadLeakControl.java:809)
  at com.carrotsearch.randomizedtesting.ThreadLeakControl$3.evaluate(ThreadLeakControl.java:460)
  at com.carrotsearch.randomizedtesting.RandomizedRunner.runSingleTest(RandomizedRunner.java:880)
  at com.carrotsearch.randomizedtesting.RandomizedRunner$5.evaluate(RandomizedRunner.java:781)
  at com.carrotsearch.randomizedtesting.RandomizedRunner$6.evaluate(RandomizedRunner.java:816)
  at com.carrotsearch.randomizedtesting.RandomizedRunner$7.evaluate(RandomizedRunner.java:827)
  at com.carrotsearch.randomizedtesting.rules.StatementAdapter.evaluate(StatementAdapter.java:36)
  at com.carrotsearch.randomizedtesting.rules.SystemPropertiesRestoreRule$1.evaluate(SystemPropertiesRestoreRule.java:57)
  at org.apache.lucene.util.AbstractBeforeAfterRule$1.evaluate(AbstractBeforeAfterRule.java:45)
  at com.carrotsearch.randomizedtesting.rules.StatementAdapter.evaluate(StatementAdapter.java:36)
  at org.apache.lucene.util.TestRuleStoreClassName$1.evaluate(TestRuleStoreClassName.java:41)
  at com.carrotsearch.randomizedtesting.rules.NoShadowingOrOverridesOnMethodsRule$1.evaluate(NoShadowingOrOverridesOnMethodsRule.java:40)
  at com.carrotsearch.randomizedtesting.rules.NoShadowingOrOverridesOnMethodsRule$1.evaluate(NoShadowingOrOverridesOnMethodsRule.java:40)
  at com.carrotsearch.randomizedtesting.rules.StatementAdapter.evaluate(StatementAdapter.java:36)
  at com.carrotsearch.randomizedtesting.rules.StatementAdapter.evaluate(StatementAdapter.java:36)
  at com.carrotsearch.randomizedtesting.rules.StatementAdapter.evaluate(StatementAdapter.java:36)
  at org.apache.lucene.util.TestRuleAssertionsRequired$1.evaluate(TestRuleAssertionsRequired.java:53)
  at org.apache.lucene.util.TestRuleMarkFailure$1.evaluate(TestRuleMarkFailure.java:47)
  at org.apache.lucene.util.TestRuleIgnoreAfterMaxFailures$1.evaluate(TestRuleIgnoreAfterMaxFailures.java:64)
  at org.apache.lucene.util.TestRuleIgnoreTestSuites$1.evaluate(TestRuleIgnoreTestSuites.java:54)
  at com.carrotsearch.randomizedtesting.rules.StatementAdapter.evaluate(StatementAdapter.java:36)
  at com.carrotsearch.randomizedtesting.ThreadLeakControl$StatementRunner.run(ThreadLeakControl.java:367)
  at java.lang.Thread.run(Thread.java:745)
Caused by: org.apache.solr.client.solrj.impl.HttpSolrClient$RemoteSolrException: Error from server at http://127.0.0.1:33751/solr/testschemaapi_shard1_replica2: ERROR: [doc=2] unknown field 'myNewField1'
  at org.apache.solr.client.solrj.impl.HttpSolrClient.executeMethod(HttpSolrClient.java:577)
  at org.apache.solr.client.solrj.impl.HttpSolrClient.request(HttpSolrClient.java:241)
  at org.apache.solr.client.solrj.impl.HttpSolrClient.request(HttpSolrClient.java:230)
  at org.apache.solr.client.solrj.impl.LBHttpSolrClient.doRequest(LBHttpSolrClient.java:372)
  at org.apache.solr.client.solrj.impl.LBHttpSolrClient.request(LBHttpSolrClient.java:325)
  at org.apache.solr.client.solrj.impl.CloudSolrClient$2.call(CloudSolrClient.java:607)
  at org.apache.solr.client.solrj.impl.CloudSolrClient$2.call(CloudSolrClient.java:604)
  at java.util.concurrent.FutureTask.run(FutureTask.java:262)
  at org.apache.solr.common.util.ExecutorUtil$MDCAwareThreadPoolExecutor$1.run(ExecutorUtil.java:231)
  at java.util.concurrent.ThreadPoolExecutor.runWorker(ThreadPoolExecutor.java:1145)
  at java.util.concurrent.ThreadPoolExecutor$Worker.run(ThreadPoolExecutor.java:615)
  ... 1 more




Build Log:
[...truncated 11902 lines...]
    [junit4] Suite: org.apache.solr.schema.TestManagedSchemaAPI
    [junit4] 2> Creating dataDir: /home/jenkins/workspace/Lucene-Solr-5.5-Linux/solr/build/solr-core/test/J2/temp/solr.schema.TestManagedSchemaAPI_FD031B74A0EC974-001/init-core-data-001
    [junit4] 2> 1619099 INFO (SUITE-TestManagedSchemaAPI-seed#[FD031B74A0EC974]-worker) [ ] o.a.s.SolrTestCaseJ4 Randomized ssl (false) and clientAuth (false)
    [junit4] 2> 1619101 INFO (TEST-TestManagedSchemaAPI.test-seed#[FD031B74A0EC974]) [ ] o.a.s.SolrTestCaseJ4 ###Starting test
    [junit4] 2> 1619101 INFO (TEST-TestManagedSchemaAPI.test-seed#[FD031B74A0EC974]) [ ] o.a.s.c.ZkTestServer STARTING ZK TEST SERVER
    [junit4] 2> 1619101 INFO (Thread-2898) [ ] o.a.s.c.ZkTestServer client port:0.0.0.0/0.0.0.0:0
    [junit4] 2> 1619101 INFO (Thread-2898) [ ] o.a.s.c.ZkTestServer Starting server
    [junit4] 2> 1619201 INFO (TEST-TestManagedSchemaAPI.test-seed#[FD031B74A0EC974]) [ ] o.a.s.c.ZkTestServer start zk server on port:46485
    [junit4] 2> 1619201 INFO (TEST-TestManagedSchemaAPI.test-seed#[FD031B74A0EC974]) [ ] o.a.s.c.c.SolrZkClient Using default ZkCredentialsProvider
    [junit4] 2> 1619202 INFO (TEST-TestManagedSchemaAPI.test-seed#[FD031B74A0EC974]) [ ] o.a.s.c.c.ConnectionManager Waiting for client to connect to ZooKeeper
    [junit4] 2> 1619204 INFO (zkCallback-1194-thread-1) [ ] o.a.s.c.c.ConnectionManager Watcher org.apache.solr.common.cloud.ConnectionManager@28ce2c13 name:ZooKeeperConnection Watcher:127.0.0.1:46485 got event WatchedEvent state:SyncConnected type:None path:null path:null type:None
    [junit4] 2> 1619204 INFO (TEST-TestManagedSchemaAPI.test-seed#[FD031B74A0EC974]) [ ] o.a.s.c.c.ConnectionManager Client is connected to ZooKeeper
    [junit4] 2> 1619204 INFO (TEST-TestManagedSchemaAPI.test-seed#[FD031B74A0EC974]) [ ] o.a.s.c.c.SolrZkClient Using default ZkACLProvider
    [junit4] 2> 1619204 INFO (TEST-TestManagedSchemaAPI.test-seed#[FD031B74A0EC974]) [ ] o.a.s.c.c.SolrZkClient makePath: /solr/solr.xml
    [junit4] 2> 1619206 INFO (jetty-launcher-1193-thread-2) [ ] o.e.j.s.Server jetty-9.2.13.v20150730
    [junit4] 2> 1619206 INFO (jetty-launcher-1193-thread-1) [ ] o.e.j.s.Server jetty-9.2.13.v20150730
    [junit4] 2> 1619207 INFO (jetty-launcher-1193-thread-2) [ ] o.e.j.s.h.ContextHandler Started o.e.j.s.ServletContextHandler@6cd941eb{/solr,null,AVAILABLE}
    [junit4] 2> 1619207 INFO (jetty-launcher-1193-thread-1) [ ] o.e.j.s.h.ContextHandler Started o.e.j.s.ServletContextHandler@2b76e321{/solr,null,AVAILABLE}
    [junit4] 2> 1619208 INFO (jetty-launcher-1193-thread-2) [ ] o.e.j.s.ServerConnector Started ServerConnector@4daee73c{HTTP/1.1}{127.0.0.1:33751}
    [junit4] 2> 1619208 INFO (jetty-launcher-1193-thread-2) [ ] o.e.j.s.Server Started @1621158ms
    [junit4] 2> 1619208 INFO (jetty-launcher-1193-thread-1) [ ] o.e.j.s.ServerConnector Started ServerConnector@6334f83e{HTTP/1.1}{127.0.0.1:36988}
    [junit4] 2> 1619208 INFO (jetty-launcher-1193-thread-2) [ ] o.a.s.c.s.e.JettySolrRunner Jetty properties: {hostContext=/solr, hostPort=33751}
    [junit4] 2> 1619208 INFO (jetty-launcher-1193-thread-1) [ ] o.e.j.s.Server Started @1621158ms
    [junit4] 2> 1619208 INFO (jetty-launcher-1193-thread-1) [ ] o.a.s.c.s.e.JettySolrRunner Jetty properties: {hostContext=/solr, hostPort=36988}
    [junit4] 2> 1619208 INFO (jetty-launcher-1193-thread-2) [ ] o.a.s.s.SolrDispatchFilter SolrDispatchFilter.init(): sun.misc.Launcher$AppClassLoader@8f8acd0
    [junit4] 2> 1619208 INFO (jetty-launcher-1193-thread-2) [ ] o.a.s.c.SolrResourceLoader new SolrResourceLoader for directory: '/home/jenkins/workspace/Lucene-Solr-5.5-Linux/solr/build/solr-core/test/J2/temp/solr.schema.TestManagedSchemaAPI_FD031B74A0EC974-001/tempDir-001/node2'
    [junit4] 2> 1619208 INFO (jetty-launcher-1193-thread-1) [ ] o.a.s.s.SolrDispatchFilter SolrDispatchFilter.init(): sun.misc.Launcher$AppClassLoader@8f8acd0
    [junit4] 2> 1619208 INFO (jetty-launcher-1193-thread-2) [ ] o.a.s.c.SolrResourceLoader JNDI not configured for solr (NoInitialContextEx)
    [junit4] 2> 1619208 INFO (jetty-launcher-1193-thread-1) [ ] o.a.s.c.SolrResourceLoader new SolrResourceLoader for directory: '/home/jenkins/workspace/Lucene-Solr-5.5-Linux/solr/build/solr-core/test/J2/temp/solr.schema.TestManagedSchemaAPI_FD031B74A0EC974-001/tempDir-001/node1'
    [junit4] 2> 1619208 INFO (jetty-launcher-1193-thread-2) [ ] o.a.s.c.SolrResourceLoader solr home defaulted to 'solr/' (could not find system property or JNDI)
    [junit4] 2> 1619208 INFO (jetty-launcher-1193-thread-1) [ ] o.a.s.c.SolrResourceLoader JNDI not configured for solr (NoInitialContextEx)
    [junit4] 2> 1619208 INFO (jetty-launcher-1193-thread-1) [ ] o.a.s.c.SolrResourceLoader solr home defaulted to 'solr/' (could not find system property or JNDI)
    [junit4] 2> 1619208 INFO (jetty-launcher-1193-thread-2) [ ] o.a.s.c.c.SolrZkClient Using default ZkCredentialsProvider
    [junit4] 2> 1619209 INFO (jetty-launcher-1193-thread-1) [ ] o.a.s.c.c.SolrZkClient Using default ZkCredentialsProvider
    [junit4] 2> 1619209 INFO (jetty-launcher-1193-thread-2) [ ] o.a.s.c.c.ConnectionManager Waiting for client to connect to ZooKeeper
    [junit4] 2> 1619209 INFO (jetty-launcher-1193-thread-1) [ ] o.a.s.c.c.ConnectionManager Waiting for client to connect to ZooKeeper
    [junit4] 2> 1619210 INFO (zkCallback-1195-thread-1) [ ] o.a.s.c.c.ConnectionManager Watcher org.apache.solr.common.cloud.ConnectionManager@26f0c7ae name:ZooKeeperConnection Watcher:127.0.0.1:46485/solr got event WatchedEvent state:SyncConnected type:None path:null path:null type:None
    [junit4] 2> 1619210 INFO (jetty-launcher-1193-thread-2) [ ] o.a.s.c.c.ConnectionManager Client is connected to ZooKeeper
    [junit4] 2> 1619210 INFO (zkCallback-1196-thread-1) [ ] o.a.s.c.c.ConnectionManager Watcher org.apache.solr.common.cloud.ConnectionManager@6a0fd270 name:ZooKeeperConnection Watcher:127.0.0.1:46485/solr got event WatchedEvent state:SyncConnected type:None path:null path:null type:None
    [junit4] 2> 1619210 INFO (jetty-launcher-1193-thread-2) [ ] o.a.s.c.c.SolrZkClient Using default ZkACLProvider
    [junit4] 2> 1619210 INFO (jetty-launcher-1193-thread-1) [ ] o.a.s.c.c.ConnectionManager Client is connected to ZooKeeper
    [junit4] 2> 1619210 INFO (jetty-launcher-1193-thread-2) [ ] o.a.s.s.SolrDispatchFilter solr.xml found in ZooKeeper. Loading...
    [junit4] 2> 1619210 INFO (jetty-launcher-1193-thread-1) [ ] o.a.s.c.c.SolrZkClient Using default ZkACLProvider
    [junit4] 2> 1619210 INFO (jetty-launcher-1193-thread-1) [ ] o.a.s.s.SolrDispatchFilter solr.xml found in ZooKeeper. Loading...
    [junit4] 2> 1619220 INFO (jetty-launcher-1193-thread-2) [ ] o.a.s.c.CorePropertiesLocator Config-defined core root directory: /home/jenkins/workspace/Lucene-Solr-5.5-Linux/solr/build/solr-core/test/J2/temp/solr.schema.TestManagedSchemaAPI_FD031B74A0EC974-001/tempDir-001/node2/.
    [junit4] 2> 1619220 INFO (jetty-launcher-1193-thread-2) [ ] o.a.s.c.CoreContainer New CoreContainer 972408266
    [junit4] 2> 1619220 INFO (jetty-launcher-1193-thread-2) [ ] o.a.s.c.CoreContainer Loading cores into CoreContainer [instanceDir=/home/jenkins/workspace/Lucene-Solr-5.5-Linux/solr/build/solr-core/test/J2/temp/solr.schema.TestManagedSchemaAPI_FD031B74A0EC974-001/tempDir-001/node2]
    [junit4] 2> 1619220 WARN (jetty-launcher-1193-thread-2) [ ] o.a.s.c.CoreContainer Couldn't add files from /home/jenkins/workspace/Lucene-Solr-5.5-Linux/solr/build/solr-core/test/J2/temp/solr.schema.TestManagedSchemaAPI_FD031B74A0EC974-001/tempDir-001/node2/lib to classpath: /home/jenkins/workspace/Lucene-Solr-5.5-Linux/solr/build/solr-core/test/J2/temp/solr.schema.TestManagedSchemaAPI_FD031B74A0EC974-001/tempDir-001/node2/lib
    [junit4] 2> 1619221 INFO (jetty-launcher-1193-thread-2) [ ] o.a.s.h.c.HttpShardHandlerFactory created with socketTimeout : 90000,urlScheme : ,connTimeout : 15000,maxConnectionsPerHost : 20,maxConnections : 10000,corePoolSize : 0,maximumPoolSize : 2147483647,maxThreadIdleTime : 5,sizeOfQueue : -1,fairnessPolicy : false,useRetries : false,
    [junit4] 2> 1619221 INFO (jetty-launcher-1193-thread-2) [ ] o.a.s.u.UpdateShardHandler Creating UpdateShardHandler HTTP client with params: socketTimeout=340000&connTimeout=45000&retry=true
    [junit4] 2> 1619222 INFO (jetty-launcher-1193-thread-2) [ ] o.a.s.l.LogWatcher SLF4J impl is org.slf4j.impl.Log4jLoggerFactory
    [junit4] 2> 1619222 INFO (jetty-launcher-1193-thread-2) [ ] o.a.s.l.LogWatcher Registering Log Listener [Log4j (org.slf4j.impl.Log4jLoggerFactory)]
    [junit4] 2> 1619222 INFO (jetty-launcher-1193-thread-2) [ ] o.a.s.c.ZkContainer Zookeeper client=127.0.0.1:46485/solr
    [junit4] 2> 1619222 INFO (jetty-launcher-1193-thread-2) [ ] o.a.s.c.ZkController zkHost includes chroot
    [junit4] 2> 1619222 INFO (jetty-launcher-1193-thread-2) [ ] o.a.s.c.c.SolrZkClient Using default ZkCredentialsProvider
    [junit4] 2> 1619222 INFO (jetty-launcher-1193-thread-2) [ ] o.a.s.c.c.ConnectionManager Waiting for client to connect to ZooKeeper
    [junit4] 2> 1619236 INFO (zkCallback-1199-thread-1) [ ] o.a.s.c.c.ConnectionManager Watcher org.apache.solr.common.cloud.ConnectionManager@66f1a93a name:ZooKeeperConnection Watcher:127.0.0.1:46485 got event WatchedEvent state:SyncConnected type:None path:null path:null type:None
    [junit4] 2> 1619236 INFO (jetty-launcher-1193-thread-2) [ ] o.a.s.c.c.ConnectionManager Client is connected to ZooKeeper
    [junit4] 2> 1619236 INFO (jetty-launcher-1193-thread-2) [ ] o.a.s.c.c.SolrZkClient Using default ZkACLProvider
    [junit4] 2> 1619236 INFO (jetty-launcher-1193-thread-1) [ ] o.a.s.c.CorePropertiesLocator Config-defined core root directory: /home/jenkins/workspace/Lucene-Solr-5.5-Linux/solr/build/solr-core/test/J2/temp/solr.schema.TestManagedSchemaAPI_FD031B74A0EC974-001/tempDir-001/node1/.
    [junit4] 2> 1619236 INFO (jetty-launcher-1193-thread-1) [ ] o.a.s.c.CoreContainer New CoreContainer 650797465
    [junit4] 2> 1619236 INFO (jetty-launcher-1193-thread-1) [ ] o.a.s.c.CoreContainer Loading cores into CoreContainer [instanceDir=/home/jenkins/workspace/Lucene-Solr-5.5-Linux/solr/build/solr-core/test/J2/temp/solr.schema.TestManagedSchemaAPI_FD031B74A0EC974-001/tempDir-001/node1]
    [junit4] 2> 1619237 WARN (jetty-launcher-1193-thread-1) [ ] o.a.s.c.CoreContainer Couldn't add files from /home/jenkins/workspace/Lucene-Solr-5.5-Linux/solr/build/solr-core/test/J2/temp/solr.schema.TestManagedSchemaAPI_FD031B74A0EC974-001/tempDir-001/node1/lib to classpath: /home/jenkins/workspace/Lucene-Solr-5.5-Linux/solr/build/solr-core/test/J2/temp/solr.schema.TestManagedSchemaAPI_FD031B74A0EC974-001/tempDir-001/node1/lib
    [junit4] 2> 1619237 INFO (jetty-launcher-1193-thread-2) [n:127.0.0.1:33751_solr ] o.a.s.c.ZkController Added new OnReconnect listener org.apache.solr.cloud.ZkController$6@30cd97b4
    [junit4] 2> 1619237 INFO (jetty-launcher-1193-thread-1) [ ] o.a.s.h.c.HttpShardHandlerFactory created with socketTimeout : 90000,urlScheme : ,connTimeout : 15000,maxConnectionsPerHost : 20,maxConnections : 10000,corePoolSize : 0,maximumPoolSize : 2147483647,maxThreadIdleTime : 5,sizeOfQueue : -1,fairnessPolicy : false,useRetries : false,
    [junit4] 2> 1619237 INFO (jetty-launcher-1193-thread-2) [n:127.0.0.1:33751_solr ] o.a.s.c.c.ConnectionManager Waiting for client to connect to ZooKeeper
    [junit4] 2> 1619238 INFO (jetty-launcher-1193-thread-1) [ ] o.a.s.u.UpdateShardHandler Creating UpdateShardHandler HTTP client with params: socketTimeout=340000&connTimeout=45000&retry=true
    [junit4] 2> 1619238 INFO (zkCallback-1200-thread-1-processing-n:127.0.0.1:33751_solr) [n:127.0.0.1:33751_solr ] o.a.s.c.c.ConnectionManager Watcher org.apache.solr.common.cloud.ConnectionManager@47e6d6f3 name:ZooKeeperConnection Watcher:127.0.0.1:46485/solr got event WatchedEvent state:SyncConnected type:None path:null path:null type:None
    [junit4] 2> 1619238 INFO (jetty-launcher-1193-thread-2) [n:127.0.0.1:33751_solr ] o.a.s.c.c.ConnectionManager Client is connected to ZooKeeper
    [junit4] 2> 1619238 INFO (jetty-launcher-1193-thread-1) [ ] o.a.s.l.LogWatcher SLF4J impl is org.slf4j.impl.Log4jLoggerFactory
    [junit4] 2> 1619238 INFO (jetty-launcher-1193-thread-1) [ ] o.a.s.l.LogWatcher Registering Log Listener [Log4j (org.slf4j.impl.Log4jLoggerFactory)]
    [junit4] 2> 1619238 INFO (jetty-launcher-1193-thread-1) [ ] o.a.s.c.ZkContainer Zookeeper client=127.0.0.1:46485/solr
    [junit4] 2> 1619238 INFO (jetty-launcher-1193-thread-1) [ ] o.a.s.c.ZkController zkHost includes chroot
    [junit4] 2> 1619238 INFO (jetty-launcher-1193-thread-2) [n:127.0.0.1:33751_solr ] o.a.s.c.c.SolrZkClient makePath: /overseer/queue
    [junit4] 2> 1619238 INFO (jetty-launcher-1193-thread-1) [ ] o.a.s.c.c.SolrZkClient Using default ZkCredentialsProvider
    [junit4] 2> 1619240 INFO (jetty-launcher-1193-thread-1) [ ] o.a.s.c.c.ConnectionManager Waiting for client to connect to ZooKeeper
    [junit4] 2> 1619240 INFO (jetty-launcher-1193-thread-2) [n:127.0.0.1:33751_solr ] o.a.s.c.c.SolrZkClient makePath: /overseer/collection-queue-work
    [junit4] 2> 1619240 INFO (zkCallback-1203-thread-1) [ ] o.a.s.c.c.ConnectionManager Watcher org.apache.solr.common.cloud.ConnectionManager@2c569734 name:ZooKeeperConnection Watcher:127.0.0.1:46485 got event WatchedEvent state:SyncConnected type:None path:null path:null type:None
    [junit4] 2> 1619240 INFO (jetty-launcher-1193-thread-1) [ ] o.a.s.c.c.ConnectionManager Client is connected to ZooKeeper
    [junit4] 2> 1619241 INFO (jetty-launcher-1193-thread-1) [ ] o.a.s.c.c.SolrZkClient Using default ZkACLProvider
    [junit4] 2> 1619241 INFO (jetty-launcher-1193-thread-1) [n:127.0.0.1:36988_solr ] o.a.s.c.ZkController Added new OnReconnect listener org.apache.solr.cloud.ZkController$6@7aa9ac26
    [junit4] 2> 1619241 INFO (jetty-launcher-1193-thread-1) [n:127.0.0.1:36988_solr ] o.a.s.c.c.ConnectionManager Waiting for client to connect to ZooKeeper
    [junit4] 2> 1619242 INFO (jetty-launcher-1193-thread-2) [n:127.0.0.1:33751_solr ] o.a.s.c.c.SolrZkClient makePath: /overseer/collection-map-running
    [junit4] 2> 1619242 INFO (zkCallback-1204-thread-1-processing-n:127.0.0.1:36988_solr) [n:127.0.0.1:36988_solr ] o.a.s.c.c.ConnectionManager Watcher org.apache.solr.common.cloud.ConnectionManager@534361db name:ZooKeeperConnection Watcher:127.0.0.1:46485/solr got event WatchedEvent state:SyncConnected type:None path:null path:null type:None
    [junit4] 2> 1619242 INFO (jetty-launcher-1193-thread-1) [n:127.0.0.1:36988_solr ] o.a.s.c.c.ConnectionManager Client is connected to ZooKeeper
    [junit4] 2> 1619243 INFO (jetty-launcher-1193-thread-2) [n:127.0.0.1:33751_solr ] o.a.s.c.c.SolrZkClient makePath: /overseer/collection-map-completed
    [junit4] 2> 1619243 INFO (jetty-launcher-1193-thread-2) [n:127.0.0.1:33751_solr ] o.a.s.c.c.SolrZkClient makePath: /overseer/collection-map-failure
    [junit4] 2> 1619244 INFO (jetty-launcher-1193-thread-2) [n:127.0.0.1:33751_solr ] o.a.s.c.c.SolrZkClient makePath: /live_nodes
    [junit4] 2> 1619244 INFO (jetty-launcher-1193-thread-1) [n:127.0.0.1:36988_solr ] o.a.s.c.c.SolrZkClient makePath: /live_nodes
    [junit4] 2> 1619245 INFO (jetty-launcher-1193-thread-1) [n:127.0.0.1:36988_solr ] o.a.s.c.c.SolrZkClient makePath: /collections
    [junit4] 2> 1619245 INFO (jetty-launcher-1193-thread-2) [n:127.0.0.1:33751_solr ] o.a.s.c.c.SolrZkClient makePath: /collections
    [junit4] 2> 1619245 INFO (jetty-launcher-1193-thread-2) [n:127.0.0.1:33751_solr ] o.a.s.c.c.SolrZkClient makePath: /aliases.json
    [junit4] 2> 1619245 INFO (jetty-launcher-1193-thread-1) [n:127.0.0.1:36988_solr ] o.a.s.c.c.SolrZkClient makePath: /aliases.json
    [junit4] 2> 1619246 INFO (jetty-launcher-1193-thread-1) [n:127.0.0.1:36988_solr ] o.a.s.c.c.SolrZkClient makePath: /clusterstate.json
    [junit4] 2> 1619246 INFO (jetty-launcher-1193-thread-2) [n:127.0.0.1:33751_solr ] o.a.s.c.c.SolrZkClient makePath: /clusterstate.json
    [junit4] 2> 1619246 INFO (jetty-launcher-1193-thread-2) [n:127.0.0.1:33751_solr ] o.a.s.c.c.SolrZkClient makePath: /security.json
    [junit4] 2> 1619246 INFO (jetty-launcher-1193-thread-1) [n:127.0.0.1:36988_solr ] o.a.s.c.c.SolrZkClient makePath: /security.json
    [junit4] 2> 1619246 INFO (jetty-launcher-1193-thread-1) [n:127.0.0.1:36988_solr ] o.a.s.c.ZkController Register node as live in ZooKeeper:/live_nodes/127.0.0.1:36988_solr
    [junit4] 2> 1619246 INFO (jetty-launcher-1193-thread-2) [n:127.0.0.1:33751_solr ] o.a.s.c.ZkController Register node as live in ZooKeeper:/live_nodes/127.0.0.1:33751_solr
    [junit4] 2> 1619247 INFO (jetty-launcher-1193-thread-1) [n:127.0.0.1:36988_solr ] o.a.s.c.c.SolrZkClient makePath: /live_nodes/127.0.0.1:36988_solr
    [junit4] 2> 1619247 INFO (jetty-launcher-1193-thread-2) [n:127.0.0.1:33751_solr ] o.a.s.c.c.SolrZkClient makePath: /live_nodes/127.0.0.1:33751_solr
    [junit4] 2> 1619247 INFO (jetty-launcher-1193-thread-1) [n:127.0.0.1:36988_solr ] o.a.s.c.c.SolrZkClient makePath: /overseer_elect
    [junit4] 2> 1619247 INFO (jetty-launcher-1193-thread-2) [n:127.0.0.1:33751_solr ] o.a.s.c.c.SolrZkClient makePath: /overseer_elect
    [junit4] 2> 1619248 INFO (jetty-launcher-1193-thread-1) [n:127.0.0.1:36988_solr ] o.a.s.c.c.SolrZkClient makePath: /overseer_elect/election
    [junit4] 2> 1619248 INFO (jetty-launcher-1193-thread-2) [n:127.0.0.1:33751_solr ] o.a.s.c.c.SolrZkClient makePath: /overseer_elect/election
    [junit4] 2> 1619248 INFO (jetty-launcher-1193-thread-2) [n:127.0.0.1:33751_solr ] o.a.s.c.Overseer Overseer (id=null) closing
    [junit4] 2> 1619248 INFO (jetty-launcher-1193-thread-1) [n:127.0.0.1:36988_solr ] o.a.s.c.Overseer Overseer (id=null) closing
    [junit4] 2> 1619249 INFO (jetty-launcher-1193-thread-2) [n:127.0.0.1:33751_solr ] o.a.s.c.LeaderElector Joined leadership election with path: /overseer_elect/election/96080641726021636-127.0.0.1:33751_solr-n_0000000000
    [junit4] 2> 1619249 INFO (jetty-launcher-1193-thread-1) [n:127.0.0.1:36988_solr ] o.a.s.c.LeaderElector Joined leadership election with path: /overseer_elect/election/96080641726021638-127.0.0.1:36988_solr-n_0000000001
    [junit4] 2> 1619249 INFO (jetty-launcher-1193-thread-2) [n:127.0.0.1:33751_solr ] o.a.s.c.OverseerElectionContext I am going to be the leader 127.0.0.1:33751_solr
    [junit4] 2> 1619249 INFO (jetty-launcher-1193-thread-2) [n:127.0.0.1:33751_solr ] o.a.s.c.c.SolrZkClient makePath: /overseer_elect/leader
    [junit4] 2> 1619249 INFO (jetty-launcher-1193-thread-1) [n:127.0.0.1:36988_solr ] o.a.s.c.LeaderElector Watching path /overseer_elect/election/96080641726021636-127.0.0.1:33751_solr-n_0000000000 to know if I could be the leader
    [junit4] 2> 1619249 INFO (jetty-launcher-1193-thread-1) [n:127.0.0.1:36988_solr ] o.a.s.c.c.ZkStateReader Updating cluster state from ZooKeeper...
    [junit4] 2> 1619250 INFO (jetty-launcher-1193-thread-2) [n:127.0.0.1:33751_solr ] o.a.s.c.Overseer Overseer (id=96080641726021636-127.0.0.1:33751_solr-n_0000000000) starting
    [junit4] 2> 1619250 INFO (jetty-launcher-1193-thread-2) [n:127.0.0.1:33751_solr ] o.a.s.c.c.SolrZkClient makePath: /overseer/queue-work
    [junit4] 2> 1619254 INFO (jetty-launcher-1193-thread-2) [n:127.0.0.1:33751_solr ] o.a.s.c.OverseerAutoReplicaFailoverThread Starting OverseerAutoReplicaFailoverThread autoReplicaFailoverWorkLoopDelay=10000 autoReplicaFailoverWaitAfterExpiration=30000 autoReplicaFailoverBadNodeExpiration=60000
    [junit4] 2> 1619254 INFO (jetty-launcher-1193-thread-2) [n:127.0.0.1:33751_solr ] o.a.s.c.c.ZkStateReader Updating cluster state from ZooKeeper...
    [junit4] 2> 1619254 INFO (OverseerCollectionConfigSetProcessor-96080641726021636-127.0.0.1:33751_solr-n_0000000000) [n:127.0.0.1:33751_solr ] o.a.s.c.OverseerTaskProcessor Process current queue of overseer operations
    [junit4] 2> 1619254 INFO (OverseerStateUpdate-96080641726021636-127.0.0.1:33751_solr-n_0000000000) [n:127.0.0.1:33751_solr ] o.a.s.c.Overseer Starting to work on the main queue
    [junit4] 2> 1619259 INFO (jetty-launcher-1193-thread-1) [n:127.0.0.1:36988_solr ] o.a.s.c.CoreContainer Security conf doesn't exist. Skipping setup for authorization module.
    [junit4] 2> 1619259 INFO (jetty-launcher-1193-thread-1) [n:127.0.0.1:36988_solr ] o.a.s.c.CoreContainer No authentication plugin used.
    [junit4] 2> 1619260 INFO (jetty-launcher-1193-thread-1) [n:127.0.0.1:36988_solr ] o.a.s.c.CorePropertiesLocator Looking for core definitions underneath /home/jenkins/workspace/Lucene-Solr-5.5-Linux/solr/build/solr-core/test/J2/temp/solr.schema.TestManagedSchemaAPI_FD031B74A0EC974-001/tempDir-001/node1/.
    [junit4] 2> 1619260 INFO (jetty-launcher-1193-thread-1) [n:127.0.0.1:36988_solr ] o.a.s.c.CorePropertiesLocator Found 0 core definitions
    [junit4] 2> 1619260 INFO (jetty-launcher-1193-thread-1) [n:127.0.0.1:36988_solr ] o.a.s.s.SolrDispatchFilter user.dir=/home/jenkins/workspace/Lucene-Solr-5.5-Linux/solr/build/solr-core/test/J2
    [junit4] 2> 1619261 INFO (jetty-launcher-1193-thread-1) [n:127.0.0.1:36988_solr ] o.a.s.s.SolrDispatchFilter SolrDispatchFilter.init() done
    [junit4] 2> 1619262 INFO (jetty-launcher-1193-thread-2) [n:127.0.0.1:33751_solr ] o.a.s.c.CoreContainer Security conf doesn't exist. Skipping setup for authorization module.
    [junit4] 2> 1619262 INFO (jetty-launcher-1193-thread-2) [n:127.0.0.1:33751_solr ] o.a.s.c.CoreContainer No authentication plugin used.
    [junit4] 2> 1619264 INFO (jetty-launcher-1193-thread-2) [n:127.0.0.1:33751_solr ] o.a.s.c.CorePropertiesLocator Looking for core definitions underneath /home/jenkins/workspace/Lucene-Solr-5.5-Linux/solr/build/solr-core/test/J2/temp/solr.schema.TestManagedSchemaAPI_FD031B74A0EC974-001/tempDir-001/node2/.
    [junit4] 2> 1619264 INFO (jetty-launcher-1193-thread-2) [n:127.0.0.1:33751_solr ] o.a.s.c.CorePropertiesLocator Found 0 core definitions
    [junit4] 2> 1619264 INFO (jetty-launcher-1193-thread-2) [n:127.0.0.1:33751_solr ] o.a.s.s.SolrDispatchFilter user.dir=/home/jenkins/workspace/Lucene-Solr-5.5-Linux/solr/build/solr-core/test/J2
    [junit4] 2> 1619264 INFO (jetty-launcher-1193-thread-2) [n:127.0.0.1:33751_solr ] o.a.s.s.SolrDispatchFilter SolrDispatchFilter.init() done
    [junit4] 2> 1619264 INFO (TEST-TestManagedSchemaAPI.test-seed#[FD031B74A0EC974]) [ ] o.a.s.c.c.SolrZkClient Using default ZkCredentialsProvider
    [junit4] 2> 1619265 INFO (TEST-TestManagedSchemaAPI.test-seed#[FD031B74A0EC974]) [ ] o.a.s.c.c.ConnectionManager Waiting for client to connect to ZooKeeper
    [junit4] 2> 1619265 INFO (zkCallback-1205-thread-1) [ ] o.a.s.c.c.ConnectionManager Watcher org.apache.solr.common.cloud.ConnectionManager@4793e4bb name:ZooKeeperConnection Watcher:127.0.0.1:46485 got event WatchedEvent state:SyncConnected type:None path:null path:null type:None
    [junit4] 2> 1619265 INFO (TEST-TestManagedSchemaAPI.test-seed#[FD031B74A0EC974]) [ ] o.a.s.c.c.ConnectionManager Client is connected to ZooKeeper
    [junit4] 2> 1619266 INFO (TEST-TestManagedSchemaAPI.test-seed#[FD031B74A0EC974]) [ ] o.a.s.c.c.SolrZkClient Using default ZkACLProvider
    [junit4] 2> 1619266 INFO (TEST-TestManagedSchemaAPI.test-seed#[FD031B74A0EC974]) [ ] o.a.s.c.c.SolrZkClient Using default ZkCredentialsProvider
    [junit4] 2> 1619267 INFO (TEST-TestManagedSchemaAPI.test-seed#[FD031B74A0EC974]) [ ] o.a.s.c.c.ConnectionManager Waiting for client to connect to ZooKeeper
    [junit4] 2> 1619267 INFO (zkCallback-1207-thread-1) [ ] o.a.s.c.c.ConnectionManager Watcher org.apache.solr.common.cloud.ConnectionManager@4c5fc182 name:ZooKeeperConnection Watcher:127.0.0.1:46485/solr got event WatchedEvent state:SyncConnected type:None path:null path:null type:None
    [junit4] 2> 1619267 INFO (TEST-TestManagedSchemaAPI.test-seed#[FD031B74A0EC974]) [ ] o.a.s.c.c.ConnectionManager Client is connected to ZooKeeper
    [junit4] 2> 1619268 INFO (TEST-TestManagedSchemaAPI.test-seed#[FD031B74A0EC974]) [ ] o.a.s.c.c.SolrZkClient Using default ZkACLProvider
    [junit4] 2> 1619268 INFO (TEST-TestManagedSchemaAPI.test-seed#[FD031B74A0EC974]) [ ] o.a.s.c.c.SolrZkClient makePath: /configs/conf1/solrconfig.xml
    [junit4] 2> 1619269 INFO (TEST-TestManagedSchemaAPI.test-seed#[FD031B74A0EC974]) [ ] o.a.s.c.c.SolrZkClient makePath: /configs/conf1/managed-schema
    [junit4] 2> 1619270 INFO (TEST-TestManagedSchemaAPI.test-seed#[FD031B74A0EC974]) [ ] o.a.s.c.c.SolrZkClient Using default ZkCredentialsProvider
    [junit4] 2> 1619270 INFO (TEST-TestManagedSchemaAPI.test-seed#[FD031B74A0EC974]) [ ] o.a.s.c.c.ConnectionManager Waiting for client to connect to ZooKeeper
    [junit4] 2> 1619271 INFO (zkCallback-1208-thread-1) [ ] o.a.s.c.c.ConnectionManager Watcher org.apache.solr.common.cloud.ConnectionManager@5fa9cbfb name:ZooKeeperConnection Watcher:127.0.0.1:46485/solr got event WatchedEvent state:SyncConnected type:None path:null path:null type:None
    [junit4] 2> 1619271 INFO (TEST-TestManagedSchemaAPI.test-seed#[FD031B74A0EC974]) [ ] o.a.s.c.c.ConnectionManager Client is connected to ZooKeeper
    [junit4] 2> 1619271 INFO (TEST-TestManagedSchemaAPI.test-seed#[FD031B74A0EC974]) [ ] o.a.s.c.c.SolrZkClient Using default ZkACLProvider
    [junit4] 2> 1619271 INFO (TEST-TestManagedSchemaAPI.test-seed#[FD031B74A0EC974]) [ ] o.a.s.c.c.ZkStateReader Updating cluster state from ZooKeeper...
    [junit4] 2> 1619273 INFO (qtp906200120-8244) [n:127.0.0.1:36988_solr ] o.a.s.h.a.CollectionsHandler Invoked Collection Action :create with params replicationFactor=2&collection.configName=conf1&version=2&wt=javabin&numShards=1&name=testschemaapi&action=CREATE and sendToOCPQueue=true
    [junit4] 2> 1619274 INFO (OverseerCollectionConfigSetProcessor-96080641726021636-127.0.0.1:33751_solr-n_0000000000) [n:127.0.0.1:33751_solr ] o.a.s.c.OverseerTaskProcessor Overseer Collection Message Handler: Get the message id:/overseer/collection-queue-work/qn-0000000000 message:{
    [junit4] 2> "name":"testschemaapi",
    [junit4] 2> "fromApi":"true",
    [junit4] 2> "replicationFactor":"2",
    [junit4] 2> "collection.configName":"conf1",
    [junit4] 2> "numShards":"1",
    [junit4] 2> "stateFormat":"2",
    [junit4] 2> "operation":"create"}
    [junit4] 2> 1619275 INFO (OverseerThreadFactory-3305-thread-1-processing-n:127.0.0.1:33751_solr) [n:127.0.0.1:33751_solr ] o.a.s.c.OverseerCollectionMessageHandler OverseerCollectionMessageHandler.processMessage : create , {
    [junit4] 2> "name":"testschemaapi",
    [junit4] 2> "fromApi":"true",
    [junit4] 2> "replicationFactor":"2",
    [junit4] 2> "collection.configName":"conf1",
    [junit4] 2> "numShards":"1",
    [junit4] 2> "stateFormat":"2",
    [junit4] 2> "operation":"create"}
    [junit4] 2> 1619276 INFO (OverseerThreadFactory-3305-thread-1-processing-n:127.0.0.1:33751_solr) [n:127.0.0.1:33751_solr ] o.a.s.c.OverseerCollectionMessageHandler Create collection testschemaapi
    [junit4] 2> 1619276 INFO (OverseerThreadFactory-3305-thread-1-processing-n:127.0.0.1:33751_solr) [n:127.0.0.1:33751_solr ] o.a.s.c.OverseerCollectionMessageHandler creating collections conf node /collections/testschemaapi
    [junit4] 2> 1619276 INFO (OverseerThreadFactory-3305-thread-1-processing-n:127.0.0.1:33751_solr) [n:127.0.0.1:33751_solr ] o.a.s.c.c.SolrZkClient makePath: /collections/testschemaapi
    [junit4] 2> 1619277 INFO (zkCallback-1208-thread-1) [ ] o.a.s.c.c.ZkStateReader A collections change: [WatchedEvent state:SyncConnected type:NodeChildrenChanged path:/collections], has occurred - updating...
    [junit4] 2> 1619277 INFO (zkCallback-1200-thread-1-processing-n:127.0.0.1:33751_solr) [n:127.0.0.1:33751_solr ] o.a.s.c.c.ZkStateReader A collections change: [WatchedEvent state:SyncConnected type:NodeChildrenChanged path:/collections], has occurred - updating...
    [junit4] 2> 1619277 INFO (zkCallback-1204-thread-1-processing-n:127.0.0.1:36988_solr) [n:127.0.0.1:36988_solr ] o.a.s.c.c.ZkStateReader A collections change: [WatchedEvent state:SyncConnected type:NodeChildrenChanged path:/collections], has occurred - updating...
    [junit4] 2> 1619278 INFO (OverseerStateUpdate-96080641726021636-127.0.0.1:33751_solr-n_0000000000) [n:127.0.0.1:33751_solr ] o.a.s.c.Overseer processMessage: queueSize: 1, message = {
    [junit4] 2> "name":"testschemaapi",
    [junit4] 2> "fromApi":"true",
    [junit4] 2> "replicationFactor":"2",
    [junit4] 2> "collection.configName":"conf1",
    [junit4] 2> "numShards":"1",
    [junit4] 2> "stateFormat":"2",
    [junit4] 2> "operation":"create"} current state version: 0
    [junit4] 2> 1619278 INFO (OverseerStateUpdate-96080641726021636-127.0.0.1:33751_solr-n_0000000000) [n:127.0.0.1:33751_solr ] o.a.s.c.o.ClusterStateMutator building a new cName: testschemaapi
    [junit4] 2> 1619278 INFO (OverseerStateUpdate-96080641726021636-127.0.0.1:33751_solr-n_0000000000) [n:127.0.0.1:33751_solr ] o.a.s.c.o.ZkStateWriter going to create_collection /collections/testschemaapi/state.json
    [junit4] 2> 1619378 INFO (OverseerThreadFactory-3305-thread-1-processing-n:127.0.0.1:33751_solr) [n:127.0.0.1:33751_solr ] o.a.s.c.OverseerCollectionMessageHandler Creating SolrCores for new collection testschemaapi, shardNames [shard1] , replicationFactor : 2
    [junit4] 2> 1619378 INFO (OverseerThreadFactory-3305-thread-1-processing-n:127.0.0.1:33751_solr) [n:127.0.0.1:33751_solr ] o.a.s.c.OverseerCollectionMessageHandler Creating core testschemaapi_shard1_replica1 as part of shard shard1 of collection testschemaapi on 127.0.0.1:36988_solr
    [junit4] 2> 1619378 INFO (OverseerThreadFactory-3305-thread-1-processing-n:127.0.0.1:33751_solr) [n:127.0.0.1:33751_solr ] o.a.s.c.OverseerCollectionMessageHandler Creating core testschemaapi_shard1_replica2 as part of shard shard1 of collection testschemaapi on 127.0.0.1:33751_solr
    [junit4] 2> 1619380 INFO (qtp906200120-8246) [n:127.0.0.1:36988_solr ] o.a.s.h.a.CoreAdminOperation core create command collection.configName=conf1&wt=javabin&version=2&numShards=1&name=testschemaapi_shard1_replica1&shard=shard1&action=CREATE&collection=testschemaapi&qt=/admin/cores
    [junit4] 2> 1619380 INFO (qtp551392316-8241) [n:127.0.0.1:33751_solr ] o.a.s.h.a.CoreAdminOperation core create command collection.configName=conf1&wt=javabin&version=2&numShards=1&name=testschemaapi_shard1_replica2&shard=shard1&action=CREATE&collection=testschemaapi&qt=/admin/cores
    [junit4] 2> 1619380 INFO (qtp551392316-8241) [n:127.0.0.1:33751_solr ] o.a.s.c.CoreDescriptor Created CoreDescriptor: {loadOnStartup=true, collection=testschemaapi, schema=schema.xml, collection.configName=conf1, shard=shard1, numShards=1, name=testschemaapi_shard1_replica2, config=solrconfig.xml, transient=false, dataDir=data/, configSetProperties=configsetprops.json}
    [junit4] 2> 1619380 INFO (qtp906200120-8246) [n:127.0.0.1:36988_solr ] o.a.s.c.CoreDescriptor Created CoreDescriptor: {configSetProperties=configsetprops.json, config=solrconfig.xml, schema=schema.xml, dataDir=data/, collection.configName=conf1, loadOnStartup=true, shard=shard1, collection=testschemaapi, name=testschemaapi_shard1_replica1, transient=false, numShards=1}
    [junit4] 2> 1619381 INFO (qtp551392316-8241) [n:127.0.0.1:33751_solr c:testschemaapi s:shard1 x:testschemaapi_shard1_replica2] o.a.s.c.ZkController publishing state=down
    [junit4] 2> 1619381 INFO (qtp906200120-8246) [n:127.0.0.1:36988_solr c:testschemaapi s:shard1 x:testschemaapi_shard1_replica1] o.a.s.c.ZkController publishing state=down
    [junit4] 2> 1619381 INFO (qtp906200120-8246) [n:127.0.0.1:36988_solr c:testschemaapi s:shard1 x:testschemaapi_shard1_replica1] o.a.s.c.ZkController Registering watch for collection testschemaapi
    [junit4] 2> 1619382 INFO (qtp906200120-8246) [n:127.0.0.1:36988_solr c:testschemaapi s:shard1 x:testschemaapi_shard1_replica1] o.a.s.c.c.ZkStateReader addZkWatch [testschemaapi]
    [junit4] 2> 1619382 INFO (qtp551392316-8241) [n:127.0.0.1:33751_solr c:testschemaapi s:shard1 x:testschemaapi_shard1_replica2] o.a.s.c.ZkController Registering watch for collection testschemaapi
    [junit4] 2> 1619382 INFO (qtp551392316-8241) [n:127.0.0.1:33751_solr c:testschemaapi s:shard1 x:testschemaapi_shard1_replica2] o.a.s.c.c.ZkStateReader addZkWatch [testschemaapi]
    [junit4] 2> 1619382 INFO (OverseerStateUpdate-96080641726021636-127.0.0.1:33751_solr-n_0000000000) [n:127.0.0.1:33751_solr ] o.a.s.c.Overseer processMessage: queueSize: 2, message = {
    [junit4] 2> "node_name":"127.0.0.1:36988_solr",
    [junit4] 2> "numShards":"1",
    [junit4] 2> "core":"testschemaapi_shard1_replica1",
    [junit4] 2> "roles":null,
    [junit4] 2> "operation":"state",
    [junit4] 2> "shard":"shard1",
    [junit4] 2> "base_url":"http://127.0.0.1:36988/solr",
    [junit4] 2> "state":"down",
    [junit4] 2> "collection":"testschemaapi"} current state version: 0
    [junit4] 2> 1619382 INFO (qtp906200120-8246) [n:127.0.0.1:36988_solr c:testschemaapi s:shard1 x:testschemaapi_shard1_replica1] o.a.s.c.c.ZkStateReader Add data for [testschemaapi] ver [0]
    [junit4] 2> 1619382 INFO (qtp906200120-8246) [n:127.0.0.1:36988_solr c:testschemaapi s:shard1 x:testschemaapi_shard1_replica1] o.a.s.c.ZkController look for our core node name
    [junit4] 2> 1619382 INFO (qtp551392316-8241) [n:127.0.0.1:33751_solr c:testschemaapi s:shard1 x:testschemaapi_shard1_replica2] o.a.s.c.c.ZkStateReader Add data for [testschemaapi] ver [0]
    [junit4] 2> 1619382 INFO (qtp551392316-8241) [n:127.0.0.1:33751_solr c:testschemaapi s:shard1 x:testschemaapi_shard1_replica2] o.a.s.c.ZkController look for our core node name
    [junit4] 2> 1619382 INFO (OverseerStateUpdate-96080641726021636-127.0.0.1:33751_solr-n_0000000000) [n:127.0.0.1:33751_solr ] o.a.s.c.o.ReplicaMutator Update state numShards=1 message={
    [junit4] 2> "node_name":"127.0.0.1:36988_solr",
    [junit4] 2> "numShards":"1",
    [junit4] 2> "core":"testschemaapi_shard1_replica1",
    [junit4] 2> "roles":null,
    [junit4] 2> "operation":"state",
    [junit4] 2> "shard":"shard1",
    [junit4] 2> "base_url":"http://127.0.0.1:36988/solr",
    [junit4] 2> "state":"down",
    [junit4] 2> "collection":"testschemaapi"}
    [junit4] 2> 1619383 INFO (OverseerStateUpdate-96080641726021636-127.0.0.1:33751_solr-n_0000000000) [n:127.0.0.1:33751_solr ] o.a.s.c.Overseer processMessage: queueSize: 1, message = {
    [junit4] 2> "node_name":"127.0.0.1:33751_solr",
    [junit4] 2> "numShards":"1",
    [junit4] 2> "core":"testschemaapi_shard1_replica2",
    [junit4] 2> "roles":null,
    [junit4] 2> "operation":"state",
    [junit4] 2> "shard":"shard1",
    [junit4] 2> "base_url":"http://127.0.0.1:33751/solr",
    [junit4] 2> "state":"down",
    [junit4] 2> "collection":"testschemaapi"} current state version: 0
    [junit4] 2> 1619384 INFO (OverseerStateUpdate-96080641726021636-127.0.0.1:33751_solr-n_0000000000) [n:127.0.0.1:33751_solr ] o.a.s.c.o.ReplicaMutator Update state numShards=1 message={
    [junit4] 2> "node_name":"127.0.0.1:33751_solr",
    [junit4] 2> "numShards":"1",
    [junit4] 2> "core":"testschemaapi_shard1_replica2",
    [junit4] 2> "roles":null,
    [junit4] 2> "operation":"state",
    [junit4] 2> "shard":"shard1",
    [junit4] 2> "base_url":"http://127.0.0.1:33751/solr",
    [junit4] 2> "state":"down",
    [junit4] 2> "collection":"testschemaapi"}
    [junit4] 2> 1619485 INFO (OverseerStateUpdate-96080641726021636-127.0.0.1:33751_solr-n_0000000000) [n:127.0.0.1:33751_solr ] o.a.s.c.o.ZkStateWriter going to update_collection /collections/testschemaapi/state.json version: 0
    [junit4] 2> 1619485 INFO (zkCallback-1200-thread-1-processing-n:127.0.0.1:33751_solr) [n:127.0.0.1:33751_solr ] o.a.s.c.c.ZkStateReader A cluster state change: [WatchedEvent state:SyncConnected type:NodeDataChanged path:/collections/testschemaapi/state.json] for collection [testschemaapi] has occurred - updating... (live nodes size: [2])
    [junit4] 2> 1619485 INFO (zkCallback-1204-thread-1-processing-n:127.0.0.1:36988_solr) [n:127.0.0.1:36988_solr ] o.a.s.c.c.ZkStateReader A cluster state change: [WatchedEvent state:SyncConnected type:NodeDataChanged path:/collections/testschemaapi/state.json] for collection [testschemaapi] has occurred - updating... (live nodes size: [2])
    [junit4] 2> 1619485 INFO (zkCallback-1200-thread-1-processing-n:127.0.0.1:33751_solr) [n:127.0.0.1:33751_solr ] o.a.s.c.c.ZkStateReader Updating data for [testschemaapi] from [0] to [1]
    [junit4] 2> 1619485 INFO (zkCallback-1204-thread-1-processing-n:127.0.0.1:36988_solr) [n:127.0.0.1:36988_solr ] o.a.s.c.c.ZkStateReader Updating data for [testschemaapi] from [0] to [1]
    [junit4] 2> 1620382 INFO (qtp906200120-8246) [n:127.0.0.1:36988_solr c:testschemaapi s:shard1 x:testschemaapi_shard1_replica1] o.a.s.c.ZkController waiting to find shard id in clusterstate for testschemaapi_shard1_replica1
    [junit4] 2> 1620382 INFO (qtp906200120-8246) [n:127.0.0.1:36988_solr c:testschemaapi s:shard1 x:testschemaapi_shard1_replica1] o.a.s.c.ZkController Check for collection zkNode:testschemaapi
    [junit4] 2> 1620382 INFO (qtp551392316-8241) [n:127.0.0.1:33751_solr c:testschemaapi s:shard1 x:testschemaapi_shard1_replica2] o.a.s.c.ZkController waiting to find shard id in clusterstate for testschemaapi_shard1_replica2
    [junit4] 2> 1620382 INFO (qtp551392316-8241) [n:127.0.0.1:33751_solr c:testschemaapi s:shard1 x:testschemaapi_shard1_replica2] o.a.s.c.ZkController Check for collection zkNode:testschemaapi
    [junit4] 2> 1620382 INFO (qtp906200120-8246) [n:127.0.0.1:36988_solr c:testschemaapi s:shard1 x:testschemaapi_shard1_replica1] o.a.s.c.ZkController Collection zkNode exists
    [junit4] 2> 1620382 INFO (qtp906200120-8246) [n:127.0.0.1:36988_solr c:testschemaapi s:shard1 x:testschemaapi_shard1_replica1] o.a.s.c.c.ZkStateReader Load collection config from: [/collections/testschemaapi]
    [junit4] 2> 1620382 INFO (qtp551392316-8241) [n:127.0.0.1:33751_solr c:testschemaapi s:shard1 x:testschemaapi_shard1_replica2] o.a.s.c.ZkController Collection zkNode exists
    [junit4] 2> 1620382 INFO (qtp551392316-8241) [n:127.0.0.1:33751_solr c:testschemaapi s:shard1 x:testschemaapi_shard1_replica2] o.a.s.c.c.ZkStateReader Load collection config from: [/collections/testschemaapi]
    [junit4] 2> 1620383 INFO (qtp906200120-8246) [n:127.0.0.1:36988_solr c:testschemaapi s:shard1 x:testschemaapi_shard1_replica1] o.a.s.c.c.ZkStateReader path=[/collections/testschemaapi] [configName]=[conf1] specified config exists in ZooKeeper
    [junit4] 2> 1620383 INFO (qtp551392316-8241) [n:127.0.0.1:33751_solr c:testschemaapi s:shard1 x:testschemaapi_shard1_replica2] o.a.s.c.c.ZkStateReader path=[/collections/testschemaapi] [configName]=[conf1] specified config exists in ZooKeeper
    [junit4] 2> 1620383 INFO (qtp906200120-8246) [n:127.0.0.1:36988_solr c:testschemaapi s:shard1 x:testschemaapi_shard1_replica1] o.a.s.c.SolrResourceLoader new SolrResourceLoader for directory: '/home/jenkins/workspace/Lucene-Solr-5.5-Linux/solr/build/solr-core/test/J2/temp/solr.schema.TestManagedSchemaAPI_FD031B74A0EC974-001/tempDir-001/node1/testschemaapi_shard1_replica1'
    [junit4] 2> 1620383 INFO (qtp551392316-8241) [n:127.0.0.1:33751_solr c:testschemaapi s:shard1 x:testschemaapi_shard1_replica2] o.a.s.c.SolrResourceLoader new SolrResourceLoader for directory: '/home/jenkins/workspace/Lucene-Solr-5.5-Linux/solr/build/solr-core/test/J2/temp/solr.schema.TestManagedSchemaAPI_FD031B74A0EC974-001/tempDir-001/node2/testschemaapi_shard1_replica2'
    [junit4] 2> 1620383 INFO (qtp906200120-8246) [n:127.0.0.1:36988_solr c:testschemaapi s:shard1 x:testschemaapi_shard1_replica1] o.a.s.c.SolrResourceLoader JNDI not configured for solr (NoInitialContextEx)
    [junit4] 2> 1620383 INFO (qtp551392316-8241) [n:127.0.0.1:33751_solr c:testschemaapi s:shard1 x:testschemaapi_shard1_replica2] o.a.s.c.SolrResourceLoader JNDI not configured for solr (NoInitialContextEx)
    [junit4] 2> 1620383 INFO (qtp906200120-8246) [n:127.0.0.1:36988_solr c:testschemaapi s:shard1 x:testschemaapi_shard1_replica1] o.a.s.c.SolrResourceLoader solr home defaulted to 'solr/' (could not find system property or JNDI)
    [junit4] 2> 1620383 INFO (qtp551392316-8241) [n:127.0.0.1:33751_solr c:testschemaapi s:shard1 x:testschemaapi_shard1_replica2] o.a.s.c.SolrResourceLoader solr home defaulted to 'solr/' (could not find system property or JNDI)
    [junit4] 2> 1620384 INFO (qtp906200120-8246) [n:127.0.0.1:36988_solr c:testschemaapi s:shard1 x:testschemaapi_shard1_replica1] o.a.s.c.Config loaded config solrconfig.xml with version 0
    [junit4] 2> 1620384 INFO (qtp551392316-8241) [n:127.0.0.1:33751_solr c:testschemaapi s:shard1 x:testschemaapi_shard1_replica2] o.a.s.c.Config loaded config solrconfig.xml with version 0
    [junit4] 2> 1620387 INFO (qtp906200120-8246) [n:127.0.0.1:36988_solr c:testschemaapi s:shard1 x:testschemaapi_shard1_replica1] o.a.s.c.SolrConfig current version of requestparams : -1
    [junit4] 2> 1620387 INFO (qtp551392316-8241) [n:127.0.0.1:33751_solr c:testschemaapi s:shard1 x:testschemaapi_shard1_replica2] o.a.s.c.SolrConfig current version of requestparams : -1
    [junit4] 2> 1620394 INFO (qtp906200120-8246) [n:127.0.0.1:36988_solr c:testschemaapi s:shard1 x:testschemaapi_shard1_replica1] o.a.s.c.SolrConfig Using Lucene MatchVersion: 5.5.2
    [junit4] 2> 1620394 INFO (qtp551392316-8241) [n:127.0.0.1:33751_solr c:testschemaapi s:shard1 x:testschemaapi_shard1_replica2] o.a.s.c.SolrConfig Using Lucene MatchVersion: 5.5.2
    [junit4] 2> 1620407 INFO (qtp906200120-8246) [n:127.0.0.1:36988_solr c:testschemaapi s:shard1 x:testschemaapi_shard1_replica1] o.a.s.c.SolrConfig Loaded SolrConfig: solrconfig.xml
    [junit4] 2> 1620407 INFO (qtp551392316-8241) [n:127.0.0.1:33751_solr c:testschemaapi s:shard1 x:testschemaapi_shard1_replica2] o.a.s.c.SolrConfig Loaded SolrConfig: solrconfig.xml
    [junit4] 2> 1620411 INFO (qtp551392316-8241) [n:127.0.0.1:33751_solr c:testschemaapi s:shard1 x:testschemaapi_shard1_replica2] o.a.s.s.IndexSchema [testschemaapi_shard1_replica2] Schema name=minimal
    [junit4] 2> 1620411 INFO (qtp906200120-8246) [n:127.0.0.1:36988_solr c:testschemaapi s:shard1 x:testschemaapi_shard1_replica1] o.a.s.s.IndexSchema [testschemaapi_shard1_replica1] Schema name=minimal
    [junit4] 2> 1620416 INFO (qtp906200120-8246) [n:127.0.0.1:36988_solr c:testschemaapi s:shard1 x:testschemaapi_shard1_replica1] o.a.s.s.IndexSchema unique key field: id
    [junit4] 2> 1620416 INFO (qtp551392316-8241) [n:127.0.0.1:33751_solr c:testschemaapi s:shard1 x:testschemaapi_shard1_replica2] o.a.s.s.IndexSchema unique key field: id
    [junit4] 2> 1620417 INFO (qtp551392316-8241) [n:127.0.0.1:33751_solr c:testschemaapi s:shard1 x:testschemaapi_shard1_replica2] o.a.s.c.ConfigSetProperties Did not find ConfigSet properties, assuming default properties: Can't find resource 'configsetprops.json' in classpath or '/configs/conf1', cwd=/home/jenkins/workspace/Lucene-Solr-5.5-Linux/solr/build/solr-core/test/J2
    [junit4] 2> 1620417 INFO (qtp906200120-8246) [n:127.0.0.1:36988_solr c:testschemaapi s:shard1 x:testschemaapi_shard1_replica1] o.a.s.c.ConfigSetProperties Did not find ConfigSet properties, assuming default properties: Can't find resource 'configsetprops.json' in classpath or '/configs/conf1', cwd=/home/jenkins/workspace/Lucene-Solr-5.5-Linux/solr/build/solr-core/test/J2
    [junit4] 2> 1620417 INFO (qtp551392316-8241) [n:127.0.0.1:33751_solr c:testschemaapi s:shard1 x:testschemaapi_shard1_replica2] o.a.s.c.CoreContainer Creating SolrCore 'testschemaapi_shard1_replica2' using configuration from collection testschemaapi
    [junit4] 2> 1620417 INFO (qtp906200120-8246) [n:127.0.0.1:36988_solr c:testschemaapi s:shard1 x:testschemaapi_shard1_replica1] o.a.s.c.CoreContainer Creating SolrCore 'testschemaapi_shard1_replica1' using configuration from collection testschemaapi
    [junit4] 2> 1620417 INFO (qtp906200120-8246) [n:127.0.0.1:36988_solr c:testschemaapi s:shard1 r:core_node1 x:testschemaapi_shard1_replica1] o.a.s.c.SolrCore org.apache.solr.core.MockDirectoryFactory
    [junit4] 2> 1620417 INFO (qtp551392316-8241) [n:127.0.0.1:33751_solr c:testschemaapi s:shard1 r:core_node2 x:testschemaapi_shard1_replica2] o.a.s.c.SolrCore org.apache.solr.core.MockDirectoryFactory
    [junit4] 2> 1620417 INFO (qtp906200120-8246) [n:127.0.0.1:36988_solr c:testschemaapi s:shard1 r:core_node1 x:testschemaapi_shard1_replica1] o.a.s.c.SolrCore [[testschemaapi_shard1_replica1] ] Opening new SolrCore at [/home/jenkins/workspace/Lucene-Solr-5.5-Linux/solr/build/solr-core/test/J2/temp/solr.schema.TestManagedSchemaAPI_FD031B74A0EC974-001/tempDir-001/node1/testschemaapi_shard1_replica1], dataDir=[/home/jenkins/workspace/Lucene-Solr-5.5-Linux/solr/build/solr-core/test/J2/temp/solr.schema.TestManagedSchemaAPI_FD031B74A0EC974-001/tempDir-001/node1/./testschemaapi_shard1_replica1/data/]
    [junit4] 2> 1620417 INFO (qtp551392316-8241) [n:127.0.0.1:33751_solr c:testschemaapi s:shard1 r:core_node2 x:testschemaapi_shard1_replica2] o.a.s.c.SolrCore [[testschemaapi_shard1_replica2] ] Opening new SolrCore at [/home/jenkins/workspace/Lucene-Solr-5.5-Linux/solr/build/solr-core/test/J2/temp/solr.schema.TestManagedSchemaAPI_FD031B74A0EC974-001/tempDir-001/node2/testschemaapi_shard1_replica2], dataDir=[/home/jenkins/workspace/Lucene-Solr-5.5-Linux/solr/build/solr-core/test/J2/temp/solr.schema.TestManagedSchemaAPI_FD031B74A0EC974-001/tempDir-001/node2/./testschemaapi_shard1_replica2/data/]
    [junit4] 2> 1620418 INFO (qtp906200120-8246) [n:127.0.0.1:36988_solr c:testschemaapi s:shard1 r:core_node1 x:testschemaapi_shard1_replica1] o.a.s.c.SolrCore JMX monitoring not detected for core: testschemaapi_shard1_replica1
    [junit4] 2> 1620418 INFO (qtp551392316-8241) [n:127.0.0.1:33751_solr c:testschemaapi s:shard1 r:core_node2 x:testschemaapi_shard1_replica2] o.a.s.c.SolrCore JMX monitoring not detected for core: testschemaapi_shard1_replica2
    [junit4] 2> 1620418 INFO (qtp906200120-8246) [n:127.0.0.1:36988_solr c:testschemaapi s:shard1 r:core_node1 x:testschemaapi_shard1_replica1] o.a.s.c.CachingDirectoryFactory return new directory for /home/jenkins/workspace/Lucene-Solr-5.5-Linux/solr/build/solr-core/test/J2/temp/solr.schema.TestManagedSchemaAPI_FD031B74A0EC974-001/tempDir-001/node1/./testschemaapi_shard1_replica1/data
    [junit4] 2> 1620418 INFO (qtp551392316-8241) [n:127.0.0.1:33751_solr c:testschemaapi s:shard1 r:core_node2 x:testschemaapi_shard1_replica2] o.a.s.c.CachingDirectoryFactory return new directory for /home/jenkins/workspace/Lucene-Solr-5.5-Linux/solr/build/solr-core/test/J2/temp/solr.schema.TestManagedSchemaAPI_FD031B74A0EC974-001/tempDir-001/node2/./testschemaapi_shard1_replica2/data
    [junit4] 2> 1620418 INFO (qtp906200120-8246) [n:127.0.0.1:36988_solr c:testschemaapi s:shard1 r:core_node1 x:testschemaapi_shard1_replica1] o.a.s.c.SolrCore New index directory detected: old=null new=/home/jenkins/workspace/Lucene-Solr-5.5-Linux/solr/build/solr-core/test/J2/temp/solr.schema.TestManagedSchemaAPI_FD031B74A0EC974-001/tempDir-001/node1/./testschemaapi_shard1_replica1/data/index/
    [junit4] 2> 1620418 INFO (qtp551392316-8241) [n:127.0.0.1:33751_solr c:testschemaapi s:shard1 r:core_node2 x:testschemaapi_shard1_replica2] o.a.s.c.SolrCore New index directory detected: old=null new=/home/jenkins/workspace/Lucene-Solr-5.5-Linux/solr/build/solr-core/test/J2/temp/solr.schema.TestManagedSchemaAPI_FD031B74A0EC974-001/tempDir-001/node2/./testschemaapi_shard1_replica2/data/index/
    [junit4] 2> 1620418 WARN (qtp906200120-8246) [n:127.0.0.1:36988_solr c:testschemaapi s:shard1 r:core_node1 x:testschemaapi_shard1_replica1] o.a.s.c.SolrCore [testschemaapi_shard1_replica1] Solr index directory '/home/jenkins/workspace/Lucene-Solr-5.5-Linux/solr/build/solr-core/test/J2/temp/solr.schema.TestManagedSchemaAPI_FD031B74A0EC974-001/tempDir-001/node1/./testschemaapi_shard1_replica1/data/index' doesn't exist. Creating new index...
    [junit4] 2> 1620418 WARN (qtp551392316-8241) [n:127.0.0.1:33751_solr c:testschemaapi s:shard1 r:core_node2 x:testschemaapi_shard1_replica2] o.a.s.c.SolrCore [testschemaapi_shard1_replica2] Solr index directory '/home/jenkins/workspace/Lucene-Solr-5.5-Linux/solr/build/solr-core/test/J2/temp/solr.schema.TestManagedSchemaAPI_FD031B74A0EC974-001/tempDir-001/node2/./testschemaapi_shard1_replica2/data/index' doesn't exist. Creating new index...
    [junit4] 2> 1620418 INFO (qtp906200120-8246) [n:127.0.0.1:36988_solr c:testschemaapi s:shard1 r:core_node1 x:testschemaapi_shard1_replica1] o.a.s.c.CachingDirectoryFactory return new directory for /home/jenkins/workspace/Lucene-Solr-5.5-Linux/solr/build/solr-core/test/J2/temp/solr.schema.TestManagedSchemaAPI_FD031B74A0EC974-001/tempDir-001/node1/./testschemaapi_shard1_replica1/data/index
    [junit4] 2> 1620419 INFO (qtp551392316-8241) [n:127.0.0.1:33751_solr c:testschemaapi s:shard1 r:core_node2 x:testschemaapi_shard1_replica2] o.a.s.c.CachingDirectoryFactory return new directory for /home/jenkins/workspace/Lucene-Solr-5.5-Linux/solr/build/solr-core/test/J2/temp/solr.schema.TestManagedSchemaAPI_FD031B74A0EC974-001/tempDir-001/node2/./testschemaapi_shard1_replica2/data/index
    [junit4] 2> 1620419 INFO (qtp551392316-8241) [n:127.0.0.1:33751_solr c:testschemaapi s:shard1 r:core_node2 x:testschemaapi_shard1_replica2] o.a.s.c.SolrDeletionPolicy SolrDeletionPolicy.onCommit: commits: num=1
    [junit4] 2> commit{dir=MockDirectoryWrapper(RAMDirectory@7ae4e2e1 lockFactory=org.apache.lucene.store.SingleInstanceLockFactory@48eb60cf),segFN=segments_1,generation=1}
    [junit4] 2> 1620419 INFO (qtp906200120-8246) [n:127.0.0.1:36988_solr c:testschemaapi s:shard1 r:core_node1 x:testschemaapi_shard1_replica1] o.a.s.c.SolrDeletionPolicy SolrDeletionPolicy.onCommit: commits: num=1
    [junit4] 2> commit{dir=MockDirectoryWrapper(RAMDirectory@624851f8 lockFactory=org.apache.lucene.store.SingleInstanceLockFactory@79fda330),segFN=segments_1,generation=1}
    [junit4] 2> 1620419 INFO (qtp551392316-8241) [n:127.0.0.1:33751_solr c:testschemaapi s:shard1 r:core_node2 x:testschemaapi_shard1_replica2] o.a.s.c.SolrDeletionPolicy newest commit generation = 1
    [junit4] 2> 1620419 INFO (qtp906200120-8246) [n:127.0.0.1:36988_solr c:testschemaapi s:shard1 r:core_node1 x:testschemaapi_shard1_replica1] o.a.s.c.SolrDeletionPolicy newest commit generation = 1
    [junit4] 2> 1620419 INFO (OldIndexDirectoryCleanupThreadForCore-testschemaapi_shard1_replica2) [n:127.0.0.1:33751_solr c:testschemaapi s:shard1 r:core_node2 x:testschemaapi_shard1_replica2] o.a.s.c.SolrCore Looking for old index directories to cleanup for core testschemaapi_shard1_replica2 in /home/jenkins/workspace/Lucene-Solr-5.5-Linux/solr/build/solr-core/test/J2/temp/solr.schema.TestManagedSchemaAPI_FD031B74A0EC974-001/tempDir-001/node2/./testschemaapi_shard1_replica2/data/
    [junit4] 2> 1620419 INFO (OldIndexDirectoryCleanupThreadForCore-testschemaapi_shard1_replica1) [n:127.0.0.1:36988_solr c:testschemaapi s:shard1 r:core_node1 x:testschemaapi_shard1_replica1] o.a.s.c.SolrCore Looking for old index directories to cleanup for core testschemaapi_shard1_replica1 in /home/jenkins/workspace/Lucene-Solr-5.5-Linux/solr/build/solr-core/test/J2/temp/solr.schema.TestManagedSchemaAPI_FD031B74A0EC974-001/tempDir-001/node1/./testschemaapi_shard1_replica1/data/
    [junit4] 2> 1620419 WARN (OldIndexDirectoryCleanupThreadForCore-testschemaapi_shard1_replica2) [n:127.0.0.1:33751_solr c:testschemaapi s:shard1 r:core_node2 x:testschemaapi_shard1_replica2] o.a.s.c.DirectoryFactory /home/jenkins/workspace/Lucene-Solr-5.5-Linux/solr/build/solr-core/test/J2/temp/solr.schema.TestManagedSchemaAPI_FD031B74A0EC974-001/tempDir-001/node2/./testschemaapi_shard1_replica2/data/ does not point to a valid data directory; skipping clean-up of old index directories.
    [junit4] 2> 1620420 WARN (OldIndexDirectoryCleanupThreadForCore-testschemaapi_shard1_replica1) [n:127.0.0.1:36988_solr c:testschemaapi s:shard1 r:core_node1 x:testschemaapi_shard1_replica1] o.a.s.c.DirectoryFactory /home/jenkins/workspace/Lucene-Solr-5.5-Linux/solr/build/solr-core/test/J2/temp/solr.schema.TestManagedSchemaAPI_FD031B74A0EC974-001/tempDir-001/node1/./testschemaapi_shard1_replica1/data/ does not point to a valid data directory; skipping clean-up of old index directories.
    [junit4] 2> 1620421 INFO (qtp551392316-8241) [n:127.0.0.1:33751_solr c:testschemaapi s:shard1 r:core_node2 x:testschemaapi_shard1_replica2] o.a.s.c.SolrCore no updateRequestProcessorChain defined as default, creating implicit default
    [junit4] 2> 1620421 INFO (qtp906200120-8246) [n:127.0.0.1:36988_solr c:testschemaapi s:shard1 r:core_node1 x:testschemaapi_shard1_replica1] o.a.s.c.SolrCore no updateRequestProcessorChain defined as default, creating implicit default
    [junit4] 2> 1620422 INFO (qtp551392316-8241) [n:127.0.0.1:33751_solr c:testschemaapi s:shard1 r:core_node2 x:testschemaapi_shard1_replica2] o.a.s.h.l.XMLLoader xsltCacheLifetimeSeconds=60
    [junit4] 2> 1620422 INFO (qtp906200120-8246) [n:127.0.0.1:36988_solr c:testschemaapi s:shard1 r:core_node1 x:testschemaapi_shard1_replica1] o.a.s.h.l.XMLLoader xsltCacheLifetimeSeconds=60
    [junit4] 2> 1620422 INFO (qtp551392316-8241) [n:127.0.0.1:33751_solr c:testschemaapi s:shard1 r:core_node2 x:testschemaapi_shard1_replica2] o.a.s.h.l.XMLLoader xsltCacheLifetimeSeconds=60
    [junit4] 2> 1620423 INFO (qtp906200120-8246) [n:127.0.0.1:36988_solr c:testschemaapi s:shard1 r:core_node1 x:testschemaapi_shard1_replica1] o.a.s.h.l.XMLLoader xsltCacheLifetimeSeconds=60
    [junit4] 2> 1620423 INFO (qtp551392316-8241) [n:127.0.0.1:33751_solr c:testschemaapi s:shard1 r:core_node2 x:testschemaapi_shard1_replica2] o.a.s.h.l.XMLLoader xsltCacheLifetimeSeconds=60
    [junit4] 2> 1620423 INFO (qtp906200120-8246) [n:127.0.0.1:36988_solr c:testschemaapi s:shard1 r:core_node1 x:testschemaapi_shard1_replica1] o.a.s.h.l.XMLLoader xsltCacheLifetimeSeconds=60
    [junit4] 2> 1620424 INFO (qtp551392316-8241) [n:127.0.0.1:33751_solr c:testschemaapi s:shard1 r:core_node2 x:testschemaapi_shard1_replica2] o.a.s.h.l.XMLLoader xsltCacheLifetimeSeconds=60
    [junit4] 2> 1620424 INFO (qtp906200120-8246) [n:127.0.0.1:36988_solr c:testschemaapi s:shard1 r:core_node1 x:testschemaapi_shard1_replica1] o.a.s.h.l.XMLLoader xsltCacheLifetimeSeconds=60
    [junit4] 2> 1620425 INFO (qtp551392316-8241) [n:127.0.0.1:33751_solr c:testschemaapi s:shard1 r:core_node2 x:testschemaapi_shard1_replica2] o.a.s.c.RequestHandlers Registered paths: /update,/admin/logging,/config,/replication,/admin/segments,/update/json,/admin/properties,/admin/plugins,/update/csv,/admin/system,/schema,/get,/admin/mbeans,/admin/file,/admin/threads,/update/json/docs,/admin/luke,/select,/admin/ping
    [junit4] 2> 1620425 INFO (qtp906200120-8246) [n:127.0.0.1:36988_solr c:testschemaapi s:shard1 r:core_node1 x:testschemaapi_shard1_replica1] o.a.s.c.RequestHandlers Registered paths: /update,/admin/logging,/config,/replication,/admin/segments,/update/json,/admin/properties,/admin/plugins,/update/csv,/admin/system,/schema,/get,/admin/mbeans,/admin/file,/admin/threads,/update/json/docs,/admin/luke,/select,/admin/ping
    [junit4] 2> 1620425 INFO (qtp551392316-8241) [n:127.0.0.1:33751_solr c:testschemaapi s:shard1 r:core_node2 x:testschemaapi_shard1_replica2] o.a.s.c.SolrCore Using default statsCache cache: org.apache.solr.search.stats.LocalStatsCache
    [junit4] 2> 1620425 INFO (qtp906200120-8246) [n:127.0.0.1:36988_solr c:testschemaapi s:shard1 r:core_node1 x:testschemaapi_shard1_replica1] o.a.s.c.SolrCore Using default statsCache cache: org.apache.solr.search.stats.LocalStatsCache
    [junit4] 2> 1620426 INFO (qtp551392316-8241) [n:127.0.0.1:33751_solr c:testschemaapi s:shard1 r:core_node2 x:testschemaapi_shard1_replica2] o.a.s.u.UpdateHandler Using UpdateLog implementation: org.apache.solr.update.UpdateLog
    [junit4] 2> 1620426 INFO (qtp906200120-8246) [n:127.0.0.1:36988_solr c:testschemaapi s:shard1 r:core_node1 x:testschemaapi_shard1_replica1] o.a.s.u.UpdateHandler Using UpdateLog implementation: org.apache.solr.update.UpdateLog
    [junit4] 2> 1620426 INFO (qtp551392316-8241) [n:127.0.0.1:33751_solr c:testschemaapi s:shard1 r:core_node2 x:testschemaapi_shard1_replica2] o.a.s.u.UpdateLog Initializing UpdateLog: dataDir=null defaultSyncLevel=FLUSH numRecordsToKeep=100 maxNumLogsToKeep=10 numVersionBuckets=65536
    [junit4] 2> 1620426 INFO (qtp906200120-8246) [n:127.0.0.1:36988_solr c:testschemaapi s:shard1 r:core_node1 x:testschemaapi_shard1_replica1] o.a.s.u.UpdateLog Initializing UpdateLog: dataDir=null defaultSyncLevel=FLUSH numRecordsToKeep=100 maxNumLogsToKeep=10 numVersionBuckets=65536
    [junit4] 2> 1620427 INFO (qtp551392316-8241) [n:127.0.0.1:33751_solr c:testschemaapi s:shard1 r:core_node2 x:testschemaapi_shard1_replica2] o.a.s.u.CommitTracker Hard AutoCommit: disabled
    [junit4] 2> 1620427 INFO (qtp906200120-8246) [n:127.0.0.1:36988_solr c:testschemaapi s:shard1 r:core_node1 x:testschemaapi_shard1_replica1] o.a.s.u.CommitTracker Hard AutoCommit: disabled
    [junit4] 2> 1620427 INFO (qtp551392316-8241) [n:127.0.0.1:33751_solr c:testschemaapi s:shard1 r:core_node2 x:testschemaapi_shard1_replica2] o.a.s.u.CommitTracker Soft AutoCommit: disabled
    [junit4] 2> 1620427 INFO (qtp906200120-8246) [n:127.0.0.1:36988_solr c:testschemaapi s:shard1 r:core_node1 x:testschemaapi_shard1_replica1] o.a.s.u.CommitTracker Soft AutoCommit: disabled
    [junit4] 2> 1620427 INFO (qtp551392316-8241) [n:127.0.0.1:33751_solr c:testschemaapi s:shard1 r:core_node2 x:testschemaapi_shard1_replica2] o.a.s.c.SolrDeletionPolicy SolrDeletionPolicy.onInit: commits: num=1
    [junit4] 2> commit{dir=MockDirectoryWrapper(RAMDirectory@7ae4e2e1 lockFactory=org.apache.lucene.store.SingleInstanceLockFactory@48eb60cf),segFN=segments_1,generation=1}
    [junit4] 2> 1620427 INFO (qtp906200120-8246) [n:127.0.0.1:36988_solr c:testschemaapi s:shard1 r:core_node1 x:testschemaapi_shard1_replica1] o.a.s.c.SolrDeletionPolicy SolrDeletionPolicy.onInit: commits: num=1
    [junit4] 2> commit{dir=MockDirectoryWrapper(RAMDirectory@624851f8 lockFactory=org.apache.lucene.store.SingleInstanceLockFactory@79fda330),segFN=segments_1,generation=1}
    [junit4] 2> 1620428 INFO (qtp906200120-8246) [n:127.0.0.1:36988_solr c:testschemaapi s:shard1 r:core_node1 x:testschemaapi_shard1_replica1] o.a.s.c.SolrDeletionPolicy newest commit generation = 1
    [junit4] 2> 1620427 INFO (qtp551392316-8241) [n:127.0.0.1:33751_solr c:testschemaapi s:shard1 r:core_node2 x:testschemaapi_shard1_replica2] o.a.s.c.SolrDeletionPolicy newest commit generation = 1
    [junit4] 2> 1620428 INFO (qtp906200120-8246) [n:127.0.0.1:36988_solr c:testschemaapi s:shard1 r:core_node1 x:testschemaapi_shard1_replica1] o.a.s.s.SolrIndexSearcher Opening Searcher@3f963edc[testschemaapi_shard1_replica1] main
    [junit4] 2> 1620428 INFO (qtp551392316-8241) [n:127.0.0.1:33751_solr c:testschemaapi s:shard1 r:core_node2 x:testschemaapi_shard1_replica2] o.a.s.s.SolrIndexSearcher Opening Searcher@20f8fe21[testschemaapi_shard1_replica2] main
    [junit4] 2> 1620428 INFO (qtp906200120-8246) [n:127.0.0.1:36988_solr c:testschemaapi s:shard1 r:core_node1 x:testschemaapi_shard1_replica1] o.a.s.c.c.ZkStateReader Load collection config from: [/collections/testschemaapi]
    [junit4] 2> 1620428 INFO (qtp551392316-8241) [n:127.0.0.1:33751_solr c:testschemaapi s:shard1 r:core_node2 x:testschemaapi_shard1_replica2] o.a.s.c.c.ZkStateReader Load collection config from: [/collections/testschemaapi]
    [junit4] 2> 1620428 INFO (qtp906200120-8246) [n:127.0.0.1:36988_solr c:testschemaapi s:shard1 r:core_node1 x:testschemaapi_shard1_replica1] o.a.s.c.c.ZkStateReader path=[/collections/testschemaapi] [configName]=[conf1] specified config exists in ZooKeeper
    [junit4] 2> 1620428 INFO (qtp551392316-8241) [n:127.0.0.1:33751_solr c:testschemaapi s:shard1 r:core_node2 x:testschemaapi_shard1_replica2] o.a.s.c.c.ZkStateReader path=[/collections/testschemaapi] [configName]=[conf1] specified config exists in ZooKeeper
    [junit4] 2> 1620428 INFO (qtp906200120-8246) [n:127.0.0.1:36988_solr c:testschemaapi s:shard1 r:core_node1 x:testschemaapi_shard1_replica1] o.a.s.r.ManagedResourceStorage Setting up ZooKeeper-based storage for the RestManager with znodeBase: /configs/conf1
    [junit4] 2> 1620428 INFO (qtp551392316-8241) [n:127.0.0.1:33751_solr c:testschemaapi s:shard1 r:core_node2 x:testschemaapi_shard1_replica2] o.a.s.r.ManagedResourceStorage Setting up ZooKeeper-based storage for the RestManager with znodeBase: /configs/conf1
    [junit4] 2> 1620428 INFO (qtp906200120-8246) [n:127.0.0.1:36988_solr c:testschemaapi s:shard1 r:core_node1 x:testschemaapi_shard1_replica1] o.a.s.r.ManagedResourceStorage Configured ZooKeeperStorageIO with znodeBase: /configs/conf1
    [junit4] 2> 1620429 INFO (qtp906200120-8246) [n:127.0.0.1:36988_solr c:testschemaapi s:shard1 r:core_node1 x:testschemaapi_shard1_replica1] o.a.s.r.RestManager Initializing RestManager with initArgs: {}
    [junit4] 2> 1620429 INFO (qtp551392316-8241) [n:127.0.0.1:33751_solr c:testschemaapi s:shard1 r:core_node2 x:testschemaapi_shard1_replica2] o.a.s.r.ManagedResourceStorage Configured ZooKeeperStorageIO with znodeBase: /configs/conf1
    [junit4] 2> 1620429 INFO (qtp906200120-8246) [n:127.0.0.1:36988_solr c:testschemaapi s:shard1 r:core_node1 x:testschemaapi_shard1_replica1] o.a.s.r.ManagedResourceStorage Reading _rest_managed.json using ZooKeeperStorageIO:path=/configs/conf1
    [junit4] 2> 1620429 INFO (qtp551392316-8241) [n:127.0.0.1:33751_solr c:testschemaapi s:shard1 r:core_node2 x:testschemaapi_shard1_replica2] o.a.s.r.RestManager Initializing RestManager with initArgs: {}
    [junit4] 2> 1620429 INFO (qtp551392316-8241) [n:127.0.0.1:33751_solr c:testschemaapi s:shard1 r:core_node2 x:testschemaapi_shard1_replica2] o.a.s.r.ManagedResourceStorage Reading _rest_managed.json using ZooKeeperStorageIO:path=/configs/conf1
    [junit4] 2> 1620429 INFO (qtp906200120-8246) [n:127.0.0.1:36988_solr c:testschemaapi s:shard1 r:core_node1 x:testschemaapi_shard1_replica1] o.a.s.r.ManagedResourceStorage No data found for znode /configs/conf1/_rest_managed.json
    [junit4] 2> 1620429 INFO (qtp906200120-8246) [n:127.0.0.1:36988_solr c:testschemaapi s:shard1 r:core_node1 x:testschemaapi_shard1_replica1] o.a.s.r.ManagedResourceStorage Loaded null at path _rest_managed.json using ZooKeeperStorageIO:path=/configs/conf1
    [junit4] 2> 1620429 INFO (qtp551392316-8241) [n:127.0.0.1:33751_solr c:testschemaapi s:shard1 r:core_node2 x:testschemaapi_shard1_replica2] o.a.s.r.ManagedResourceStorage No data found for znode /configs/conf1/_rest_managed.json
    [junit4] 2> 1620429 INFO (qtp906200120-8246) [n:127.0.0.1:36988_solr c:testschemaapi s:shard1 r:core_node1 x:testschemaapi_shard1_replica1] o.a.s.r.RestManager Initializing 0 registered ManagedResources
    [junit4] 2> 1620429 INFO (qtp551392316-8241) [n:127.0.0.1:33751_solr c:testschemaapi s:shard1 r:core_node2 x:testschemaapi_shard1_replica2] o.a.s.r.ManagedResourceStorage Loaded null at path _rest_managed.json using ZooKeeperStorageIO:path=/configs/conf1
    [junit4] 2> 1620429 INFO (qtp906200120-8246) [n:127.0.0.1:36988_solr c:testschemaapi s:shard1 r:core_node1 x:testschemaapi_shard1_replica1] o.a.s.s.ZkIndexSchemaReader Creating ZooKeeper watch for the managed schema at /configs/conf1/managed-schema
    [junit4] 2> 1620429 INFO (qtp551392316-8241) [n:127.0.0.1:33751_solr c:testschemaapi s:shard1 r:core_node2 x:testschemaapi_shard1_replica2] o.a.s.r.RestManager Initializing 0 registered ManagedResources
    [junit4] 2> 1620429 INFO (qtp551392316-8241) [n:127.0.0.1:33751_solr c:testschemaapi s:shard1 r:core_node2 x:testschemaapi_shard1_replica2] o.a.s.s.ZkIndexSchemaReader Creating ZooKeeper watch for the managed schema at /configs/conf1/managed-schema
    [junit4] 2> 1620429 INFO (qtp906200120-8246) [n:127.0.0.1:36988_solr c:testschemaapi s:shard1 r:core_node1 x:testschemaapi_shard1_replica1] o.a.s.c.ZkController Added new OnReconnect listener ZkIndexSchemaReader: /configs/conf1/managed-schema, uniqueCoreId: testschemaapi_shard1_replica1:305988190626891
    [junit4] 2> 1620429 INFO (qtp906200120-8246) [n:127.0.0.1:36988_solr c:testschemaapi s:shard1 r:core_node1 x:testschemaapi_shard1_replica1] o.a.s.h.ReplicationHandler Commits will be reserved for 10000
    [junit4] 2> 1620429 INFO (qtp551392316-8241) [n:127.0.0.1:33751_solr c:testschemaapi s:shard1 r:core_node2 x:testschemaapi_shard1_replica2] o.a.s.c.ZkController Added new OnReconnect listener ZkIndexSchemaReader: /configs/conf1/managed-schema, uniqueCoreId: testschemaapi_shard1_replica2:305988190573170
    [junit4] 2> 1620429 INFO (searcherExecutor-3311-thread-1-processing-n:127.0.0.1:36988_solr x:testschemaapi_shard1_replica1 r:core_node1 s:shard1 c:testschemaapi) [n:127.0.0.1:36988_solr c:testschemaapi s:shard1 r:core_node1 x:testschemaapi_shard1_replica1] o.a.s.c.SolrCore [testschemaapi_shard1_replica1] Registered new searcher Searcher@3f963edc[testschemaapi_shard1_replica1] main{ExitableDirectoryReader(UninvertingDirectoryReader())}
    [junit4] 2> 1620429 INFO (qtp551392316-8241) [n:127.0.0.1:33751_solr c:testschemaapi s:shard1 r:core_node2 x:testschemaapi_shard1_replica2] o.a.s.h.ReplicationHandler Commits will be reserved for 10000
    [junit4] 2> 1620429 INFO (qtp906200120-8246) [n:127.0.0.1:36988_solr c:testschemaapi s:shard1 r:core_node1 x:testschemaapi_shard1_replica1] o.a.s.u.UpdateLog Looking up max value of version field to seed version buckets
    [junit4] 2> 1620429 INFO (qtp551392316-8241) [n:127.0.0.1:33751_solr c:testschemaapi s:shard1 r:core_node2 x:testschemaapi_shard1_replica2] o.a.s.u.UpdateLog Looking up max value of version field to seed version buckets
    [junit4] 2> 1620429 INFO (qtp906200120-8246) [n:127.0.0.1:36988_solr c:testschemaapi s:shard1 r:core_node1 x:testschemaapi_shard1_replica1] o.a.s.u.VersionInfo Refreshing highest value of _version_ for 65536 version buckets from index
    [junit4] 2> 1620429 INFO (qtp551392316-8241) [n:127.0.0.1:33751_solr c:testschemaapi s:shard1 r:core_node2 x:testschemaapi_shard1_replica2] o.a.s.u.VersionInfo Refreshing highest value of _version_ for 65536 version buckets from index
    [junit4] 2> 1620430 INFO (qtp906200120-8246) [n:127.0.0.1:36988_solr c:testschemaapi s:shard1 r:core_node1 x:testschemaapi_shard1_replica1] o.a.s.u.VersionInfo No terms found for _version_, cannot seed version bucket highest value from index
    [junit4] 2> 1620430 INFO (qtp551392316-8241) [n:127.0.0.1:33751_solr c:testschemaapi s:shard1 r:core_node2 x:testschemaapi_shard1_replica2] o.a.s.u.VersionInfo No terms found for _version_, cannot seed version bucket highest value from index
    [junit4] 2> 1620430 INFO (qtp906200120-8246) [n:127.0.0.1:36988_solr c:testschemaapi s:shard1 r:core_node1 x:testschemaapi_shard1_replica1] o.a.s.u.UpdateLog Could not find max version in index or recent updates, using new clock 1537290269008855040
    [junit4] 2> 1620430 INFO (qtp551392316-8241) [n:127.0.0.1:33751_solr c:testschemaapi s:shard1 r:core_node2 x:testschemaapi_shard1_replica2] o.a.s.u.UpdateLog Could not find max version in index or recent updates, using new clock 1537290269008855040
    [junit4] 2> 1620429 INFO (searcherExecutor-3310-thread-1-processing-n:127.0.0.1:33751_solr x:testschemaapi_shard1_replica2 r:core_node2 s:shard1 c:testschemaapi) [n:127.0.0.1:33751_solr c:testschemaapi s:shard1 r:core_node2 x:testschemaapi_shard1_replica2] o.a.s.c.SolrCore [testschemaapi_shard1_replica2] Registered new searcher Searcher@20f8fe21[testschemaapi_shard1_replica2] main{ExitableDirectoryReader(UninvertingDirectoryReader())}
    [junit4] 2> 1620431 INFO (qtp906200120-8246) [n:127.0.0.1:36988_solr c:testschemaapi s:shard1 r:core_node1 x:testschemaapi_shard1_replica1] o.a.s.u.UpdateLog Took 2.0ms to seed version buckets with highest version 1537290269008855040
    [junit4] 2> 1620431 INFO (qtp551392316-8241) [n:127.0.0.1:33751_solr c:testschemaapi s:shard1 r:core_node2 x:testschemaapi_shard1_replica2] o.a.s.u.UpdateLog Took 1.0ms to seed version buckets with highest version 1537290269008855040
    [junit4] 2> 1620432 INFO (qtp906200120-8246) [n:127.0.0.1:36988_solr c:testschemaapi s:shard1 r:core_node1 x:testschemaapi_shard1_replica1] o.a.s.c.ZkController watch zkdir /configs/conf1
    [junit4] 2> 1620432 INFO (qtp551392316-8241) [n:127.0.0.1:33751_solr c:testschemaapi s:shard1 r:core_node2 x:testschemaapi_shard1_replica2] o.a.s.c.ZkController watch zkdir /configs/conf1
    [junit4] 2> 1620432 INFO (qtp906200120-8246) [n:127.0.0.1:36988_solr c:testschemaapi s:shard1 r:core_node1 x:testschemaapi_shard1_replica1] o.a.s.c.CoreContainer registering core: testschemaapi_shard1_replica1
    [junit4] 2> 1620432 INFO (qtp551392316-8241) [n:127.0.0.1:33751_solr c:testschemaapi s:shard1 r:core_node2 x:testschemaapi_shard1_replica2] o.a.s.c.CoreContainer registering core: testschemaapi_shard1_replica2
    [junit4] 2> 1620432 INFO (qtp906200120-8246) [n:127.0.0.1:36988_solr c:testschemaapi s:shard1 r:core_node1 x:testschemaapi_shard1_replica1] o.a.s.c.ZkController Register replica - core:testschemaapi_shard1_replica1 address:http://127.0.0.1:36988/solr collection:testschemaapi shard:shard1
    [junit4] 2> 1620432 INFO (qtp551392316-8241) [n:127.0.0.1:33751_solr c:testschemaapi s:shard1 r:core_node2 x:testschemaapi_shard1_replica2] o.a.s.c.ZkController Register replica - core:testschemaapi_shard1_replica2 address:http://127.0.0.1:33751/solr collection:testschemaapi shard:shard1
    [junit4] 2> 1620432 INFO (qtp906200120-8246) [n:127.0.0.1:36988_solr c:testschemaapi s:shard1 r:core_node1 x:testschemaapi_shard1_replica1] o.a.s.c.c.SolrZkClient makePath: /collections/testschemaapi/leader_elect/shard1/election
    [junit4] 2> 1620432 INFO (qtp551392316-8241) [n:127.0.0.1:33751_solr c:testschemaapi s:shard1 r:core_node2 x:testschemaapi_shard1_replica2] o.a.s.c.c.SolrZkClient makePath: /collections/testschemaapi/leader_elect/shard1/election
    [junit4] 2> 1620434 INFO (qtp551392316-8241) [n:127.0.0.1:33751_solr c:testschemaapi s:shard1 r:core_node2 x:testschemaapi_shard1_replica2] o.a.s.c.LeaderElector Joined leadership election with path: /collections/testschemaapi/leader_elect/shard1/election/96080641726021636-core_node2-n_0000000000
    [junit4] 2> 1620434 INFO (qtp906200120-8246) [n:127.0.0.1:36988_solr c:testschemaapi s:shard1 r:core_node1 x:testschemaapi_shard1_replica1] o.a.s.c.LeaderElector Joined leadership election with path: /collections/testschemaapi/leader_elect/shard1/election/96080641726021638-core_node1-n_0000000001
    [junit4] 2> 1620434 INFO (qtp551392316-8241) [n:127.0.0.1:33751_solr c:testschemaapi s:shard1 r:core_node2 x:testschemaapi_shard1_replica2] o.a.s.c.ShardLeaderElectionContext Running the leader process for shard=shard1 and weAreReplacement=false and leaderVoteWait=10000
    [junit4] 2> 1620434 INFO (qtp906200120-8246) [n:127.0.0.1:36988_solr c:testschemaapi s:shard1 r:core_node1 x:testschemaapi_shard1_replica1] o.a.s.c.LeaderElector Watching path /collections/testschemaapi/leader_elect/shard1/election/96080641726021636-core_node2-n_0000000000 to know if I could be the leader
    [junit4] 2> 1620435 INFO (qtp551392316-8241) [n:127.0.0.1:33751_solr c:testschemaapi s:shard1 r:core_node2 x:testschemaapi_shard1_replica2] o.a.s.c.ShardLeaderElectionContext Enough replicas found to continue.
    [junit4] 2> 1620435 INFO (qtp551392316-8241) [n:127.0.0.1:33751_solr c:testschemaapi s:shard1 r:core_node2 x:testschemaapi_shard1_replica2] o.a.s.c.ShardLeaderElectionContext I may be the new leader - try and sync
    [junit4] 2> 1620435 INFO (qtp551392316-8241) [n:127.0.0.1:33751_solr c:testschemaapi s:shard1 r:core_node2 x:testschemaapi_shard1_replica2] o.a.s.c.SyncStrategy Sync replicas to http://127.0.0.1:33751/solr/testschemaapi_shard1_replica2/
    [junit4] 2> 1620435 INFO (qtp551392316-8241) [n:127.0.0.1:33751_solr c:testschemaapi s:shard1 r:core_node2 x:testschemaapi_shard1_replica2] o.a.s.u.PeerSync PeerSync: core=testschemaapi_shard1_replica2 url=http://127.0.0.1:33751/solr START replicas=[http://127.0.0.1:36988/solr/testschemaapi_shard1_replica1/] nUpdates=100
    [junit4] 2> 1620435 INFO (OverseerStateUpdate-96080641726021636-127.0.0.1:33751_solr-n_0000000000) [n:127.0.0.1:33751_solr ] o.a.s.c.Overseer processMessage: queueSize: 1, message = {
    [junit4] 2> "operation":"leader",
    [junit4] 2> "shard":"shard1",
    [junit4] 2> "collection":"testschemaapi"} current state version: 0
    [junit4] 2> 1620435 INFO (qtp551392316-8241) [n:127.0.0.1:33751_solr c:testschemaapi s:shard1 r:core_node2 x:testschemaapi_shard1_replica2] o.a.s.u.PeerSync PeerSync: core=testschemaapi_shard1_replica2 url=http://127.0.0.1:33751/solr DONE. We have no versions. sync failed.
    [junit4] 2> 1620435 INFO (qtp551392316-8241) [n:127.0.0.1:33751_solr c:testschemaapi s:shard1 r:core_node2 x:testschemaapi_shard1_replica2] o.a.s.c.SyncStrategy Leader's attempt to sync with shard failed, moving to the next candidate
    [junit4] 2> 1620435 INFO (qtp551392316-8241) [n:127.0.0.1:33751_solr c:testschemaapi s:shard1 r:core_node2 x:testschemaapi_shard1_replica2] o.a.s.c.ShardLeaderElectionContext We failed sync, but we have no versions - we can't sync in that case - we were active before, so become leader anyway
    [junit4] 2> 1620436 INFO (qtp551392316-8241) [n:127.0.0.1:33751_solr c:testschemaapi s:shard1 r:core_node2 x:testschemaapi_shard1_replica2] o.a.s.c.c.SolrZkClient makePath: /collections/testschemaapi/leaders/shard1
    [junit4] 2> 1620437 INFO (qtp906200120-8247) [n:127.0.0.1:36988_solr c:testschemaapi s:shard1 r:core_node1 x:testschemaapi_shard1_replica1] o.a.s.c.S.Request [testschemaapi_shard1_replica1] webapp=/solr path=/get params={distrib=false&version=2&wt=javabin&fingerprint=false&getVersions=100&qt=/get} status=0 QTime=0
    [junit4] 2> 1620437 INFO (qtp551392316-8241) [n:127.0.0.1:33751_solr c:testschemaapi s:shard1 r:core_node2 x:testschemaapi_shard1_replica2] o.a.s.c.ShardLeaderElectionContextBase Creating leader registration node /collections/testschemaapi/leaders/shard1/leader after winning as /collections/testschemaapi/leader_elect/shard1/election/96080641726021636-core_node2-n_0000000000
    [junit4] 2> 1620438 INFO (qtp551392316-8241) [n:127.0.0.1:33751_solr c:testschemaapi s:shard1 r:core_node2 x:testschemaapi_shard1_replica2] o.a.s.c.ShardLeaderElectionContext I am the new leader: http://127.0.0.1:33751/solr/testschemaapi_shard1_replica2/ shard1
    [junit4] 2> 1620438 INFO (OverseerStateUpdate-96080641726021636-127.0.0.1:33751_solr-n_0000000000) [n:127.0.0.1:33751_solr ] o.a.s.c.Overseer processMessage: queueSize: 1, message = {
    [junit4] 2> "operation":"leader",
    [junit4] 2> "shard":"shard1",
    [junit4] 2> "collection":"testschemaapi",
    [junit4] 2> "base_url":"http://127.0.0.1:33751/solr",
    [junit4] 2> "core":"testschemaapi_shard1_replica2",
    [junit4] 2> "state":"active"} current state version: 0
    [junit4] 2> 1620540 INFO (OverseerStateUpdate-96080641726021636-127.0.0.1:33751_solr-n_0000000000) [n:127.0.0.1:33751_solr ] o.a.s.c.o.ZkStateWriter going to update_collection /collections/testschemaapi/state.json version: 1
    [junit4] 2> 1620540 INFO (zkCallback-1200-thread-2-processing-n:127.0.0.1:33751_solr) [n:127.0.0.1:33751_solr ] o.a.s.c.c.ZkStateReader A cluster state change: [WatchedEvent state:SyncConnected type:NodeDataChanged path:/collections/testschemaapi/state.json] for collection [testschemaapi] has occurred - updating... (live nodes size: [2])
    [junit4] 2> 1620540 INFO (zkCallback-1204-thread-1-processing-n:127.0.0.1:36988_solr) [n:127.0.0.1:36988_solr ] o.a.s.c.c.ZkStateReader A cluster state change: [WatchedEvent state:SyncConnected type:NodeDataChanged path:/collections/testschemaapi/state.json] for collection [testschemaapi] has occurred - updating... (live nodes size: [2])
    [junit4] 2> 1620540 INFO (zkCallback-1200-thread-2-processing-n:127.0.0.1:33751_solr) [n:127.0.0.1:33751_solr ] o.a.s.c.c.ZkStateReader Updating data for [testschemaapi] from [1] to [2]
    [junit4] 2> 1620540 INFO (zkCallback-1204-thread-1-processing-n:127.0.0.1:36988_solr) [n:127.0.0.1:36988_solr ] o.a.s.c.c.ZkStateReader Updating data for [testschemaapi] from [1] to [2]
    [junit4] 2> 1620588 INFO (qtp551392316-8241) [n:127.0.0.1:33751_solr c:testschemaapi s:shard1 r:core_node2 x:testschemaapi_shard1_replica2] o.a.s.c.ZkController We are http://127.0.0.1:33751/solr/testschemaapi_shard1_replica2/ and leader is http://127.0.0.1:33751/solr/testschemaapi_shard1_replica2/
    [junit4] 2> 1620588 INFO (qtp551392316-8241) [n:127.0.0.1:33751_solr c:testschemaapi s:shard1 r:core_node2 x:testschemaapi_shard1_replica2] o.a.s.c.ZkController No LogReplay needed for core=testschemaapi_shard1_replica2 baseURL=http://127.0.0.1:33751/solr
    [junit4] 2> 1620588 INFO (qtp551392316-8241) [n:127.0.0.1:33751_solr c:testschemaapi s:shard1 r:core_node2 x:testschemaapi_shard1_replica2] o.a.s.c.ZkController I am the leader, no recovery necessary
    [junit4] 2> 1620588 INFO (qtp551392316-8241) [n:127.0.0.1:33751_solr c:testschemaapi s:shard1 r:core_node2 x:testschemaapi_shard1_replica2] o.a.s.c.ZkController publishing state=active
    [junit4] 2> 1620590 INFO (OverseerStateUpdate-96080641726021636-127.0.0.1:33751_solr-n_0000000000) [n:127.0.0.1:33751_solr ] o.a.s.c.Overseer processMessage: queueSize: 1, message = {
    [junit4] 2> "node_name":"127.0.0.1:33751_solr",
    [junit4] 2> "numShards":"1",
    [junit4] 2> "core":"testschemaapi_shard1_replica2",
    [junit4] 2> "roles":null,
    [junit4] 2> "operation":"state",
    [junit4] 2> "core_node_name":"core_node2",
    [junit4] 2> "shard":"shard1",
    [junit4] 2> "base_url":"http://127.0.0.1:33751/solr",
    [junit4] 2> "state":"active",
    [junit4] 2> "collection":"testschemaapi"} current state version: 0
    [junit4] 2> 1620590 INFO (OverseerStateUpdate-96080641726021636-127.0.0.1:33751_solr-n_0000000000) [n:127.0.0.1:33751_solr ] o.a.s.c.o.ReplicaMutator Update state numShards=1 message={
    [junit4] 2> "node_name":"127.0.0.1:33751_solr",
    [junit4] 2> "numShards":"1",
    [junit4] 2> "core":"testschemaapi_shard1_replica2",
    [junit4] 2> "roles":null,
    [junit4] 2> "operation":"state",
    [junit4] 2> "core_node_name":"core_node2",
    [junit4] 2> "shard":"shard1",
    [junit4] 2> "base_url":"http://127.0.0.1:33751/solr",
    [junit4] 2> "state":"active",
    [junit4] 2> "collection":"testschemaapi"}
    [junit4] 2> 1620590 INFO (qtp551392316-8241) [n:127.0.0.1:33751_solr c:testschemaapi s:shard1 r:core_node2 x:testschemaapi_shard1_replica2] o.a.s.s.HttpSolrCall [admin] webapp=null path=/admin/cores params={collection.configName=conf1&version=2&wt=javabin&numShards=1&name=testschemaapi_shard1_replica2&shard=shard1&collection=testschemaapi&action=CREATE&qt=/admin/cores} status=0 QTime=1210
    [junit4] 2> 1620691 INFO (OverseerStateUpdate-96080641726021636-127.0.0.1:33751_solr-n_0000000000) [n:127.0.0.1:33751_solr ] o.a.s.c.o.ZkStateWriter going to update_collection /collections/testschemaapi/state.json version: 2
    [junit4] 2> 1620692 INFO (zkCallback-1204-thread-1-processing-n:127.0.0.1:36988_solr) [n:127.0.0.1:36988_solr ] o.a.s.c.c.ZkStateReader A cluster state change: [WatchedEvent state:SyncConnected type:NodeDataChanged path:/collections/testschemaapi/state.json] for collection [testschemaapi] has occurred - updating... (live nodes size: [2])
    [junit4] 2> 1620692 INFO (zkCallback-1200-thread-1-processing-n:127.0.0.1:33751_solr) [n:127.0.0.1:33751_solr ] o.a.s.c.c.ZkStateReader A cluster state change: [WatchedEvent state:SyncConnected type:NodeDataChanged path:/collections/testschemaapi/state.json] for collection [testschemaapi] has occurred - updating... (live nodes size: [2])
    [junit4] 2> 1620692 INFO (zkCallback-1204-thread-1-processing-n:127.0.0.1:36988_solr) [n:127.0.0.1:36988_solr ] o.a.s.c.c.ZkStateReader Updating data for [testschemaapi] from [2] to [3]
    [junit4] 2> 1620692 INFO (zkCallback-1200-thread-1-processing-n:127.0.0.1:33751_solr) [n:127.0.0.1:33751_solr ] o.a.s.c.c.ZkStateReader Updating data for [testschemaapi] from [2] to [3]
    [junit4] 2> 1621435 INFO (qtp906200120-8246) [n:127.0.0.1:36988_solr c:testschemaapi s:shard1 r:core_node1 x:testschemaapi_shard1_replica1] o.a.s.c.ZkController We are http://127.0.0.1:36988/solr/testschemaapi_shard1_replica1/ and leader is http://127.0.0.1:33751/solr/testschemaapi_shard1_replica2/
    [junit4] 2> 1621435 INFO (qtp906200120-8246) [n:127.0.0.1:36988_solr c:testschemaapi s:shard1 r:core_node1 x:testschemaapi_shard1_replica1] o.a.s.c.ZkController No LogReplay needed for core=testschemaapi_shard1_replica1 baseURL=http://127.0.0.1:36988/solr
    [junit4] 2> 1621435 INFO (qtp906200120-8246) [n:127.0.0.1:36988_solr c:testschemaapi s:shard1 r:core_node1 x:testschemaapi_shard1_replica1] o.a.s.c.ZkController Core needs to recover:testschemaapi_shard1_replica1
    [junit4] 2> 1621435 INFO (updateExecutor-1201-thread-1-processing-n:127.0.0.1:36988_solr x:testschemaapi_shard1_replica1 r:core_node1 s:shard1 c:testschemaapi) [n:127.0.0.1:36988_solr c:testschemaapi s:shard1 r:core_node1 x:testschemaapi_shard1_replica1] o.a.s.u.DefaultSolrCoreState Running recovery
    [junit4] 2> 1621436 INFO (recoveryExecutor-1202-thread-1-processing-n:127.0.0.1:36988_solr x:testschemaapi_shard1_replica1 r:core_node1 s:shard1 c:testschemaapi) [n:127.0.0.1:36988_solr c:testschemaapi s:shard1 r:core_node1 x:testschemaapi_shard1_replica1] o.a.s.c.RecoveryStrategy Starting recovery process. recoveringAfterStartup=true
    [junit4] 2> 1621436 INFO (recoveryExecutor-1202-thread-1-processing-n:127.0.0.1:36988_solr x:testschemaapi_shard1_replica1 r:core_node1 s:shard1 c:testschemaapi) [n:127.0.0.1:36988_solr c:testschemaapi s:shard1 r:core_node1 x:testschemaapi_shard1_replica1] o.a.s.c.RecoveryStrategy ###### startupVersions=[[]]
    [junit4] 2> 1621436 INFO (recoveryExecutor-1202-thread-1-processing-n:127.0.0.1:36988_solr x:testschemaapi_shard1_replica1 r:core_node1 s:shard1 c:testschemaapi) [n:127.0.0.1:36988_solr c:testschemaapi s:s

[...truncated too long message...]

exSchema(IndexSchemaFactory.java:70)
    [junit4] 2> at org.apache.solr.core.ConfigSetService.createIndexSchema(ConfigSetService.java:108)
    [junit4] 2> at org.apache.solr.core.ConfigSetService.getConfig(ConfigSetService.java:79)
    [junit4] 2> ... 3 more
    [junit4] 2> Caused by: org.apache.zookeeper.KeeperException$SessionExpiredException: KeeperErrorCode = Session expired for /configs/conf1/managed-schema
    [junit4] 2> at org.apache.zookeeper.KeeperException.create(KeeperException.java:127)
    [junit4] 2> at org.apache.zookeeper.KeeperException.create(KeeperException.java:51)
    [junit4] 2> at org.apache.zookeeper.ZooKeeper.getData(ZooKeeper.java:1155)
    [junit4] 2> at org.apache.solr.common.cloud.SolrZkClient$7.execute(SolrZkClient.java:345)
    [junit4] 2> at org.apache.solr.common.cloud.SolrZkClient$7.execute(SolrZkClient.java:342)
    [junit4] 2> at org.apache.solr.common.cloud.ZkCmdExecutor.retryOperation(ZkCmdExecutor.java:60)
    [junit4] 2> at org.apache.solr.common.cloud.SolrZkClient.getData(SolrZkClient.java:342)
    [junit4] 2> at org.apache.solr.schema.ManagedIndexSchemaFactory.create(ManagedIndexSchemaFactory.java:128)
    [junit4] 2> ... 7 more
    [junit4] 2> 1632154 WARN (zkCallback-1200-thread-7-processing-n:127.0.0.1:33751_solr) [n:127.0.0.1:33751_solr ] o.a.s.c.c.ZkStateReader ZooKeeper watch triggered, but Solr cannot talk to ZK: [KeeperErrorCode = Session expired for /live_nodes]
    [junit4] 2> 1632155 INFO (jetty-launcher-1193-thread-1) [ ] o.e.j.s.h.ContextHandler Stopped o.e.j.s.ServletContextHandler@6cd941eb{/solr,null,UNAVAILABLE}
    [junit4] 2> 1632156 INFO (TEST-TestManagedSchemaAPI.test-seed#[FD031B74A0EC974]) [ ] o.a.s.c.ZkTestServer connecting to 127.0.0.1:46485 46485
    [junit4] 2> 1632274 INFO (Thread-2898) [ ] o.a.s.c.ZkTestServer connecting to 127.0.0.1:46485 46485
    [junit4] 2> 1632275 WARN (Thread-2898) [ ] o.a.s.c.ZkTestServer Watch limit violations:
    [junit4] 2> Maximum concurrent create/delete watches above limit:
    [junit4] 2>
    [junit4] 2> 6 /solr/configs/conf1/managed-schema
    [junit4] 2> 6 /solr/configs/conf1
    [junit4] 2> 3 /solr/aliases.json
    [junit4] 2> 2 /solr/security.json
    [junit4] 2>
    [junit4] 2> Maximum concurrent data watches above limit:
    [junit4] 2>
    [junit4] 2> 3 /solr/clusterstate.json
    [junit4] 2> 2 /solr/collections/testschemaapi/state.json
    [junit4] 2>
    [junit4] 2> Maximum concurrent children watches above limit:
    [junit4] 2>
    [junit4] 2> 9 /solr/overseer/queue
    [junit4] 2> 9 /solr/overseer/collection-queue-work
    [junit4] 2> 3 /solr/live_nodes
    [junit4] 2> 3 /solr/overseer/queue-work
    [junit4] 2> 3 /solr/collections
    [junit4] 2>
    [junit4] 2> 1632275 INFO (TEST-TestManagedSchemaAPI.test-seed#[FD031B74A0EC974]) [ ] o.a.s.SolrTestCaseJ4 ###Ending test
    [junit4] 2> NOTE: reproduce with: ant test -Dtestcase=TestManagedSchemaAPI -Dtests.method=test -Dtests.seed=FD031B74A0EC974 -Dtests.multiplier=3 -Dtests.slow=true -Dtests.locale=ar-IQ -Dtests.timezone=Africa/Malabo -Dtests.asserts=true -Dtests.file.encoding=UTF-8
    [junit4] ERROR 13.2s J2 | TestManagedSchemaAPI.test <<<
    [junit4] > Throwable #1: org.apache.solr.client.solrj.impl.CloudSolrClient$RouteException: Error from server at http://127.0.0.1:33751/solr/testschemaapi_shard1_replica2: ERROR: [doc=2] unknown field 'myNewField1'
    [junit4] > at __randomizedtesting.SeedInfo.seed([FD031B74A0EC974:87840E6DE4F2A48C]:0)
    [junit4] > at org.apache.solr.client.solrj.impl.CloudSolrClient.directUpdate(CloudSolrClient.java:632)
    [junit4] > at org.apache.solr.client.solrj.impl.CloudSolrClient.sendRequest(CloudSolrClient.java:981)
    [junit4] > at org.apache.solr.client.solrj.impl.CloudSolrClient.requestWithRetryOnStaleState(CloudSolrClient.java:870)
    [junit4] > at org.apache.solr.client.solrj.impl.CloudSolrClient.request(CloudSolrClient.java:806)
    [junit4] > at org.apache.solr.schema.TestManagedSchemaAPI.testAddFieldAndDocument(TestManagedSchemaAPI.java:101)
    [junit4] > at org.apache.solr.schema.TestManagedSchemaAPI.test(TestManagedSchemaAPI.java:69)
    [junit4] > at java.lang.Thread.run(Thread.java:745)
    [junit4] > Caused by: org.apache.solr.client.solrj.impl.HttpSolrClient$RemoteSolrException: Error from server at http://127.0.0.1:33751/solr/testschemaapi_shard1_replica2: ERROR: [doc=2] unknown field 'myNewField1'
    [junit4] > at org.apache.solr.client.solrj.impl.HttpSolrClient.executeMethod(HttpSolrClient.java:577)
    [junit4] > at org.apache.solr.client.solrj.impl.HttpSolrClient.request(HttpSolrClient.java:241)
    [junit4] > at org.apache.solr.client.solrj.impl.HttpSolrClient.request(HttpSolrClient.java:230)
    [junit4] > at org.apache.solr.client.solrj.impl.LBHttpSolrClient.doRequest(LBHttpSolrClient.java:372)
    [junit4] > at org.apache.solr.client.solrj.impl.LBHttpSolrClient.request(LBHttpSolrClient.java:325)
    [junit4] > at org.apache.solr.client.solrj.impl.CloudSolrClient$2.call(CloudSolrClient.java:607)
    [junit4] > at org.apache.solr.client.solrj.impl.CloudSolrClient$2.call(CloudSolrClient.java:604)
    [junit4] > at java.util.concurrent.FutureTask.run(FutureTask.java:262)
    [junit4] > at org.apache.solr.common.util.ExecutorUtil$MDCAwareThreadPoolExecutor$1.run(ExecutorUtil.java:231)
    [junit4] > at java.util.concurrent.ThreadPoolExecutor.runWorker(ThreadPoolExecutor.java:1145)
    [junit4] > at java.util.concurrent.ThreadPoolExecutor$Worker.run(ThreadPoolExecutor.java:615)
    [junit4] > ... 1 more
    [junit4] 2> 1632277 INFO (SUITE-TestManagedSchemaAPI-seed#[FD031B74A0EC974]-worker) [ ] o.a.s.SolrTestCaseJ4 ###deleteCore
    [junit4] 2> NOTE: leaving temporary files on disk at: /home/jenkins/workspace/Lucene-Solr-5.5-Linux/solr/build/solr-core/test/J2/temp/solr.schema.TestManagedSchemaAPI_FD031B74A0EC974-001
    [junit4] 2> Jun 16, 2016 10:50:58 AM com.carrotsearch.randomizedtesting.ThreadLeakControl checkThreadLeaks
    [junit4] 2> WARNING: Will linger awaiting termination of 1 leaked thread(s).
    [junit4] 2> NOTE: test params are: codec=Lucene54, sim=DefaultSimilarity, locale=ar-IQ, timezone=Africa/Malabo
    [junit4] 2> NOTE: Linux 4.4.0-24-generic amd64/Oracle Corporation 1.7.0_80 (64-bit)/cpus=12,threads=1,free=200930248,total=507641856
    [junit4] 2> NOTE: All tests run in this JVM: [HttpPartitionTest, DistribCursorPagingTest, UpdateParamsTest, DistributedFacetPivotSmallTest, TestIndexSearcher, TestDistributedStatsComponentCardinality, TestSolrDeletionPolicy1, FullSolrCloudDistribCmdsTest, TestFieldCollectionResource, TestNamedUpdateProcessors, DocValuesMultiTest, TestChildDocTransformer, TestRawTransformer, TestSort, TestGroupingSearch, TestInfoStreamLogging, CoreAdminHandlerTest, DeleteReplicaTest, TestJettySolrRunner, TestSweetSpotSimilarityFactory, SaslZkACLProviderTest, TestSolrQueryParser, OverseerTest, BadIndexSchemaTest, HdfsWriteToMultipleCollectionsTest, TestMaxScoreQueryParser, TestTestInjection, SpatialHeatmapFacetsTest, LeaderElectionTest, TestFreeTextSuggestions, UnloadDistributedZkTest, TestPHPSerializedResponseWriter, SolrCoreCheckLockOnStartupTest, TestSerializedLuceneMatchVersion, ConfigSetsAPITest, TestSolrIndexConfig, DebugComponentTest, BinaryUpdateRequestHandlerTest, TestDistribIDF, TestReversedWildcardFilterFactory, BlockJoinFacetSimpleTest, TestConfigOverlay, SimpleFacetsTest, TestManagedResource, HdfsChaosMonkeySafeLeaderTest, TestManagedSchemaFieldTypeResource, RulesTest, TestZkChroot, TestPostingsSolrHighlighter, TestCSVResponseWriter, DateMathParserTest, AssignTest, TestBulkSchemaAPI, ZkStateReaderTest, TestCloudInspectUtil, SampleTest, HardAutoCommitTest, RestartWhileUpdatingTest, TestBulkSchemaConcurrent, ExitableDirectoryReaderTest, LukeRequestHandlerTest, DistributedFacetPivotLargeTest, TestRequestStatusCollectionAPI, TestJsonRequest, SuggesterTSTTest, TestReRankQParserPlugin, RecoveryAfterSoftCommitTest, SegmentsInfoRequestHandlerTest, OutOfBoxZkACLAndCredentialsProvidersTest, TestConfigSets, IgnoreCommitOptimizeUpdateProcessorFactoryTest, BitVectorTest, TestJmxIntegration, TestSearchPerf, TestTrackingShardHandlerFactory, TestUseDocValuesAsStored2, QueryParsingTest, SliceStateTest, SolrXmlInZkTest, TestSha256AuthenticationProvider, DirectUpdateHandlerTest, ShowFileRequestHandlerTest, NoCacheHeaderTest, TestXIncludeConfig, ScriptEngineTest, HdfsLockFactoryTest, TestAuthorizationFramework, RequestHandlersTest, BadComponentTest, TestSolrJ, CursorMarkTest, TestManagedSchemaAPI]
    [junit4] Completed [426/572 (1!)] on J2 in 13.94s, 1 test, 1 error <<< FAILURES!

[...truncated 486 lines...]
BUILD FAILED
/home/jenkins/workspace/Lucene-Solr-5.5-Linux/build.xml:750: The following error occurred while executing this line:
/home/jenkins/workspace/Lucene-Solr-5.5-Linux/build.xml:694: The following error occurred while executing this line:
/home/jenkins/workspace/Lucene-Solr-5.5-Linux/build.xml:59: The following error occurred while executing this line:
/home/jenkins/workspace/Lucene-Solr-5.5-Linux/solr/build.xml:233: The following error occurred while executing this line:
/home/jenkins/workspace/Lucene-Solr-5.5-Linux/solr/common-build.xml:534: The following error occurred while executing this line:
/home/jenkins/workspace/Lucene-Solr-5.5-Linux/lucene/common-build.xml:1477: The following error occurred while executing this line:
/home/jenkins/workspace/Lucene-Solr-5.5-Linux/lucene/common-build.xml:1033: There were test failures: 572 suites (7 ignored), 2303 tests, 1 error, 84 ignored (39 assumptions) [seed: FD031B74A0EC974]

Total time: 58 minutes 24 seconds
Build step 'Invoke Ant' marked build as failure
Archiving artifacts
[WARNINGS] Skipping publisher since build result is FAILURE
Recording test results
Email was triggered for: Failure - Any
Sending email for trigger: Failure - Any

Search Discussions

Related Discussions

Discussion Navigation
viewthread | post
posts ‹ prev | 1 of 1 | next ›
Discussion Overview
groupdev @
categorieslucene
postedJun 16, '16 at 11:00a
activeJun 16, '16 at 11:00a
posts1
users1
websitelucene.apache.org

1 user in discussion

Policeman Jenkins Server: 1 post

People

Translate

site design / logo © 2017 Grokbase